\relax 
\providecommand\hyper@newdestlabel[2]{}
\providecommand\HyperFirstAtBeginDocument{\AtBeginDocument}
\HyperFirstAtBeginDocument{\ifx\hyper@anchor\@undefined
\global\let\oldnewlabel\newlabel
\gdef\newlabel#1#2{\newlabelxx{#1}#2}
\gdef\newlabelxx#1#2#3#4#5#6{\oldnewlabel{#1}{{#2}{#3}}}
\AtEndDocument{\ifx\hyper@anchor\@undefined
\let\newlabel\oldnewlabel
\fi}
\fi}
\global\let\hyper@last\relax 
\gdef\HyperFirstAtBeginDocument#1{#1}
\providecommand\HyField@AuxAddToFields[1]{}
\providecommand\HyField@AuxAddToCoFields[2]{}
\providecommand\babel@aux[2]{}
\@nameuse{bbl@beforestart}
\catcode `"\active 
\catcode `<\active 
\catcode `>\active 
\@nameuse{es@quoting}
\citation{aires2018}
\citation{alkire2009}
\citation{escofier1994}
\babel@aux{spanish}{}
\@writefile{toc}{\contentsline {section}{\numberline {1}Introducci\'on}{1}{section.1}\protected@file@percent }
\citation{alkire2009}
\citation{alkire2018}
\citation{collicelli2000}
\citation{camardiel2000}
\citation{aires2018}
\citation{calvo2013}
\citation{colafranceschi2009}
\citation{collicelli2000}
\citation{nalbarte2014}
\citation{pages2015}
\citation{escofier1994}
\@writefile{toc}{\contentsline {section}{\numberline {2}Antecedentes}{2}{section.2}\protected@file@percent }
\citation{aires2020}
\citation{alkire2007}
\citation{nalbarte2014}
\citation{r2021}
\citation{wickham2019}
\citation{husson2008}
\citation{blanco2006}
\@writefile{toc}{\contentsline {section}{\numberline {3}Metodolog\'ia}{3}{section.3}\protected@file@percent }
\@writefile{toc}{\contentsline {subsection}{\numberline {3.1}Datos}{3}{subsection.3.1}\protected@file@percent }
\@writefile{toc}{\contentsline {subsection}{\numberline {3.2}An\'alisis Factorial}{3}{subsection.3.2}\protected@file@percent }
\citation{escofier1994}
\citation{pages2015}
\@writefile{toc}{\contentsline {subsection}{\numberline {3.3}An\'alisis Factorial M\'ultiple}{4}{subsection.3.3}\protected@file@percent }
\@writefile{toc}{\contentsline {subsubsection}{\numberline {3.3.1}AFM con variables cualitativas}{4}{subsubsection.3.3.1}\protected@file@percent }
\@writefile{toc}{\contentsline {subsubsection}{\numberline {3.3.2}Forma alternativa de ver el AFM}{4}{subsubsection.3.3.2}\protected@file@percent }
\citation{blanco2006}
\citation{aires2018}
\citation{alkire2009}
\citation{escofier1994}
\citation{alkire2009}
\citation{alkire2018}
\citation{collicelli2000}
\citation{camardiel2000}
\citation{aires2018}
\citation{calvo2013}
\citation{colafranceschi2009}
\citation{collicelli2000}
\citation{nalbarte2014}
\citation{pages2015}
\citation{escofier1994}
\citation{aires2020}
\citation{alkire2007}
\citation{nalbarte2014}
\citation{r2021}
\citation{wickham2019}
\citation{husson2008}
\citation{blanco2006}
\citation{escofier1994}
\citation{pages2015}
\citation{blanco2006}
\citation{nalbarte2014}
\citation{alkire2009}
\@writefile{toc}{\contentsline {section}{\numberline {4}Resultados}{5}{section.4}\protected@file@percent }
\@writefile{toc}{\contentsline {subsection}{\numberline {4.1}An\'alisis descriptivo inicial}{5}{subsection.4.1}\protected@file@percent }
\@writefile{toc}{\contentsline {subsection}{\numberline {8.2}C\'alculo del \'indice de pobreza multidimensional (IPM)}{5}{subsection.8.2}\protected@file@percent }
\@writefile{toc}{\contentsline {subsection}{\numberline {8.3}C\'alculo del \'indice de pobreza multidimensional (IPM): construcci\'on alternativa}{6}{subsection.8.3}\protected@file@percent }
\citation{alkire2009}
\citation{alkire2018}
\@writefile{toc}{\contentsline {subsection}{\numberline {8.4}An\'alisis descriptivo haciendo uso del \'indice}{7}{subsection.8.4}\protected@file@percent }
\@writefile{toc}{\contentsline {subsection}{\numberline {8.5}Puntos de corte del \'indice}{7}{subsection.8.5}\protected@file@percent }
\bibcite{aires2018}{1}
\bibcite{alkire2009}{2}
\bibcite{escofier1994}{3}
\bibcite{alkire2018}{4}
\bibcite{collicelli2000}{5}
\bibcite{camardiel2000}{6}
\bibcite{calvo2013}{7}
\@writefile{toc}{\contentsline {section}{\numberline {9}Conclusiones y consideraciones finales}{8}{section.9}\protected@file@percent }
\bibcite{colafranceschi2009}{8}
\bibcite{nalbarte2014}{9}
\bibcite{pages2015}{10}
\bibcite{aires2020}{11}
\bibcite{alkire2007}{12}
\bibcite{r2021}{13}
\bibcite{wickham2019}{14}
\bibcite{husson2008}{15}
\bibcite{blanco2006}{16}
\gdef \@abspage@last{9}
