\BOOKMARK [1][-]{section.1}{\376\377\000I\000n\000t\000r\000o\000d\000u\000c\000c\000i\000\363\000n}{}% 1
\BOOKMARK [1][-]{section.2}{\376\377\000A\000n\000t\000e\000c\000e\000d\000e\000n\000t\000e\000s}{}% 2
\BOOKMARK [1][-]{section.3}{\376\377\000M\000e\000t\000o\000d\000o\000l\000o\000g\000\355\000a}{}% 3
\BOOKMARK [2][-]{subsection.3.1}{\376\377\000D\000a\000t\000o\000s}{section.3}% 4
\BOOKMARK [2][-]{subsection.3.2}{\376\377\000A\000n\000\341\000l\000i\000s\000i\000s\000\040\000F\000a\000c\000t\000o\000r\000i\000a\000l}{section.3}% 5
\BOOKMARK [2][-]{subsection.3.3}{\376\377\000A\000n\000\341\000l\000i\000s\000i\000s\000\040\000F\000a\000c\000t\000o\000r\000i\000a\000l\000\040\000M\000\372\000l\000t\000i\000p\000l\000e}{section.3}% 6
\BOOKMARK [3][-]{subsubsection.3.3.1}{\376\377\000A\000F\000M\000\040\000c\000o\000n\000\040\000v\000a\000r\000i\000a\000b\000l\000e\000s\000\040\000c\000u\000a\000l\000i\000t\000a\000t\000i\000v\000a\000s}{subsection.3.3}% 7
\BOOKMARK [3][-]{subsubsection.3.3.2}{\376\377\000F\000o\000r\000m\000a\000\040\000a\000l\000t\000e\000r\000n\000a\000t\000i\000v\000a\000\040\000d\000e\000\040\000v\000e\000r\000\040\000e\000l\000\040\000A\000F\000M}{subsection.3.3}% 8
\BOOKMARK [1][-]{section.4}{\376\377\000R\000e\000s\000u\000l\000t\000a\000d\000o\000s}{}% 9
\BOOKMARK [2][-]{subsection.4.1}{\376\377\000A\000n\000\341\000l\000i\000s\000i\000s\000\040\000d\000e\000s\000c\000r\000i\000p\000t\000i\000v\000o\000\040\000i\000n\000i\000c\000i\000a\000l}{section.4}% 10
\BOOKMARK [2][-]{subsection.8.2}{\376\377\000C\000\341\000l\000c\000u\000l\000o\000\040\000d\000e\000l\000\040\000\355\000n\000d\000i\000c\000e\000\040\000d\000e\000\040\000p\000o\000b\000r\000e\000z\000a\000\040\000m\000u\000l\000t\000i\000d\000i\000m\000e\000n\000s\000i\000o\000n\000a\000l\000\040\000\050\000I\000P\000M\000\051}{section.8}% 21
\BOOKMARK [2][-]{subsection.8.3}{\376\377\000C\000\341\000l\000c\000u\000l\000o\000\040\000d\000e\000l\000\040\000\355\000n\000d\000i\000c\000e\000\040\000d\000e\000\040\000p\000o\000b\000r\000e\000z\000a\000\040\000m\000u\000l\000t\000i\000d\000i\000m\000e\000n\000s\000i\000o\000n\000a\000l\000\040\000\050\000I\000P\000M\000\051\000:\000\040\000c\000o\000n\000s\000t\000r\000u\000c\000c\000i\000\363\000n\000\040\000a\000l\000t\000e\000r\000n\000a\000t\000i\000v\000a}{section.8}% 22
\BOOKMARK [2][-]{subsection.8.4}{\376\377\000A\000n\000\341\000l\000i\000s\000i\000s\000\040\000d\000e\000s\000c\000r\000i\000p\000t\000i\000v\000o\000\040\000h\000a\000c\000i\000e\000n\000d\000o\000\040\000u\000s\000o\000\040\000d\000e\000l\000\040\000\355\000n\000d\000i\000c\000e}{section.8}% 23
\BOOKMARK [2][-]{subsection.8.5}{\376\377\000P\000u\000n\000t\000o\000s\000\040\000d\000e\000\040\000c\000o\000r\000t\000e\000\040\000d\000e\000l\000\040\000\355\000n\000d\000i\000c\000e}{section.8}% 24
\BOOKMARK [1][-]{section.9}{\376\377\000C\000o\000n\000c\000l\000u\000s\000i\000o\000n\000e\000s\000\040\000y\000\040\000c\000o\000n\000s\000i\000d\000e\000r\000a\000c\000i\000o\000n\000e\000s\000\040\000f\000i\000n\000a\000l\000e\000s}{}% 25
