{
	"info": {
		"_postman_id": "a09cb3e6-8a61-4425-9209-3ccf90b3d842",
		"name": "prova-eduardo_caetano-22212490075",
		"schema": "https://schema.getpostman.com/json/collection/v2.1.0/collection.json",
		"_exporter_id": "19210355",
		"_collection_link": "https://universal-comet-358417.postman.co/workspace/Faculdade-IESB~18864b63-7f35-4a29-9e78-3f47f03370b6/collection/19210355-a09cb3e6-8a61-4425-9209-3ccf90b3d842?action=share&source=collection_link&creator=19210355"
	},
	"item": [
		{
			"name": "buscarColaboradores",
			"request": {
				"method": "GET",
				"header": [],
				"url": {
					"raw": "{{baseURL}}/colaboradores",
					"host": [
						"{{baseURL}}"
					],
					"path": [
						"colaboradores"
					]
				}
			},
			"response": []
		},
		{
			"name": "buscarColaboradorCargo",
			"request": {
				"method": "GET",
				"header": [],
				"url": {
					"raw": "{{baseURL}}/colaboradores/Tecnico",
					"host": [
						"{{baseURL}}"
					],
					"path": [
						"colaboradores",
						"Tecnico"
					]
				}
			},
			"response": []
		},
		{
			"name": "createColaborador",
			"request": {
				"method": "POST",
				"header": [],
				"body": {
					"mode": "raw",
					"raw": "{\n  \"tipoPessoa\": \"PF\",\n  \"nome\": \"João da Silva\",\n  \"salario\": 2000,\n  \"cpf\": \"123.456.789-01\",\n  \"sexo\": \"M\",\n  \"cargo\": \"Gerente\"\n}",
					"options": {
						"raw": {
							"language": "json"
						}
					}
				},
				"url": {
					"raw": "{{baseURL}}/colaborador",
					"host": [
						"{{baseURL}}"
					],
					"path": [
						"colaborador"
					]
				}
			},
			"response": []
		},
		{
			"name": "colaboradorReajuste",
			"request": {
				"method": "PUT",
				"header": [],
				"body": {
					"mode": "raw",
					"raw": "{\n    \"percentual\": 50\n}",
					"options": {
						"raw": {
							"language": "json"
						}
					}
				},
				"url": {
					"raw": "{{baseURL}}/colaborador/{{id}}/reajuste",
					"host": [
						"{{baseURL}}"
					],
					"path": [
						"colaborador",
						"{{id}}",
						"reajuste"
					]
				}
			},
			"response": []
		}
	],
	"event": [
		{
			"listen": "prerequest",
			"script": {
				"type": "text/javascript",
				"packages": {},
				"exec": [
					""
				]
			}
		},
		{
			"listen": "test",
			"script": {
				"type": "text/javascript",
				"packages": {},
				"exec": [
					""
				]
			}
		}
	],
	"variable": [
		{
			"key": "baseURL",
			"value": "http://localhost:3000",
			"type": "string"
		},
		{
			"key": "id",
			"value": "662060b3f8fce5533e01dc3c"
		}
	]
}