# Fdb version 3
["pdflatex"] 1645552101 "/home/fer/Proyectos/CESUR/Lenguaje-de-marcas/ejercicios/latex/ejercicio1/index.tex" "/home/fer/Proyectos/CESUR/Lenguaje-de-marcas/ejercicios/latex/ejercicio1/index.pdf" "index" 1645552101
  "/etc/texmf/web2c/texmf.cnf" 1645551951 475 c0e671620eb5563b2130f56340a5fde8 ""
  "/home/fer/Proyectos/CESUR/Lenguaje-de-marcas/ejercicios/latex/ejercicio1/index.aux" 1645552101 8 a94a2480d3289e625eea47cd1b285758 ""
  "/home/fer/Proyectos/CESUR/Lenguaje-de-marcas/ejercicios/latex/ejercicio1/index.tex" 1645551811 405 ccad2436d57116afd1077c3caabb0bfe ""
  "/usr/share/texlive/texmf-dist/fonts/tfm/public/cm/cmmi12.tfm" 1136768653 1524 4414a8315f39513458b80dfc63bff03a ""
  "/usr/share/texlive/texmf-dist/fonts/tfm/public/cm/cmr12.tfm" 1136768653 1288 655e228510b4c2a1abe905c368440826 ""
  "/usr/share/texlive/texmf-dist/fonts/tfm/public/cm/cmr17.tfm" 1136768653 1292 296a67155bdbfc32aa9c636f21e91433 ""
  "/usr/share/texlive/texmf-dist/fonts/tfm/public/cm/cmsy10.tfm" 1136768653 1124 6c73e740cf17375f03eec0ee63599741 ""
  "/usr/share/texlive/texmf-dist/fonts/type1/public/amsfonts/cm/cmr12.pfb" 1248133631 32722 d7379af29a190c3f453aba36302ff5a9 ""
  "/usr/share/texlive/texmf-dist/fonts/type1/public/amsfonts/cm/cmr17.pfb" 1248133631 32362 179c33bbf43f19adbb3825bb4e36e57a ""
  "/usr/share/texlive/texmf-dist/tex/latex/base/article.cls" 1580683321 20023 e427dd9e17e239bf926ef3aab67fe35e ""
  "/usr/share/texlive/texmf-dist/tex/latex/base/inputenc.sty" 1580683321 5050 8933a39ad74377accd18991c5eb90c58 ""
  "/usr/share/texlive/texmf-dist/tex/latex/base/size12.clo" 1580683321 8447 5c4b8ee712f8e349df2722115bc8c513 ""
  "/usr/share/texlive/texmf-dist/tex/latex/l3backend/l3backend-pdfmode.def" 1580854751 25404 9d60f463a00d154207ec0048dee27cf0 ""
  "/usr/share/texlive/texmf-dist/web2c/texmf.cnf" 1581979058 38841 ce3692aa899bb693b90b87eaa5d4d84e ""
  "/usr/share/texmf/web2c/texmf.cnf" 1581979058 38841 ce3692aa899bb693b90b87eaa5d4d84e ""
  "/var/lib/texmf/fonts/map/pdftex/updmap/pdftex.map" 1645551962 125915 807ff72f6023b33a59c427bfd156a3d1 ""
  "/var/lib/texmf/web2c/pdftex/pdflatex.fmt" 1645551968 4791332 574fb633b9b4ad706b871eae7b88e19b ""
  "index.aux" 1645552101 8 a94a2480d3289e625eea47cd1b285758 "pdflatex"
  "index.tex" 1645551811 405 ccad2436d57116afd1077c3caabb0bfe ""
  (generated)
  "/home/fer/Proyectos/CESUR/Lenguaje-de-marcas/ejercicios/latex/ejercicio1/index.log"
  "/home/fer/Proyectos/CESUR/Lenguaje-de-marcas/ejercicios/latex/ejercicio1/index.pdf"
  "index.aux"
  "index.pdf"
  "index.log"
