{
	"compilerOptions": {
		"baseUrl": "src",
		"paths": {
			"*": ["src/*"],
			"assets": ["src/assets"],
			"RComponents": ["src/components/RComponents"],
			"global": ["src/components/Global"]
		}
	},
	"include": ["src"]
}
