<svg xmlns="http://www.w3.org/2000/svg" width="26" height="59" viewBox="0 0 26 59" fill="none">
<path d="M0 0H26V59L13 45.5L0 59V0Z" fill="url(#paint0_linear_3073_113010)"/>
<defs>
<linearGradient id="paint0_linear_3073_113010" x1="13" y1="0" x2="13" y2="59" gradientUnits="userSpaceOnUse">
<stop stop-color="#00C9FF"/>
<stop offset="1" stop-color="#1770AB"/>
</linearGradient>
</defs>
</svg>