{
    "status": 1,
    "code": 202,
    "msg": "success",
    "data": {
        "recentLessons": [
            {
                "_id": "65bf4848f2ac31b24f069edd",
                "name": "course1",
                "parent_id": null,
                "creator_id": 1105,
                "learning_object_id": 1810,
                "organization_id": 247,
                "image_id": null,
                "icon_id": null,
                "cohort_id": 567,
                "date_Synchronized": "2024-02-04 07:47:19",
                "is_master": false,
                "is_published": 1,
                "color": "#a5bcee",
                "credits": null,
                "code": null,
                "updated_at": "2024-02-04T08:18:16.895000Z",
                "created_at": "2024-02-04T08:18:13.000000Z",
                "id": 1563,
                "category_id": null,
                "course_id": 1563,
                "term_id": 82,
                "curriculum_id": 337,
                "extra": {
                    "id": 340,
                    "synchronous": 0,
                    "isFree": 0,
                    "closed": 0,
                    "isOneDayCourse": 0,
                    "start_date": null,
                    "end_date": null,
                    "course_id": 1560,
                    "numberOfHours": null,
                    "created_at": "2024-02-04T07:47:19.000000Z",
                    "updated_at": "2024-02-04T07:47:19.000000Z",
                    "comingSoon": 0,
                    "language": [],
                    "isOnline": 0,
                    "isPrivate": 0
                },
                "is_cloned": true,
                "isEnrolled": true,
                "nextLesson": {
                    "id": 1277,
                    "subject": "lesson7",
                    "lesson_date": "2024-02-07 19:33:00",
                    "end_date": "2024-02-07 17:37:00",
                    "lesson_order": 1,
                    "lesson_time": "19:33:00",
                    "published": 0,
                    "module_id": 118,
                    "lesson_plan_id": null,
                    "creator_id": 1110,
                    "created_at": "2024-02-07T08:33:59.000000Z",
                    "updated_at": "2024-02-07T08:33:59.000000Z",
                    "livesession": null
                },
                "todayOrTommorrowLessons": [
                    {
                        "id": 1277,
                        "subject": "lesson7",
                        "lesson_date": "2024-02-07 19:33:00",
                        "end_date": "2024-02-07 17:37:00",
                        "lesson_order": 1,
                        "lesson_time": "19:33:00",
                        "published": 0,
                        "module_id": 118,
                        "lesson_plan_id": null,
                        "creator_id": 1110,
                        "created_at": "2024-02-07T08:33:59.000000Z",
                        "updated_at": "2024-02-07T08:33:59.000000Z",
                        "unpublishedContents": []
                    }
                ],
                "progress": 0,
                "curriculum_name": "default Curricula",
                "grade_level_name": "gl1",
                "main_course_name": "General"
            },
            {
                "_id": "65bf489bf2ac31b24f069ede",
                "name": "course2",
                "parent_id": null,
                "creator_id": 1105,
                "learning_object_id": 1811,
                "organization_id": 247,
                "image_id": null,
                "icon_id": null,
                "cohort_id": 568,
                "date_Synchronized": "2024-02-04 07:47:37",
                "is_master": false,
                "is_published": 1,
                "color": "#a5bcee",
                "credits": null,
                "code": null,
                "updated_at": "2024-02-04T08:19:40.068000Z",
                "created_at": "2024-02-04T08:19:37.000000Z",
                "id": 1564,
                "category_id": 127,
                "course_id": 1564,
                "term_id": 82,
                "curriculum_id": 337,
                "extra": {
                    "id": 341,
                    "synchronous": 0,
                    "isFree": 0,
                    "closed": 0,
                    "isOneDayCourse": 0,
                    "start_date": null,
                    "end_date": null,
                    "course_id": 1561,
                    "numberOfHours": null,
                    "created_at": "2024-02-04T07:47:37.000000Z",
                    "updated_at": "2024-02-04T07:47:37.000000Z",
                    "comingSoon": 0,
                    "language": [],
                    "isOnline": 0,
                    "isPrivate": 0
                },
                "is_cloned": true,
                "isEnrolled": true,
                "nextLesson": {
                    "id": 1279,
                    "subject": "lesson7-22",
                    "lesson_date": "2024-02-07 18:43:00",
                    "end_date": "2024-02-07 20:45:00",
                    "lesson_order": 2,
                    "lesson_time": "18:43:00",
                    "published": 0,
                    "module_id": 119,
                    "lesson_plan_id": null,
                    "creator_id": 1110,
                    "created_at": "2024-02-07T10:39:16.000000Z",
                    "updated_at": "2024-02-07T10:39:16.000000Z",
                    "livesession": null
                },
                "todayOrTommorrowLessons": [
                    {
                        "id": 1279,
                        "subject": "lesson7-22",
                        "lesson_date": "2024-02-07 18:43:00",
                        "end_date": "2024-02-07 20:45:00",
                        "lesson_order": 2,
                        "lesson_time": "18:43:00",
                        "published": 0,
                        "module_id": 119,
                        "lesson_plan_id": null,
                        "creator_id": 1110,
                        "created_at": "2024-02-07T10:39:16.000000Z",
                        "updated_at": "2024-02-07T10:39:16.000000Z",
                        "unpublishedContents": [
                            {
                                "id": 42,
                                "name": "school.jpg",
                                "type": "attachment",
                                "lesson_id": 1279,
                                "learning_object_id": 1892,
                                "created_at": "2024-02-07T11:19:57.000000Z",
                                "updated_at": "2024-02-07T11:19:58.000000Z",
                                "order": 1,
                                "mime_type": "image\/jpeg",
                                "is_published": 0,
                                "link": null,
                                "attachment": {
                                    "id": 5,
                                    "file_name": "school.jpg",
                                    "lesson_content_id": 42,
                                    "created_at": "2024-02-07T11:19:57.000000Z",
                                    "updated_at": "2024-02-07T11:19:57.000000Z",
                                    "url": "ovwqpyxekmjawdygbzrgdvlon"
                                },
                                "text": null
                            },
                            {
                                "id": 43,
                                "name": null,
                                "type": "link",
                                "lesson_id": 1279,
                                "learning_object_id": 1893,
                                "created_at": "2024-02-07T11:20:22.000000Z",
                                "updated_at": "2024-02-07T11:51:08.000000Z",
                                "order": 1,
                                "mime_type": null,
                                "is_published": 0,
                                "link": {
                                    "id": 11,
                                    "link_title": "",
                                    "link_url": "",
                                    "lesson_content_id": 43,
                                    "created_at": "2024-02-07T11:20:22.000000Z",
                                    "updated_at": "2024-02-07T11:51:08.000000Z"
                                },
                                "attachment": null,
                                "text": null
                            },
                            {
                                "id": 45,
                                "name": "56fdbf70-d073-4e48-afb4-2ccb38c08762.csv",
                                "type": "attachment",
                                "lesson_id": 1279,
                                "learning_object_id": 1895,
                                "created_at": "2024-02-07T11:52:15.000000Z",
                                "updated_at": "2024-02-07T11:52:16.000000Z",
                                "order": 1,
                                "mime_type": "text\/csv",
                                "is_published": 0,
                                "link": null,
                                "attachment": {
                                    "id": 6,
                                    "file_name": "56fdbf70-d073-4e48-afb4-2ccb38c08762.csv",
                                    "lesson_content_id": 45,
                                    "created_at": "2024-02-07T11:52:15.000000Z",
                                    "updated_at": "2024-02-07T11:52:15.000000Z",
                                    "url": "pggjwondxepayzekblzrmykvq"
                                },
                                "text": null
                            },
                            {
                                "id": 46,
                                "name": ".azDownload-62a61828-1d37-e544-6039-fcadc0a10b9f-6c144828-284d-40da-964a-9e5563ddb8b3.csv",
                                "type": "attachment",
                                "lesson_id": 1279,
                                "learning_object_id": 1896,
                                "created_at": "2024-02-07T11:52:47.000000Z",
                                "updated_at": "2024-02-07T11:52:47.000000Z",
                                "order": 1,
                                "mime_type": "text\/csv",
                                "is_published": 0,
                                "link": null,
                                "attachment": {
                                    "id": 7,
                                    "file_name": ".azDownload-62a61828-1d37-e544-6039-fcadc0a10b9f-6c144828-284d-40da-964a-9e5563ddb8b3.csv",
                                    "lesson_content_id": 46,
                                    "created_at": "2024-02-07T11:52:47.000000Z",
                                    "updated_at": "2024-02-07T11:52:47.000000Z",
                                    "url": "nxopxjdmlknbdwddaewgvyqrz"
                                },
                                "text": null
                            },
                            {
                                "id": 44,
                                "name": null,
                                "type": "text",
                                "lesson_id": 1279,
                                "learning_object_id": 1894,
                                "created_at": "2024-02-07T11:20:31.000000Z",
                                "updated_at": "2024-02-07T11:51:15.000000Z",
                                "order": 3,
                                "mime_type": null,
                                "is_published": 0,
                                "link": null,
                                "attachment": null,
                                "text": {
                                    "id": 15,
                                    "text": "",
                                    "lesson_content_id": 44,
                                    "created_at": "2024-02-07T11:20:31.000000Z",
                                    "updated_at": "2024-02-07T11:51:22.000000Z"
                                }
                            }
                        ]
                    },
                    {
                        "id": 1278,
                        "subject": "lesson7-2",
                        "lesson_date": "2024-02-07 18:40:00",
                        "end_date": "2024-02-07 08:40:00",
                        "lesson_order": 1,
                        "lesson_time": "18:40:00",
                        "published": 0,
                        "module_id": 119,
                        "lesson_plan_id": null,
                        "creator_id": 1110,
                        "created_at": "2024-02-07T08:40:31.000000Z",
                        "updated_at": "2024-02-07T08:40:31.000000Z",
                        "unpublishedContents": [
                            {
                                "id": 40,
                                "name": "lesson7-2",
                                "type": "live_session",
                                "lesson_id": 1278,
                                "learning_object_id": 1885,
                                "created_at": "2024-02-07T10:38:16.000000Z",
                                "updated_at": "2024-02-07T10:38:20.000000Z",
                                "order": 1,
                                "mime_type": null,
                                "is_published": 0,
                                "link": null,
                                "attachment": null,
                                "text": null
                            }
                        ]
                    }
                ],
                "progress": 0,
                "curriculum_name": "default Curricula",
                "grade_level_name": "gl1",
                "main_course_name": "General"
            },
            {
                "_id": "65bf48a3f2ac31b24f069ee0",
                "name": "course3",
                "parent_id": null,
                "creator_id": 1105,
                "learning_object_id": 1812,
                "organization_id": 247,
                "image_id": null,
                "icon_id": null,
                "cohort_id": 569,
                "date_Synchronized": "2024-02-04 07:47:49",
                "is_master": false,
                "is_published": 1,
                "color": "#a5bcee",
                "credits": null,
                "code": null,
                "updated_at": "2024-02-04T08:19:47.946000Z",
                "created_at": "2024-02-04T08:19:45.000000Z",
                "id": 1565,
                "category_id": 127,
                "course_id": 1565,
                "term_id": 82,
                "curriculum_id": 337,
                "extra": {
                    "id": 342,
                    "synchronous": 0,
                    "isFree": 0,
                    "closed": 0,
                    "isOneDayCourse": 0,
                    "start_date": null,
                    "end_date": null,
                    "course_id": 1562,
                    "numberOfHours": null,
                    "created_at": "2024-02-04T07:47:49.000000Z",
                    "updated_at": "2024-02-04T07:47:49.000000Z",
                    "comingSoon": 0,
                    "language": [],
                    "isOnline": 0,
                    "isPrivate": 0
                },
                "is_cloned": true,
                "isEnrolled": true,
                "nextLesson": {
                    "id": 1280,
                    "subject": "lesson7-3",
                    "lesson_date": "2024-02-07 19:45:00",
                    "end_date": "2024-02-07 20:45:00",
                    "lesson_order": 1,
                    "lesson_time": "19:45:00",
                    "published": 0,
                    "module_id": 120,
                    "lesson_plan_id": null,
                    "creator_id": 1110,
                    "created_at": "2024-02-07T10:40:43.000000Z",
                    "updated_at": "2024-02-07T10:40:43.000000Z",
                    "livesession": {
                        "id": 41,
                        "name": "lesson7-3",
                        "type": "live_session",
                        "lesson_id": 1280,
                        "learning_object_id": 1889,
                        "created_at": "2024-02-07T10:40:55.000000Z",
                        "updated_at": "2024-02-07T10:40:57.000000Z",
                        "order": 1,
                        "mime_type": null,
                        "is_published": 0,
                        "lesson": null,
                        "live_session": {
                            "id": 12,
                            "lesson_content_id": 41,
                            "meeting_id": 118,
                            "created_at": "2024-02-07T10:40:55.000000Z",
                            "updated_at": "2024-02-07T10:40:57.000000Z",
                            "schedule_time": "2024-02-07 19:45:00",
                            "recordings": []
                        }
                    }
                },
                "todayOrTommorrowLessons": [
                    {
                        "id": 1280,
                        "subject": "lesson7-3",
                        "lesson_date": "2024-02-07 19:45:00",
                        "end_date": "2024-02-07 20:45:00",
                        "lesson_order": 1,
                        "lesson_time": "19:45:00",
                        "published": 0,
                        "module_id": 120,
                        "lesson_plan_id": null,
                        "creator_id": 1110,
                        "created_at": "2024-02-07T10:40:43.000000Z",
                        "updated_at": "2024-02-07T10:40:43.000000Z",
                        "unpublishedContents": [
                            {
                                "id": 41,
                                "name": "lesson7-3",
                                "type": "live_session",
                                "lesson_id": 1280,
                                "learning_object_id": 1889,
                                "created_at": "2024-02-07T10:40:55.000000Z",
                                "updated_at": "2024-02-07T10:40:57.000000Z",
                                "order": 1,
                                "mime_type": null,
                                "is_published": 0,
                                "link": null,
                                "attachment": null,
                                "text": null
                            }
                        ]
                    }
                ],
                "progress": 0,
                "curriculum_name": "default Curricula",
                "grade_level_name": "gl1",
                "main_course_name": "General"
            }
        ],
        "all": [
            {
                "_id": "65bf50e2f2ac31b24f069ee9",
                "name": "course_mst1",
                "code": null,
                "credits": null,
                "color": "#a5bcee",
                "creator_id": "1105",
                "organization_id": "247",
                "is_master": true,
                "date_Synchronized": [],
                "updated_at": "2024-02-06T12:13:21.851000Z",
                "created_at": "2024-02-04T08:54:55.000000Z",
                "id": 1567,
                "image_id": null,
                "icon_id": null,
                "cohort_id": 575,
                "category_id": null,
                "level_ids": [],
                "extra": {
                    "synchronous": false,
                    "isFree": false,
                    "closed": false,
                    "isOneDayCourse": false,
                    "comingSoon": false,
                    "language": [],
                    "isOnline": false,
                    "numberOfHours": null,
                    "isPrivate": false,
                    "start_date": null,
                    "end_date": null
                },
                "tags": [],
                "users": [],
                "learning_object_id": 1829,
                "overview": {
                    "description": null,
                    "course_id": 1567,
                    "updated_at": "2024-02-04T08:55:00.000000Z",
                    "created_at": "2024-02-04T08:55:00.000000Z",
                    "id": 233,
                    "schedule": [],
                    "requirements": [],
                    "previous_knowledge": [],
                    "faq": [],
                    "who_is_this_course_for": [],
                    "what_you_will_learn": [],
                    "contents": []
                },
                "is_published": true,
                "isEnrolled": true,
                "nextLesson": null,
                "todayOrTommorrowLessons": [],
                "progress": 0
            }
        ],
        "recentTasks": {
            "outDatedTasks": [
                {
                    "id": 13,
                    "canContinue": false,
                    "maxAttemptsAllowed": 1,
                    "passRequired": true,
                    "autoGrade": true,
                    "isDefault": true,
                    "percentagePassingGrade": 0,
                    "randomizeQuestionOrders": 0,
                    "startDate": null,
                    "endDate": null,
                    "created_at": "2024-02-04T05:34:51.326Z",
                    "updated_at": "2024-02-04T05:34:51.326Z",
                    "isClosed": false,
                    "quiz": {
                        "id": 1027,
                        "name": "",
                        "description": "<p>sdf gsdf sd sdf g<\/p>",
                        "files": [],
                        "is_published": true,
                        "questionsCount": 1,
                        "points": 1,
                        "created_at": "2024-02-04T05:34:49.221Z",
                        "updated_at": "2024-02-04T05:34:49.221Z"
                    },
                    "module": {
                        "id": 103,
                        "title": "module1",
                        "order": 1,
                        "course": {
                            "id": 1563,
                            "name": "course1"
                        }
                    },
                    "type": "quizzes"
                },
                {
                    "id": 25,
                    "maximumLearnersAllowed": 200,
                    "passRequired": true,
                    "autoGrade": true,
                    "percentagePassingGrade": 0,
                    "randomizeQuestionOrders": 1,
                    "dueDate": "2024-02-06T14:39:00.000Z",
                    "cutoffDate": "2024-02-06T19:40:00.000Z",
                    "isDefault": false,
                    "created_at": "2024-02-06T05:26:10.453Z",
                    "updated_at": "2024-02-06T05:34:28.000Z",
                    "isClosed": false,
                    "assignment": {
                        "id": 66,
                        "name": "ass1",
                        "description": "<p>ass1<\/p>",
                        "points": 1,
                        "files": [],
                        "questionsCount": 1,
                        "is_published": true,
                        "created_at": "2024-02-06T05:26:08.553Z",
                        "updated_at": "2024-02-06T05:26:08.553Z"
                    },
                    "module": {
                        "id": 110,
                        "title": "modul2",
                        "order": 2,
                        "course": {
                            "id": 1563,
                            "name": "course1"
                        }
                    },
                    "type": "assignments"
                },
                {
                    "id": 16,
                    "canContinue": false,
                    "maxAttemptsAllowed": 1,
                    "passRequired": true,
                    "autoGrade": true,
                    "isDefault": false,
                    "percentagePassingGrade": 0,
                    "randomizeQuestionOrders": 0,
                    "startDate": "2024-02-06T02:40:00.000Z",
                    "endDate": "2024-02-06T03:00:00.000Z",
                    "created_at": "2024-02-06T05:26:53.615Z",
                    "updated_at": "2024-02-06T05:34:44.000Z",
                    "isClosed": false,
                    "quiz": {
                        "id": 1033,
                        "name": "Exmam1",
                        "description": "<p>Exmam1<\/p>",
                        "files": [],
                        "is_published": true,
                        "questionsCount": 1,
                        "points": 1,
                        "created_at": "2024-02-06T05:26:52.086Z",
                        "updated_at": "2024-02-06T05:29:06.000Z"
                    },
                    "module": {
                        "id": 110,
                        "title": "modul2",
                        "order": 2,
                        "course": {
                            "id": 1563,
                            "name": "course1"
                        }
                    },
                    "type": "quizzes"
                }
            ],
            "activeTasks": [],
            "allTasksCount": 10
        },
        "recentlyAddedContent": [
            {
                "id": 42,
                "name": "school.jpg",
                "type": "attachment",
                "lesson_id": 1279,
                "learning_object_id": 1892,
                "created_at": "2024-02-07T11:19:57.000000Z",
                "updated_at": "2024-02-07T11:19:58.000000Z",
                "order": 1,
                "mime_type": "image\/jpeg",
                "is_published": 0,
                "module_id": 119,
                "link": null,
                "attachment": {
                    "id": 5,
                    "file_name": "school.jpg",
                    "lesson_content_id": 42,
                    "created_at": "2024-02-07T11:19:57.000000Z",
                    "updated_at": "2024-02-07T11:19:57.000000Z",
                    "url": "ovwqpyxekmjawdygbzrgdvlon"
                },
                "text": null,
                "lesson": null,
                "course_id": 1564
            },
            {
                "id": 43,
                "name": null,
                "type": "link",
                "lesson_id": 1279,
                "learning_object_id": 1893,
                "created_at": "2024-02-07T11:20:22.000000Z",
                "updated_at": "2024-02-07T11:51:08.000000Z",
                "order": 1,
                "mime_type": null,
                "is_published": 0,
                "module_id": 119,
                "link": {
                    "id": 11,
                    "link_title": "",
                    "link_url": "",
                    "lesson_content_id": 43,
                    "created_at": "2024-02-07T11:20:22.000000Z",
                    "updated_at": "2024-02-07T11:51:08.000000Z"
                },
                "attachment": null,
                "text": null,
                "lesson": null,
                "course_id": 1564
            },
            {
                "id": 45,
                "name": "56fdbf70-d073-4e48-afb4-2ccb38c08762.csv",
                "type": "attachment",
                "lesson_id": 1279,
                "learning_object_id": 1895,
                "created_at": "2024-02-07T11:52:15.000000Z",
                "updated_at": "2024-02-07T11:52:16.000000Z",
                "order": 1,
                "mime_type": "text\/csv",
                "is_published": 0,
                "module_id": 119,
                "link": null,
                "attachment": {
                    "id": 6,
                    "file_name": "56fdbf70-d073-4e48-afb4-2ccb38c08762.csv",
                    "lesson_content_id": 45,
                    "created_at": "2024-02-07T11:52:15.000000Z",
                    "updated_at": "2024-02-07T11:52:15.000000Z",
                    "url": "pggjwondxepayzekblzrmykvq"
                },
                "text": null,
                "lesson": null,
                "course_id": 1564
            },
            {
                "id": 46,
                "name": ".azDownload-62a61828-1d37-e544-6039-fcadc0a10b9f-6c144828-284d-40da-964a-9e5563ddb8b3.csv",
                "type": "attachment",
                "lesson_id": 1279,
                "learning_object_id": 1896,
                "created_at": "2024-02-07T11:52:47.000000Z",
                "updated_at": "2024-02-07T11:52:47.000000Z",
                "order": 1,
                "mime_type": "text\/csv",
                "is_published": 0,
                "module_id": 119,
                "link": null,
                "attachment": {
                    "id": 7,
                    "file_name": ".azDownload-62a61828-1d37-e544-6039-fcadc0a10b9f-6c144828-284d-40da-964a-9e5563ddb8b3.csv",
                    "lesson_content_id": 46,
                    "created_at": "2024-02-07T11:52:47.000000Z",
                    "updated_at": "2024-02-07T11:52:47.000000Z",
                    "url": "nxopxjdmlknbdwddaewgvyqrz"
                },
                "text": null,
                "lesson": null,
                "course_id": 1564
            },
            {
                "id": 44,
                "name": null,
                "type": "text",
                "lesson_id": 1279,
                "learning_object_id": 1894,
                "created_at": "2024-02-07T11:20:31.000000Z",
                "updated_at": "2024-02-07T11:51:15.000000Z",
                "order": 3,
                "mime_type": null,
                "is_published": 0,
                "module_id": 119,
                "link": null,
                "attachment": null,
                "text": {
                    "id": 15,
                    "text": "",
                    "lesson_content_id": 44,
                    "created_at": "2024-02-07T11:20:31.000000Z",
                    "updated_at": "2024-02-07T11:51:22.000000Z"
                },
                "lesson": null,
                "course_id": 1564
            }
        ],
        "statistics": {
            "community": {
                "type": "community",
                "title": "Community",
                "value": "0 Posts"
            },
            "chats": {
                "type": "Chats",
                "title": "chats",
                "value": "0 Unread Messages"
            },
            "calendar": {
                "type": "calendar",
                "title": "Calendar",
                "value": "0 Events"
            }
        }
    }
}