<svg xmlns="http://www.w3.org/2000/svg" width="11" height="12" viewBox="0 0 11 12" fill="none">
  <g clip-path="url(#clip0_13323_19054)">
    <path d="M10.1571 4.875H6.81429V1.5C6.81429 1.08586 6.48162 0.75 6.07143 0.75H5.32857C4.91837 0.75 4.58571 1.08586 4.58571 1.5V4.875H1.24286C0.832661 4.875 0.5 5.21086 0.5 5.625V6.375C0.5 6.78914 0.832661 7.125 1.24286 7.125H4.58571V10.5C4.58571 10.9141 4.91837 11.25 5.32857 11.25H6.07143C6.48162 11.25 6.81429 10.9141 6.81429 10.5V7.125H10.1571C10.5673 7.125 10.9 6.78914 10.9 6.375V5.625C10.9 5.21086 10.5673 4.875 10.1571 4.875Z" fill="#668AD7"/>
  </g>
  <defs>
    <clipPath id="clip0_13323_19054">
      <rect width="10.4" height="12" fill="white" transform="translate(0.5)"/>
    </clipPath>
  </defs>
</svg>