{
	"Global": {
		"a": {
			"are you sure to remove points from this rubric?": "Are you sure to remove points from this rubric?",
			"are you sure to make this rubric pointed?": "Are you sure to make this rubric pointed?",
			"are_you_sure_you_want_to_delete": "Are You Sure You Want To Delete",
			"add_tag": "Add Tag",
			"assign_tag": "Assign Tag",
			"add_a_password": "Add A Password",
			"allow_downloads": "Allow Downloads",
			"author": "Author",
			"Assign_Permissions": "Assign Permissions",
			"Assign_Roles": "Assign Roles",
			"Add_Members": "Add Members",
			"add_to_favorite": "Add To Favorite",
			"add_agreement": "Add Agreement",
			"add_level": "Add Level",
			"add_new_discount": "Add New Discount",
			"apply_both": "Apply Both",
			"apply_the_bigger_amount": "Apply The Bigger Amount",
			"add_new_coupon": "Add New Coupon",
			"assigned_to": "Assigned To",
			"apply": "Apply",
			"Are_you_sure_to_delete": "Are you sure to delete",
			"admin": "Admin",
			"Add_to_group": "Add To Group",
			"Attendance": "Attendance",
			"add_courses": "Add Courses",
			"all_grade_levels": "All Grade Levels",
			"Add_Program": "Add Program",
			"Alternatives_To": "Alternatives To",
			"Add_Alternative": "Add Alternative",
			"academic_year": "Academic Year",
			"add_term": "Add Term",
			"Add_another_user_type": "add another user type",
			"add_curriculum": "Add Curriculum",
			"add_academic_year": "Add Academic Year",
			"add terms": "Add Terms",
			"Are_you_sure_you_want_to_delete": "Are you sure you want to delete",
			"all your grade levels are here. go ahead !": "All your grade levels are here. go ahead !",
			"add_home_room": "Add Home Room",
			"apply_changes": "Apply Changes",
			"a_lesson_plan": "A Lesson Plan",
			"Attendance_settings": "Attendance Settings",
			"a_rubric": "A Rubric",
			"add_description": "Add Description",
			"add_new_assignments": "Add New Assignments",
			"Add_another_level": "Add Another Level",
			"Alphabetically": "Alphabetically",
			"add_new_quizzes": "Add New Quizzes",
			"add_new_exams": "Add New Exams",
			"add_new_surveys": "Add New Surveys",
			"Are_you_sure_you_want_to_remove": "Are you sure you want to remove",
			"add_new_polls": "Add New Polls",
			"add_option": "Add Option",
			"add_to_cart": "Add To Cart",
			"apply_filters": "Apply Filters",
			"about_facilitator": "About Facilitator",
			"Accelerate learning with one-day courses that takes only some hours": "Accelerate learning with one-day courses that takes only some hours",
			"all_categories": "All Categories",
			"add_new_badge": "Add New Badge",
			"already_have_an_account": "Already have an account",
			"add_content": "Add Content",
			"add_teaching_elements": "Add Teaching Elements",
			"and start building the course content": "And start building the course content",
			"all_module": "All Module",
			"Are_you_sure_you_want_to_deactivate": "Are you sure you want to deactivate",
			"add_new_question": "Add New Question",
			"add_new_facilitator": "Add New Facilitator",
			"About the facilitator": "About The Facilitator",
			"add_permissions": "Add Permissions",
			"add_users": "Add Users",
			"add_role": "Add Role",
			"add_from_existing": "Add From Existing",
			"add_extra_props": "Add Extra Props",
			"add_permission_to_user": "Add Permission To User",
			"Add_Education_Stage": "Add Education Stage",
			"add_role_to_user": "Add Role To User",
			"add_principal": "Add Principal",
			"add_book": "Add Book",
			"add_a_book": "Add A Book",
			"add_from_users": "Add From Users",
			"add_item": "Add Item",
			"add_unit_plan": "Add Unit Plan",
			"add_file_content": "Add File Content_$",
			"add_link_content": "Add Link Content_$",
			"add_text_content": "Add Text Content_$",
			"add_credit": "add_credit_$",
			"add_course": "Add Course_$",
			"add_new_child": "Add New Child_$",
			"Assessment Plan Name": "Assessment Plan Name_$",
			"Assign Pattern Random": "Assign Pattern Random_$",
			"All": "الكل",
			"add from legends": "Add From Legends_$",
			"Assignments": "Assignments_$",
			"Add Users To Group": "Add Users To Group_$",
			"Absent": "Absent_$",
			"Advanced Algebra": "Advanced Algebra_$",
			"Arabic": "Arabic_$",
			"Art": "Art_$",
			"Active": "Active_$",
			"Archived": "Archived_$",
			"Archive": "Archive_$",
			"Add a new chat": "Add a new chat_$",
			"Abuse": "Abuse_$",
			"Absent With Excuse": "Absent With Excuse_$",
			"Application Management": "Application Management_$",
			"App Grade Levels": "App Grade Levels_$",
			"Assessment Plans": "Assessment Plans_$",
			"Activity Types": "Activity Types_$",
			"Abuse Reports Settings": "Abuse Reports Settings_$",
			"Announcements Management": "Announcements Management_$",
			"Attendance Reports": "Attendance Reports_$",
			"Adminstrators": "Adminstrators_$",
			"Assign Student To Branches": "Assign Student To Branches_$",
			"Assign_This_Template_To_This_Course_And": "Assign this template to this course and",
			"Assign Teachers To Courses": "Assign Teachers To Courses_$",
			"Assign Students To Courses": "Assign Students To Courses_$",
			"After School Activities": "After School Activities_$",
			"Activate Term": "Activate Term_$",
			"approved": "Approved_$",
			"archive_chats_times": "الوقت المحدد للأرشفة",
			"apple": "تفاحة",
			"ape": "قرد",
			"add": "إضافة",
			"all": "الكل",
			"ALL": "الكل",
			"acronym": "مرادف",
			"add_new_category": "إضافة تصنيف جديد",
			"add_new_standard": "إضافة معيار جديد",
			"arabic": "العربية",
			"add_notes_on_this_item": "أضف ملاحظات على هذا البند",
			"assignments": "الوظائف",
			"Assign_This_Template_To ": "Assign This Template To ",
			"attendence": "الحضور",
			"accessibility_level": "مستوى الوصول",
			"add_a_comment": "أضف تعليقًا",
			"Add Choice": "إضافة خيار",
			"Add Pair": "إضافة زوج",
			"added_successfully": "تمت الإضافة بنجاح",
			"add_new_parameters": "إضافة معلمات جديدة",
			"add_report": "Add Report",
			"add_filter": "إضافة عامل تصفية",
			"اسم خطة التقييم": "اسم خطة التقييم",
			"الإجابات": "الإجابات",
			"Accept_volunteers": "قبول المتطوعين",
			"add_event": "إضافة حدث",
			"add_abuse": "أضف إساءة",
			"abuse_reports": "تقارير الإساءة",
			"add_announcement": "إضافة إعلان",
			"add_abuse_report": "+ تقارير إساءة الاستخدام",
			"abuse_report": "التبليغ عن إساءة",
			"abused_children": "الأطفال المعتدى عليهم",
			"addd_abuse_report": "إضافة تقرير إساءة",
			"abusers": "المسيئون",
			"abuse": "الاساءات",
			"are_you_sure_to_accepted_it": "هل أنت متأكد من قبولك بها",
			"are_you_sure_to_rejected_it": "هل أنت متأكد من رفضها",
			"add_from_senior_teacher": "إضافة من كبار المعلمين",
			"Add_Custom_Field": "Add Custom Field",
			"announcements": "الإعلانات",
			"Add New": "إضافة جديد",
			"assessment plans": "خطط التقييم",
			"add_report_card_template": "إضافة قالب تقرير",
			"add_header_items": "اضافة عناصر لرأس الصفحة",
			"add_description_items": "اضافة عناصر جديدة لمحتوى الصفحة",
			"add_footer_items": "اضافة عناصر لتذييل الصفحة",
			"add_lesson": "إضافة درس",
			"add_page": "إضافة صفحة",
			"Add new post and communicate with your colleges": "قم باضافة منشور جديد لتتواصل مع زملائك",
			"add_project_and_exams": "Add Project And Exams",
			"add_new_evaluation_type": "إضافة تقييم جديد",
			"add_children": "إضافة ابناء",
			"add_top_header": "إضافة رأس علوي",
			"abuse reports": "التبليغات",
			"Assignments Exams": "الاختبارات والوظائف",
			"Add To All Courses": "الإضافة إلى كل المناهج",
			"Add To a Book": "الإضافة إلى كتاب",
			"alignment_is_required": "المحاذاة مطلوبة",
			"attendance_reports": "تقارير الجضور",
			"and": "و",
			"All People": "كل الاشخاص",
			"Add Resource": "إضافة مصدر",
			"Add Rubric": "إضافة تقييم",
			"Add Lesson Plan": "إضافة خطة درس",
			"Add Unit Plan": "إضافة وحدة",
			"Add Topic": "إضافة موضوع",
			"Add Question Set": "إضافة مجموعة اسئلة",
			"add_existing": "Add Existing_$",
			"attendance": "Attendance_$",
			"announcement": "Announcement_$",
			"attendance_times": "attendance Times_$",
			"Add New Group": "Add New Group_$",
			"Add New Topic": "Add New Topic_$",
			"at_least": "At Least_$",
			"are you sure to delete this topic": "are you sure to delete this topic_$",
			"add_this_rubric": "Add This Rubric_$",
			"actions": "Actions_$",
			"Add Question Feedback": "Add Question Feedback_$",
			"approve": "Approve_$",
			"Assign": "Assign_$",
			"Assigned To A Room": "Assigned To A Room_$",
			"Are you sure to pass this student": "Are you sure to pass this student_$",
			"Academic Year": "Academic Year_$",
			"Academic Year Name": "Academic Year Name_$",
			"add new rating": "Add New Rating_$",
			"assessment item added successfully": "Assessment item added successfully_$",
			"Add New Collaboration Operations": "Add New Collaboration Operations_$",
			"actor": "Actor_$",
			"add_new": "Add New_$",
			"Are You sure you want to submit": "Are You sure you want to submit_$",
			"answer": "Answer_$",
			"Are You Sure": "Are You Sure_$",
			"availablility_date": "Availablility Date",
			"availablility_status": "availablility Status",
			"allow_comments": "Allow comments",
			"After_the_previous_lesson_is_completed": "After the previous lesson is completed"
		},
		"b": {
			"basic_info": "Basic Info",
			"back_to_my_courses": "Back To My Courses",
			"back_to_creating_course": "Back To Creating Course",
			"back_to_all_students": "Back To All Students",
			"Back_To_Student_Details": "Back To Student Details",
			"back_to_all_course_content": "Back To All Course Content",
			"back_to_all_assignments": "Back To All Assignments",
			"back_to_all_quizzes": "Back To All Quizzes",
			"back_to_all_exams": "Back To All Exams",
			"back_to_all_surveys": "Back To All Surveys",
			"back_to_all_polls": "Back To All Polls",
			"back_to_editor": "Back To editor",
			"basic_information": "Basic Information",
			"Basic_Info": "Basic Info",
			"buy_now": "Buy Now",
			"back_to_dashboard": "Back To Dashboard",
			"Be clear, concise, and comprehensive. Everything has to be there": "Be clear, concise, and comprehensive. Everything has to be there",
			"basic information": "Basic Information",
			"back_to_community": "Back to Community",
			"back_to_discussion": "Back to Discussion",
			"badge": "Badge_$",
			"Biology": "Biology_$",
			"Back_To_Grading": "Back To Grading",
			"Bulk_delete": "Bulk Delete",
			"Bell Curve Charts": "Bell Curve Charts_$",
			"book": "كتاب",
			"blend": "يخلط",
			"Bulk_Operations": "Bulk Operations",
			"Bulk_export_import": "Bulk export/import",
			"Bulk_remove": "Bulk Remove",
			"blanket": "بطانية",
			"big_font_size": "حجم الخط الكبير",
			"back_to_abuse": "العودة إلى إساءة الاستخدام",
			"back": "عودة",
			"bell_curve_diagram": "كخطط منحنى الجرس",
			"back_to_active_calc_students_marks": "Back To Active Calc Students Marks_$",
			"back_to_active_edit_teacher_marks": "Back To Active Edit Teacher Marks_$",
			"between": "Between_$",
			"bar_chart": "Bar Chart_$"
		},
		"c": {
			"change_to_unpointed": "Change To Unpointed",
			"change_to_pointed": "Change To Pointed",
			"create_lesson_plan": "Create Lesson Plan",
			"credit_is_required": "Credit Is Required",
			"creation_date": "Creation Date",
			"credit": "Credit",
			"code_is_required": "Code Is Required",
			"course_thumbnail": "Course Thumbnail",
			"choose_who_can_access_this": "Choose Who Can Access This",
			"copy_here": "Copy Here",
			"copy_to": "Copy To",
			"copy_link": "Copy Link",
			"create_new_agreement_with": "Create New Agreement With",
			"creator_by": "Creator by",
			"collaborate_now": "Collaborate now",
			"collaborated_content": "Collaborated Content",
			"coupon_was_used_by": "Coupon Was Used By",
			"coupons": "Coupons",
			"coupon_expiry_date": "Coupon Expiry Date",
			"course_code": "Course Code",
			"create_account_and_finish": "create account and finish",
			"coupon_code": "Coupon Code",
			"continue_shopping": "Continue Shopping",
			"Create_new_user_type": "Create New User Type",
			"change_home_room": "Change Home Room",
			"create_new_term": "Create New Term",
			"choose_user_type": "choose user type",
			"create_new_academic_year": "Create New Academic Year",
			"create_account": "Create Account",
			"create_new_home_room": "Create New Home Room",
			"Create_New_Group": "Create New Group",
			"click_on": "Click On",
			"clear_selection": "Clear Selection",
			"create_new_standard": "Create New Standard",
			"click_on_the": "Click On The",
			"choose_from_resources": "Choose From Resources",
			"create_new_rubric": "Create New Rubric",
			"closing_date": "Closing Date",
			"cut_off_date": "Cut Off Date",
			"Choose_filter": "Choose Filter",
			"choose_level": "Choose Level",
			"choose_from_question_bank": "Choose From Question Bank",
			"create_question_group": "Create Question Group",
			"create_new_question": "Create New Question",
			"course_information": "Course Information",
			"course_administrators": "Course Administrators",
			"curriculum_directors": "Curriculum Directors",
			"confirm_password_is_required": "Confirm password is required",
			"confirm_password": "Confirm password",
			"create_new_unit_plan": "Create New Unit Plan",
			"create_new_lesson_plan": "Create New Lesson Plan",
			"course_overview": "Course Overview",
			"create_live_session": "Create Live Session",
			"create_a_lesson": "Create A Lesson",
			"create_new": "Create New",
			"Consider outsourcing or delegating some tasks": "Consider outsourcing or delegating some tasks",
			"create_new_module": "Create New Module",
			"course_schedule": "Course Schedule",
			"course_content": "Course Content",
			"course_policy": "Course Policy",
			"create new course in": "Create New Course In",
			"course-information": "Course Information",
			"course-overview": "Course Overview",
			"course title": "Course Title",
			"course status": "Course Status",
			"cost": "Cost",
			"color": "Color",
			"coming_soon": "Coming Soon",
			"create": "Create",
			"create_new_course": "Create New Course",
			"category_name": "Category Name",
			"No_permessions_yet": "No Permessions Yet",
			"No_members_yet": "No Members Yet",
			"create_new_category": "Create New Category",
			"create_new_role": "Create New Role",
			"create_a_senior_teacher": "Create A Senior Teacher",
			"create_a_principal": "Create A Principal",
			"create_a_student": "Create A Student",
			"create_education_stage": "Create Education Stage",
			"create_grade_level": "Create Grade Level",
			"create_curricula": "Create Curricula",
			"create_new_post": "Create New Post",
			"create_unit_plan": "Create Unit Plan",
			"Course_designation": "Course designation",
			"create_from_template": "Create From Template",
			"create_new_item": "Create New Item",
			"certificate": "Certificate_$",
			"Class_order": "Class order_$",
			"Code": "Code_$",
			"Count": "Count_$",
			"Chat": "Chat_$",
			"courses": "Courses_$",
			"Curriculum": "Curriculum_$",
			"Chemistry": "Chemistry_$",
			"chinese": "الصينية",
			"Curricula": "Curricula_$",
			"Curriculum Content": "Curriculum Content_$",
			"Create Courses": "Create Courses_$",
			"check_all_as_presented": "Check All as Presented",
			"Column_settings": "Column settings",
			"cancel": "الغاء",
			"category": "التصنيف",
			"commit": "تأكيد العملية",
			"Confirm_new_password": "تأكيد كلمة المرور الجديدة",
			"current_password": "كلمة المرور الحالية",
			"change_password": "تغيير كلمة المرور",
			"category name": "اسم التصنيف",
			"copy": "نسخ",
			"Choice": "خيار",
			"Clear_Selection": "Clear Selection",
			"collaboration center": "لوحة تحكم التعاون",
			"Contact_Information": "Contact Information",
			"collaboration ops": "عمليات التعاون",
			"collaboration operations": "عمليات التعاون",
			"count_semesters": "عدد الفصول الدراسية",
			"choose_items": "اختيار عناصر",
			"can_not_be_empty": "لا يمكن أن يكون فارغاً",
			"calender": "التقويم",
			"calendar": "التقويم",
			"correct pattern": "تصحيح نموذج",
			"Create_user_group": "Create User Group",
			"Choose Pattern": "اختيار نموذج",
			"card": "Card_$",
			"choose_a_group": "Choose a Group",
			"Create_new_Account": "Create New Account",
			"current_mark": "Current Mark_$",
			"calculated_mark": "Calculated Mark_$",
			"calculate": "Calculate",
			"calculated": "Calculated",
			"Changing_Settings_Will_Effect_Grading": "Changing Settings Will Effect Grading",
			"calc_students_marks": "Calc Students Marks_$",
			"course_question_set": "Course Question Set_$",
			"course_name": "Course Name_$",
			"Course": "Course_$",
			"Courses": "Courses_$",
			"Collaboration Dashboard": "Collaboration Dashboard_$",
			"course_resources": "Course Resources_$",
			"Curriculum Management": "Curriculum Management_$",
			"Curricula - Grade": "Curricula - Grade_$",
			"curricula": "Curricula_$",
			"continue": "Continue_$",
			"Choose Picture": "Choose Picture_$",
			"Collaboration Level": "Collaboration Level_$",
			"Collaboration Operations": "Collaboration Operations_$",
			"close": "Close_$",
			"Current Lesson Plan would be replaced with this new one Proceed ?": "Current Lesson Plan would be replaced with this new one Proceed ?_$",
			"change": "Change_$",
			"create_new_discussion": "Create new discussion",
			"content": "Content"
		},
		"d": {
			"duplicate_standard": "Duplicate Standard",
			"description_is_required": "Description Is Required",
			"department": "Department",
			"department_name": "Department Name",
			"download_is_allowed": "Download Is Allowed",
			"download_is_not_allowed": "Download Is Not Allowed",
			"description is Required": "Description is required",
			"discount_is_assigned_to": "Discount Is Assigned To",
			"deactivate_discount": "Deactivate Discount",
			"deactivate": "Deactivate",
			"deactivate_coupon": "Deactivate Coupon",
			"discounts": "Discounts",
			"discount_type": "Discount Type",
			"discount_amount": "Discount Amount",
			"duration_in_minute": "Duration In Minute",
			"de_active": "De Active",
			"due_date": "Due Date",
			"display_date": "Display Date",
			"discover_all_courses": "Discover All Courses",
			"don't_have_an_account": "Don't have an account",
			"discount": "Discount",
			"Difficulty_Level": "Difficulty Level",
			"delete_content": "Delete Content",
			"Don't Approve": "Don't Approve_$",
			"delete": "حذف",
			"description": "التفاصيل",
			"data_type": "Data Type",
			"deleted_successfully": "تم الحذف بنجاح",
			"discussions": "نقاش",
			"data_after": "شكل البيانات بعد التعديل",
			"Draw": "رسم",
			"dashboard": "الرئيسية",
			"description_items": "عناصر محتوى الصفحة",
			"date_time": "التاريخ",
			"delete_item_part": "حذف جزء العنصر",
			"destination": "الوجهة",
			"done": "Done_$",
			"details": "Details_$",
			"Details Question Set for": "Details Question Set for_$",
			"Doesn’t have the same Grade As the Question set": "Doesn’t have the same Grade As the Question set_$",
			"Description is required": "Description Is Required_$",
			"Display files from One Drive": "Display files from One Drive_$",
			"display": "Display_$",
			"doughnut_chart": "Doughnut Chart_$",
			"Download": "Download_$",
			"Download_CSV_template_optional": "Download CSV template (optional)",
			"Download_Template": "Download Template",
			"download": "Download_$"
		},
		"e": {
			"edit_standard": "Edit Standard",
			"edit_lesson_plan": "Edit Lesson Plan",
			"edit_course": "Edit Course",
			"edit_information": "Edit Information",
			"end_at": "End At",
			"expiry_date": "Expiry Date",
			"expired_at": "Expired At",
			"expired": "Expired",
			"edit_the_lesson": "Edit The Lesson",
			"edit_home_room": "Edit Home Room",
			"edit_academic_year": "Edit Academic Year",
			"enroll_students_or_create_new_profile": "Enroll Students Or Create New Profile",
			"enroll_teachers_or_create_new_profile": "Enroll Teachers Or Create New Profile",
			"enroll_teacher": "Enroll Teacher",
			"edit_term": "Edit Term",
			"enroll_students": "Enroll Students",
			"enroll_teachers": "Enroll Teachers",
			"export_as_pdf": "Export As Pdf",
			"edit": "edit",
			"Edit_your_CSV_file": "Edit your CSV file",
			"enrolled_courses": "Enrolled Courses",
			"enroll_now": "Enroll Now",
			"enrolled": "Enrolled",
			"edit_course_information": "Edit Course Information",
			"email_address_is_required": "Email address is required",
			"email_address": "Email address",
			"essay_text": "Essay Text",
			"end_the_recorded_session": "End The Recorded Session",
			"essay_title": "Essay Title",
			"edit_module": "Edit Module",
			"Edit_School_Information": "Edit School Information",
			"exit_view_as_learner": "Exit View As Learner",
			"Export_CSV": "Export CSV",
			"end_date": "End Date",
			"edit_book": "Edit Book",
			"education_stage_id": "Education Stage Id",
			"emergency_number": "Emergency Number",
			"edit_content": "Edit Content",
			"English": "English_$",
			"Email_is_required": "Email is required",
			"English Language Art": "English Language Art_$",
			"Extra_Info": "Extra Info",
			"English Literature": "English Literature_$",
			"English Reading": "English Reading_$",
			"English Writing": "English Writing_$",
			"Enroll_Or_Create_New_Principals": "Enroll Or Create New Principals",
			"Enroll_Or_Create_New_Students": "Enroll Or Create New Students",
			"Education Stages": "Education Stages_$",
			"english": "الإنجليزية",
			"error_in_user_name": "خطأ في اسم المستخدم",
			"edit_comment": "تعديل التعليق",
			"edit_post": "تحرير المنشور",
			"email1": "الايميل الاول ",
			"email2": "الايميل الثاني",
			"education_stage": "مرحلة التعليم",
			"error": "خطأ",
			"edited_successfully": "تم التعديل بنجاح",
			"Enter Section Name": "أدخل اسم القسم",
			"evaluation_types": "أنواع التقييم",
			"evaluation_type_children": "Evaluation Type children",
			"edit_project_and_exams": "Edit Project And Exams",
			"enable_notifications": "تفعيل الاشعارات",
			"email_or_password_is_incorrect": "البريد الالكتروني او كلمة المرور غير صحيحة",
			"edit_teacher_marks": "Edit Teacher Marks_$",
			"Edit Group": "Edit Group_$",
			"Edit Collaboration Operations": "Edit Collaboration Operations_$"
		},
		"f": {
			"from_score": "From Score",

			"favorite_files": "Favorite Files",
			"file_type": "File Type",
			"file_size": "File Size",
			"fixed_cart_discount": "Fixed Cart Discount",
			"final_price": "Final Price",
			"Final_Result": "Final Result",
			"from_programs": "From Programs",
			"from_curricula": "From Curricula",
			"from_school_catalogue": "From School Catalogue",
			"from_course_catalogue": "From Course Catalogue",
			"Facebook_Page": "Facebook Page",
			"Assign_This_Template_To": "Assign This Template To",
			"For_This_Course_And": "For This Course And",
			"fill_in_blank": "Fill In Blank",
			"forgot_password": "Forgot password",
			"first_name_is_required": "First name is required",
			"full_name_address_is_required": "Full name address is required",
			"facilitator_profile": "Facilitator Profile",
			"facilitators": "Facilitators",
			"free": "Free",
			"Full_name": "Full name",
			"Finish": "Finish_$",
			"Foreign Languages": "Foreign Languages_$",
			"French": "French_$",
			"Finalize Term": "Finalize Term_$",
			"first_name": "الاسم الأول",
			"full_name": "الاسم الكامل",
			"footer_text": "نص التذييل",
			"forget_password": "نسيت كلمة المرور؟",
			"Free Text": "جواب مفتوح",
			"filter_by": "التصفية حسب",
			"filter": "تصفية",
			"file": "ملف",
			"field": "Field_$",
			"Final_Marks": "Final Marks",
			"file_name": "File Name_$",
			"forward": "Forward_$",
			"Final Mark": "Final Mark_$"
		},
		"g": {
			"give_access": "Give Access",
			"guidance_files": "Guidance Files",
			"general": "General",
			"grade_student_by_student": "Grade Student By Student",
			"grade_standard_by_standard": "Grade Standard By Standard",
			"go_to_advanced_settings": "Go To Advanced Settings",
			"grade_books": "Grade Books",
			"get_started_from_here": "Get Started From Here",
			"grads_books": "Grads Books",
			"group_sets": "Group Sets",
			"great": "Great",
			"got_it": "Got It!",
			"grade_scale": "Grade Scale",
			"grade_level_scale": "Grade Level Scale",
			"grade_levels": "Grade Levels_$",
			"Grade Level Scales": "Grade Level Scales_$",
			"Grade Levels": "Grade Levels_$",
			"Generate_email_from_username": "Generate Email from username",
			"Grades Levels Types": "Grades Levels Types_$",
			"generic_editor": "محرر عام",
			"grade_level": "مستوى الدرجة",
			"Graph_report": "تقرير الرسم البياني",
			"grade_summary": "ملخص",
			"go_to_email_to_complete_the_password_change_process": "انتقل إلى البريد الإلكتروني لإكمال عملية تغيير كلمة المرور",
			"grade_book": "التقارير",
			"grading mechanism": "الية التقييم",
			"grading_mechanism": "الية التقييم",
			"grades": "العلامات",
			"group_text": "Group Text_$",
			"grade": "Grade_$",
			"Grades Book": "Grades Book_$",
			"Grades Calculation": "Grades Calculation_$",
			"Grade Level": "Grade Level_$",
			"General Comment is empty .Save anyway": "General Comment is empty .Save anyway_$",
			"Grades": "Grades_$",
			"Grade - Curricula": "Grade - Curricula_$",
			"Group Managment": "Group Managment_$",
			"Group Info": "Group Info_$",
			"Gallery": "Gallery_$",
			"Geography": "Geography_$",
			"graded": "Graded"
		},
		"h": {
			"hour_is_required": "Hour Is Required",
			"hours": "Hours",
			"has_been_shared_with": "Has Been Shared With",
			"how_does_this_discount_work": "How Does This Discount Work",
			"hours_left": "Hours Left",
			"how many people can get this?": "How many people can get this?",
			"has_passed": "Has Passed",
			"Home Rooms": "Home Rooms_$",
			"hide": "إخفاء",
			"home": "الصفحة الرئيسية",
			"header_text": "نص العنوان ",
			"how_to_calculate_curriculum_assessment_plan_final_mark": "كيف تحسب العلامة النهائية للمنهاج ضمن خطة التقييم",
			"home_room": "الصف",
			"home room": "الصف",
			"hide_students": "Hide students",
			"homeroom": "الصف",
			"homerooms": "الصفوف",
			"home rooms": "الصفوف",
			"handle_with_care": "التعامل مع الرعاية",
			"header_items": "عناصر رأس الصفحة",
			"header_parts": "أقسام رأس الصفحة",
			"has_value": "يحتوي على قيمة",
			"how_many_semesters_to_want_to_use": "كم عدد الفصول الدراسية التي تريد استخدامها",
			"home_rooms": "Home Rooms_$",
			"history_operations": "History_ Operations_$",
			"Her you can see all the report cards in all grade levels.": "Her you can see all the report cards in all grade levels._$",
			"Home room": "Home room_$",
			"History": "History_$"
		},
		"i": {
			"industry_designation": "Industry Designation",
			"item_time": "Item Time",
			"is_template": "Is Template",
			"invalid_email": "Invalid email",
			"invalid_first_name": "Invalid first name",
			"invalid_last_name": "Invalid last name",
			"invalid_full_name": "Invalid full name",
			"Invalide_Phone_Number": "Invalid Phone Number",
			"icon": "Icon",
			"import from standard": "import from standard_$",
			"Initiate A New Term": "Initiate A New Term_$",
			"initializing_for_edit": "تحميل البيانات للتعديل",
			"invalid": "غير صحيح",
			"is_dropdownlist": "قائمة منسدلة",
			"is_published": "نشر",
			"Import From Canvas": "استيراد من canvas",
			"Industry_designation": "Industry designation",
			"Is_created_successfully": "Is created successfully",
			"IM": "الرسائل",
			"Import From Drive": "استيراد من drive",
			"Import_CSV": "Import CSV",
			"If you delete the attendance you wan't be able to set the attendance for this homeroom in this day untill you click tha add missing students from the QuickSchool Website , Are you sure you want to delete ?": "إذا قمت بحذف الحضور ، فلن تتمكن من تعيين الحضور لهذا الفصل الدراسي في هذا اليوم حتى تنقر فوق إضافة الطلاب المفقودين من موقع ويب QuickSchool ، هل أنت متأكد من أنك تريد الحذف؟",
			"If you lock the lesson, it will be available at the student": "إذا قمت بقفل الدرس سيكون متاحًا عند الطالب",
			"it": "المعلوماتية",
			"If you unlock the lesson, it won't be available at the student": "إذا قمت بإلغاء قفل الدرس لن يكون متاحًا عند الطالب",
			"If you change the count of semesters, you have to re-enter the data again": "إذا قمت بتغيير عدد الفصول الدراسية ، فيجب عليك إعادة إدخال البيانات مرة أخرى",
			"image": "Image_$",
			"import from template": "Import From Template_$",
			"Intitating Term": "Intitating Term_$",
			"Item": "Item_$",
			"Important": "Important_$",
			"Islamics": "Islamics_$",
			"is_complete": "Is Complete_$"
		},
		"j": {
			"jump_to": "Jump To"
		},
		"k": {
			"keep_shopping": "Keep Shopping"
		},
		"l": {
			"less_than_24_hours": "Less Than 24 Hours",
			"left_time": "Left Time",
			"lesson_plan_title": "Lesson Plan Title",
			"link_url": "Link Url",
			"last_edit": "Last Edit",
			"lesson_content": "Lesson Content",
			"lesson_number": "Lesson Number",
			"last_edited": "Last Edited",
			"learners can see this course but can’t enroll in (no specific time to start at)": "  learners can see this course but can’t enroll in (no specific time to start at)",
			"last_name_address_is_required": "Last name address is required",
			"log_in": "Log in",
			"login_to": "Login to",
			"lesson_plan": "Lesson Plan",
			"live_session": "Live Session",
			"lesson_title": "Lesson Title",
			"lesson_schedule": "Lesson Schedule",
			"less_language": "Less Language",
			"languages": "Languages",
			"Letter_Mark": "Letter Mark",
			"levels": "Levels",
			"log": "Log_$",
			"LastAdded": "LastAdded_$",
			"Lesson": "Lesson_$",
			"Lesson Plans": "Lesson Plans_$",
			"letter_grade": "Letter Grade",
			"Let's_Start_By_Getting": "Let's Start By Getting",
			"Last 24h": "Last 24h_$",
			"link": "Link_$",
			"Linked": "Linked_$",
			"Legends": "Legends_$",
			"Load More": "تحميل المزيد",
			"leave_without_saving_?": "مغادرة بدون حفظ؟",
			"log_out": "تسجيل الخروج",
			"last_name": "الاسم الاخير",
			"lower_margin": "الهامش الادنى",
			"last 24 hours": "اخر 24 ساعة",
			"left_margin": "الهامش الايسر",
			"logs": "السجلات",
			"live sessions": "الجلسات الحالية",
			"Live Sessions": "الجلسات الحالية",
			"livesessions": "الجلسات الحالية",
			"live_sessions": "الجلسات الحالية",
			"loading": "جاري التحميل",
			"logo": "الشعار",
			"Lesson time not match the start time": "وقت الدرس لا يتطابق مع الفترة الزمنية للبدء",
			"label": "وسم",
			"line_number": "رقم السطر",
			"last_24h": "اخر 24 ساعة",
			"logout": "تسجيل الخروج",
			"Lesson Details": "تفاصيل الدرس",
			"Lesson Plan": "خطة الدرس",
			"Lesson Recordings": "التسجيلات",
			"Lesson Supplements": "التسجيلات الاضافية",
			"Lesson Attachments": "الملحقات",
			"Lesson Editor": "محرر الدرس",
			"Last_Name_is_required": "Last Name is required",
			"Link Attachment": "رابط ",
			"Link URL": "الرابط",
			"Link Title": "عنوان الرابط",
			"line_chart": "Line Chart_$",
			"link_title": "Link title_$",
			"last": "Last_$",
			"lesson_plan_items": "Lesson Plan Items_$",
			"lesson_plans": "Lesson Plans_$",
			"level_operations": "Level Operations_$",
			"Locking this grade level will prevent the ability to change its weekly schedule": "Locking this grade level will prevent the ability to change its weekly schedule_$",
			"Locking this grade level will prevent the ability to change its students ‘status ( pass , fail )": "Locking this grade level will prevent the ability to change its students ‘status ( pass , fail )_$",
			"Locking this grade level will prevent creating new courses for it , or assign students or teachers to its courses": "Locking this grade level will prevent creating new courses for it , or assign students or teachers to its courses_$",
			"Locking this grade level will prevent adding or removing its students": "Locking this grade level will prevent adding or removing its students_$",
			"Loading": "Loading_$"
		},
		"m": {
			"methods_of_instruction": "Methods Of Instruction",
			"max_points": "Max Points",
			"max_point": "Max Point",
			"moved to trash items can be restored within 15 days": "Moved to trash items can be restored within 15 days",
			"manage_access_for": "Manage Access For",
			"move_here": "Move Here",
			"my_files": "My Files",
			"move_to_trash": "Move To Trash",
			"manage_access": "Manage Access",
			"move_to": "Move To",
			"modified_by": "Modified By",
			"my_clients": "My Clients",
			"more_than_24_hours": "More than 24 Hours",
			"multiple_choice_(MCQ)": "Multiple Choice (MCQ)",
			"multiple_choice_single_answer": "Multiple Choice Single Answer",
			"Max_class_size": "Max class size",
			"Methods_of_instructions": "Methods of instructions",
			"multiple_choice": "Multiple Choice",
			"must_contain_1_character": "Must contain 1 character",
			"manage_the_live_session": "Manage The Live Session",
			"manage_this_session": "Manage This Session",
			"module_title": "Module Title",
			"module_advanced_settings": "Module Advanced Settings",
			"more_language": "More Language",
			"main_curriculum": "Main Curriculum",
			"max_interactions_allowed": "Max Interactions Allowed_$",
			"manage": "Manage_$",
			"Mark_All_As_Presented": "Mark All As Presented",
			"make admin": "Make Admin_$",
			"Manage School": "Manage School_$",
			"Main Curricula": "Main Curricula_$",
			"MonthlyTraits": "MonthlyTraits_$",
			"Manage Reports": "Manage Reports_$",
			"my_profile": "ملفي الشخصي",
			"my profile": "ملفي الشخصي",
			"message_content_should_not_be_empty": "يجب ألا يكون محتوى الرسالة فارغاَ",
			"meduim_font_size": "حجم الخط المتوسط",
			"must_pass": "النجاح اجباري",
			"Minimum Ratio": "المعدل الأدنى",
			"messages": "الرسائل",
			"Multiple Choice (Single Answer)": "خيارات متعددة (جواب واحد)",
			"Multiple Choice (Multiple Answer)": "خيارات متعددة (أكثر من جواب)",
			"Match": "وصل",
			"mapping_with_school_terms": "mapping_with_school_terms",
			"Math": "الرياضيات",
			"Maths": "رياضيات",
			"mark": "تصحيح",
			"Marks_Details": "Marks Details",
			"Move Marks To School Level": "Move Marks To School Level",
			"math": "Math_$",
			"Minimum passed courses": "Minimum passed courses_$",
			"Maximum failed courses": "Maximum failed courses_$",
			"more": "More_$",
			"My_template": "My Template",
			"Mark Question Set": "Mark Question Set_$",
			"Muted": "Muted_$",
			"Music": "Music_$",
			"max_comments": "Max comments",
			"max_replies": "Max replies"
		},
		"n": {
			"no_rubric_yet": "No Rubric Yet",
			"no_lesson_plan_yet": "No Lesson Plan Yet",

			"not_course_yet": "Not Course Yet",
			"new_lesson_plan": "New Lesson Plan",
			"new_lesson_": "New Lesson",
			"new_rate": "New Rate",
			"new_standards": "New Standards",
			"new_rubric": "New Rubric",
			"new_standard": "New Standard",
			"new_course": "New Course",
			"name_is_required": "Name Is Required",
			"new_department": "New Dpartment",
			"no_department_yet": "No Department Yet",
			"no_department_courses": "No-Department Courses",
			"no_password_was_set": "No Password Was Set",
			"no_activities": "No Activities",
			"no_password_set": "No Password Set",
			"new_folder": "New Folder",
			"no_search_result": "No Search Result",
			"name is required": "Name is required",
			"no_levels_yet": "No Levels Yet",
			"no_coupons_yet": "No Coupons Yet",
			"no_discounts_yet": "No Discounts Yet",
			"not_assigned_yet": "Not Assigned Yet",
			"new_discount": "New Discount",
			"new_coupon": "New Coupon",
			"no_discount": "No Discount",
			"number_of_required_questions": "Number Of Required Questions",
			"no_courses_yet": "No Courses Yet",
			"no_categorized": "غير مصنف",
			"no_grade_levels": "No Grade Levels",
			"no_terms": "No Terms",
			"no_teachers_yet": "No Teachers Yet",
			"no_students_yet": "No Students Yet",
			"no_terms_yet": "No Terms Yet",
			"no grade levels yet, you can add new in": "No grade levels yet, you can add new in",
			"no_home_room_yet": "No Home Room Yet",
			"no_category": "No Category",
			"not_submitted_yet": "Not Submitted Yet",
			"next live session": "Next live session",
			"no_recently_added_roles": "No Recently Added Roles",
			"no_selected_semester": "No Selected Semester",
			"no_create_live_session": "No Create Live Session",
			"not_published_yet": "Not Published Yet",
			"no_recorded_sessions": "No Recorded Sessions",
			"no content yet, you can add content here": "No content yet, you can add content here",
			"no_content_yet": "No Content Yet",
			"number_of_hours": "Number Of Hours",
			"notifications": "Notifications_$",
			"no_options": "No Options_$",
			"New_User_Group": "New User Group",
			"No_Roles_yet": "No Roles Yet",
			"name": "الاسم",
			"new_message": "رسالة جديدة",
			"notes_about_this_item": "ملاحظات حول هذا البند",
			"new_chat": "دردشة جديدة",
			"no_items_to_show": "لا توجد عناصر للعرض",
			"No_permissoins": "No permissoins",
			"New_Role": "New Role",
			"New_User_Type": "New User Type",
			"new_password": "كلمة المرور الجديدة",
			"name_students": "اسم الطلاب",
			"number_of_passed_courses_to_pass": "عدد المواد الادني للنجاح",
			"number_of_falid_courses_to_fail": "عدد المواد الأعظم للرسوب",
			"no_data_to_show": "لا يوجد بيانات لعرضها",
			"No items to show": "لا يوجد بيانات لعرضها",
			"note": "ملاحظة",
			"Network Error": " خطأ في الشبكة",
			"no_items_please_select_items_before_moving_on_this_page": "لا توجد عناصر يرجى تحديد العناصر قبل الانتقال إلى هذه الصفحة",
			"new_lesson": "إضافة درس جديد",
			"No Announcments yet": "لا يوجد اعلانات حاليا",
			"No Posts for you !": "لا يوجد منشورات حاليا",
			"No Chats Yet !": "لا يوجد محادثات حاليا",
			"no notifications!": "لا يوجد اخطارات حاليا",
			"name_semester": "اسم الفصل الدراسي",
			"name_rank": "Terms",
			"name_evaluation_type": "التقييم",
			"name_course_is_required": "اسم المادة مطلوب",
			"name_course": "اسم المادة",
			"new_evaluation_type": "تقييم جديد",
			"no events": "لا يوجد احداث",
			"No People To Show": "لا يوجد اشخاص لإظهارهم",
			"No Courses": "لا يوجد مواد لعرضها",
			"no_live_sessions": "No Live Sessions_$",
			"no_events": "No Events_$",
			"No Announcements yet": "No Announcements yet_$",
			"No Students For This Course": "No Students For This Course_$",
			"No Question Sets Linked For This Course": "No Question Sets Linked For This Course_$",
			"No Skills Added to": "No Skills Added to_$",
			"No Evaluation Is Set For This Course": "No Evaluation Is Set For This Course_$",
			"New Value Is": "New Value Is_$",
			"no_school": "no_school_$",
			"No Items For This Lesson Plan": "No Items For This Lesson Plan_$",
			"No Changes To be Saved": "No Changes To be Saved_$",
			"Not Assigned To Any Homeroom": "Not Assigned To Any Homeroom_$",
			"Name": "Name_$",
			"nominate": "Nominate_$",
			"next": "Next_$",
			"No Students in this class": "No Students in this class_$",
			"Number Of Students": "Number Of Students_$",
			"No Posts for you": "No Posts for you_$",
			"Next SCO": "Next SCO_$",
			"New_Type": "New Type",
			"no_home_rooms": "No home Rooms_$",
			"No Data To show": "No Data To show_$",
			"No data": "No data_$",
			"Next_Item": "Next Item",
			"Next_Student": "Next Student",
			"No Chats Yet": "No Chats Yet_$",
			"no_items_yet": "No Items Yet",
			"new_item": "New Item",
			"new_discussion": "New discussion"
		},
		"o": {
			"owner": "Owner",
			"other": "Other",
			"organization-level discount is already active": "Organization-level discount is already active",
			"only one organization-level discount can be applied, you can deactivate it in": "Only one organization-level discount can be applied, you can deactivate it in",
			"off": "Off",
			"once you choose this you can’t change it": "Once you choose this you can’t change it",
			"order_summary": "Order Summary",
			"open_date": "Open Date",
			"or manage this life session": "Or manage this life session",
			"or start a new session": "Or start a new session",
			"online": "Online",
			"one_day_course": "One Day Course",
			"Old Sections": "Old Sections_$",
			"Or_upload_file": "Or upload file",
			"over_all": "نظرة شاملة",
			"others": "أخرى",
			"overview": "مراجعة",
			"ordinal_position": "الموقف الترتيبي",
			"ok": "موافق",
			"order": "الترتيب",
			"order_iis_required": "رقم السطر مطلوب",
			"other_people": "شخص اّخر",
			"ok, pick this rubric": "Ok, pick this rubric_$",
			"operation": "Operation_$",
			"Ok, pick this rubric": "Ok, pick this rubric_$",
			"order_lessons_as_you_want_students_to_see_them": "Order lessons as you want students to see them"
		},
		"p": {
			"plan_title": "Plan Title",
			"password_is_set": "Password Is Set",
			"path": "Path",
			"percentage_discount": "Percentage Discount",
			"percentage discount": "Percentage Discount",
			"payment-policy-and-discounts": "Payment Policy And Discounts",
			"payment": "Payment",
			"parent": "Parent",
			"principal": "Principal",
			"points_for_each_question": "Points For Each Question",
			"Pass/Fail": "Pass/Fail",
			"proceed_to_checkout": "Proceed To Checkout",
			"pick": "Pick",
			"pick_a_rubric": "Pick A Rubric",
			"previous_knowledge": "Previous Knowledge",
			"password_is_required": "Password is required",
			"passwords_must_match": "Passwords must match",
			"pick_from_collaboration": "Pick From Collaboration",
			"pick_from_this_course": "Pick From This Course",
			"Provide a variety of learning activities": "Provide a variety of learning activities",
			"private": "Private",
			"Properties": "Properties_$",
			"Posts": "Posts_$",
			"Passing Conditions": "Passing Conditions_$",
			"Phone_number": "Phone number",
			"pick_a_lesson_plan": "Pick A Lesson Plan_$",
			"Password_must_be_at_least_8_charachters": "Password must  be at least 8 charachters",
			"Permissions & Securables": "Permissions & Securables_$",
			"Permissions": "Permissions_$",
			"Privilege": "Privilege",
			"Principals": "Principals_$",
			"Parents": "Parents_$",
			"Periods": "Periods_$",
			"percent_grade": "Percent Grade",
			"points": "النقاط",
			"pointed": "مع نقاط",
			"post": "إضافة",
			"password": "Password",
			"passing_mark": "علامة النجاح",
			"percentage": "النسبة المئوية",
			"parameter_for_between_operator": "Parameter For Between Operator",
			"published_at": "تم النشر",
			"pick a rubric": "اختيار تقييم",
			"print": "طباعة",
			"Pair": "زوج",
			"page_number": "رقم الصفحة",
			"project_and_exam_items": "عناصر المشروع والاختبار",
			"please type at least 3 letters to search for one or more users to chat with": "ادخل 3 احرف على الاقل",
			"people": "أشخاص",
			"Publish To Parent": "تصدير الى الاّب",
			"Publish To Parents": "تصدير الى الاّباء",
			"please_select_user_type_first": "الرجاء تحديد نوع المستخدم اولا",
			"Pattern Name": "Pattern Name_$",
			"please_select_pattern": "please_select_pattern_$",
			"pie_chart": "Pie Chart_$",
			"pattern": "Pattern_$",
			"Passing grade Mark": "Passing grade Mark_$",
			"Please Select one file at least": "Please Select one file at least_$",
			"play": "Play_$",
			"pause": "Pause_$",
			"Previous SCO": "Previous SCO_$",
			"Profile_Picture": "Profile Picture",
			"previous": "Previous_$",
			"Previous_Student": "Previous Student",
			"prev": "Prev_$",
			"Present": "Present_$",
			"Previous_item": "Previous Item",
			"Pool": "Pool_$",
			"Participants": "Participants_$",
			"Philosophy": "Philosophy_$",
			"Physical Education": "Physical Education_$",
			"Physics": "Physics_$",
			"Pre-Calculus": "Pre-Calculus_$",
			"pre_requisites": "Pre Requisites_$",
			"Post_first": "Post first",
			"private_comments": "Private comments",
			"published": "Published"
		},
		"q": {
			"questions_group": "Questions Group",
			"Quotes": "Quotes_$",
			"quizes": "الاختبارات",
			"questions": "Questions_$",
			"question": "Question_$",
			"question_type": "Question Type_$",
			"question_grade": "Question Grade_$",
			"question_text": "Question Text_$",
			"question_set_name_is_required": "Question Set Name Is Required !_$",
			"question_set_type_is_required": "Question Set Type Is Required !_$",
			"question_set_total_grade_is_required": "Question Set Total Grade Is Required !_$",
			"question_set_name": "Question Set Name_$",
			"question_set_type": "Question Set Type_$",
			"quiz": "Quiz_$",
			"quiz_settings": "Quiz Settings_$",
			"question_set": "Question Set_$",
			"quiz_name": "Quiz Name_$",
			"qs_grade": "Qs Grade_$",
			"Question Number": "Question Number_$",
			"Question Mark": "Question Mark_$",
			"Question Text": "Question Text_$",
			"Question Sets": "Question Sets_$",
			"Question Set Picker": "Question Set Picker_$",
			"Question mark": "Question mark_$",
			"Question": "Question_$",
			"question_bank_topics": "Question Bank Topics_$",
			"question_sets": "Question Sets_$",
			"questions_bank": "بنك الأسئلة"
		},
		"r": {
			"rubric_title": "Rubric Title",
			"range": "Range",
			"recently_shared_files": "Recently Shared Files",
			"restore": "Restore",
			"require_approve": "Require Approve",
			"replace_with_other_discounts": "Replace With Other Discounts",
			"reset": "Reset",
			"recently_added": "Recently Added",
			"recently_created": "Recently Created",
			"required_question": "Required Question",
			"reset_all": "Reset All",
			"recent_activities": "Recent Activities",
			"Required_To_Attendance": "Required To Attendance",
			"Recalculate": "Recalculate",
			"recently_added_users": "Recently Added Users",
			"recently_added_in_question_bank": "Recently Added In Question Bank",
			"recently_added_roles": "Recently Added Roles",
			"restricted-access course exclusively for organization members": "restricted-access course exclusively for organization members",
			"remember_me": "Remember me",
			"register": "Register",
			"register_in": "Register in",
			"read_more": "Read More",
			"recorded_live_sessions": "Recorded Live Sessions",
			"Repurpose existing content": "Repurpose existing content",
			"Recent_Added": "Recent_Added",
			"role_category": "Role Category",
			"report_card_template": "Report Card Template",
			"Records to approve": "Records to approve_$",
			"remove from group": "Remove From Group_$",
			"Reply": "Reply_$",
			"Reports Management": "Reports Management_$",
			"Roles": "Roles_$",
			"Reports Card Template": "Reports Card Template_$",
			"rubric": "التقييم",
			"required": "مطلوب",
			"rubrics": "التقييمات",
			"rating": "المستوى",
			"right_margin": "الهامش الأيمن",
			"reset_password": "إعادة تعيين كلمة المرور",
			"Resources": "المصادر",
			"reason": "السبب",
			"report": "تقرير",
			"roles": "الأدوار",
			"Rubric name": "اسم التقييم",
			"Role_name": "Role Name",
			"records_to_approve": "سجلات جديدة لاعتمادها",
			"report_card": "Report Card_$",
			"required_attendance": "required_attendance_$",
			"Rubric Details for": "Rubric Details for_$",
			"Required Attendance": "Required Attendance_$",
			"Room": "Room_$",
			"Replace the old selected file": "Replace the old selected file_$",
			"Rubric": "Rubric_$",
			"Rubric Levels": "Rubric Levels_$",
			"Refresh": "Refresh",
			"rooms": "Rooms_$",
			"review": "Review_$",
			"result_school": "Result School_$",
			"rab": "Rab_$",
			"rabs": "Rabs_$",
			"Reported": "Reported_$",
			"required_comments": "Required comments"
		},
		"s": {
			"standards": "Standards",
			"show_less": "Show Less",
			"set": "Set",
			"share": "Share",
			"sharing_privacy": "Sharing Privacy",
			"shared_with": "Shared With",
			"save_and_next": "Save and next",
			"shareable": "Shareable",
			"select_all": "Select All",
			"Search_For_a_user_group": "Search For a User Group",
			"start_at": "Start At",
			"Save_And_Start_My_School": "Save And Start My School",
			"school_advisor": "School Advisor",
			"senior_teacher": "Senior Teacher",
			"sort_by": "Sort By",
			"School_Address": "School Address",
			"standard_title": "Standard Title",
			"start by adding your first academic year": "Start by adding your first academic year",
			"school_profile": "School Profile",
			"start_page": "Start Page",
			"switch_account": "Switch Account",
			"students_details": "Students Details",
			"single_answer_(SCQ)": "Single Answer (SCQ)",
			"shuffle_answer": "Shuffle Answer",
			"select_question_type": "Select Question Type",
			"select_author": "Select Author",
			"see_all_coming_courses": "See All coming Courses",
			"see_all_free_courses": "See All Free Courses",
			"see_all_one_day_courses": "See All One Day Courses",
			"see_all_courses_with_discount": "See All Courses With Discount",
			"sub_category_name": "Sub Category Name",
			"save_for_later": "Save For Later",
			"select_a_semester_to_see_its_curricula": "Select A Semester To See Its Curricula",
			"see_all_courses": "See All Courses",
			"saved_as_a_template": "Saved As A Template",
			"schedule_live_session": "Schedule Live Session",
			"save_new_session": "Save New Session",
			"start_new_session": "Start New Session",
			"start_the_live_session": "Start The Live Session",
			"start_on": "Start On",
			"show_course_summery": "Show Course Summery",
			"start_date": "Start Date",
			"Save_and_Finish": "Save and Finish",
			"select_category": "Select Category",
			"search_in_this_category": "Search In This Category",
			"search_in_all_categories": "Search In All Categories",
			"Suggest_password": "Suggest Password",
			"Semester_length": "Semester length",
			"search_a_role": "Search A Role",
			"search_a_user": "Search A User",
			"search_a_permission": "Search A Permission",
			"search_for_a_role": "Search for a role",
			"search_for_a_permission": "Search For a Permission",
			"search_for_a_user": "Search for a user",
			"search_for_user_phone_number": "Search For a User Phone Number",
			"search_for_user_address": "Search For User Address",
			"search_for_user_email": "Search For User Email",
			"selected_permissions": "Selected Permissions",
			"selected_roles": "Selected Roles",
			"search_results": "Search Results",
			"Search_For_a_User_Type": "Search For a User Type",
			"sequence": "Sequence_$",
			"Strong Kids": "Strong Kids_$",
			"School_Logo": "School Logo",
			"Scorm Packages": "Scorm Packages_$",
			"Set Pattern Name": "Set Pattern Name_$",
			"Selected_users": "Selected users",
			"Securables": "Securables_$",
			"School Groups": "School Groups_$",
			"Schools": "Schools_$",
			"School Events": "School Events_$",
			"Sections Synchronization Management": "Sections Synchronization Management_$",
			"School Advisors": "School Advisors_$",
			"Senior Teachers": "Senior Teachers_$",
			"Securable": "Securable_$",
			"Secure Tables": "Secure Tables_$",
			"Secure Actions": "Secure Actions_$",
			"Set_as_default_type_for_manual_registering": "Set as default type for manual registering",
			"Secure Records": "Secure Records_$",
			"Secure Reports": "Secure Reports_$",
			"Select Grades": "اختيار الصفوف",
			"show_chat_folders": "عرض مجلد المحادثات",
			"select": "إختيار",
			"select question type": "اختر نوع السؤال",
			"save": "حفظ",
			"standard": "المعيار",
			"saving": "جاري الحفظ",
			"subject": "الموضوع",
			"Sort_By": "Sort By",
			"score": "الرصيد",
			"Subject is required!": "العنوان مطلوب !",
			"send_message": "إرسال الرسالة",
			"student_name": "اسم الطالب",
			"Social_media": "وسائل التواصل الاجتماعي",
			"student_number": "رقم الطالب",
			"School_Template": "School Template",
			"success": "نجاح",
			"sp_name": "اسم إجراء المتجر",
			"small_font_size": "حجم الخط الصغير",
			"show_page_numbers": "إظهار أرقام الصفحات",
			"select_period": "حدد الفترة",
			"select_grade": "حدد الدرجة",
			"select_class": "حدد فئة",
			"select_course": "Select Course",
			"students_total_count": "إجمالي عدد الطلاب",
			"الملخص": "الملخص",
			"حدد التقدير لعرض البيانات": "حدد الدرجة لعرض البيانات",
			"أحداث_المدرسة": "أحداث المدرسة",
			"select_child": "اختيار ابن",
			"select_user_types": "حدد أنواع المستخدمين",
			"select_users": "حدد المستخدمين",
			"see_all": "معاينة جميع السجلات",
			"select_access_level": "حدد مستوى الوصول",
			"save_and_publish": "حفظ ونشر",
			"staff_members": "أعضاء طاقم العمل",
			"Start_from_scratch": "Start from scratch",
			"select_staff_members": "حدد أعضاء فريق العمل",
			"select_role": "تحديد الدور",
			"select_announcement_level": "حدد مستوى الإعلان",
			"standard name": "اسم المعيار",
			"see all": "معاينة جميع السجلات",
			"search": "ابحث",
			"send": "ارسال",
			"select_a_book": "اختر كتاب",
			"select_value": "اختيار قيمة",
			"select_alignment": "اختيار موقع",
			"show_in_all_pages": "إضافة إلى كل الصفحات",
			"Science": "العلوم",
			"setting": "الاعدادات",
			"seen": "تمت رؤيته",
			"sender": "المرسل",
			"SUBMITTED": "تم التسليم",
			"send message": "ارسل",
			"synchronize_section_management": "مزامنة إدارة القسم",
			"source": "المصدر",
			"select_school_classes_source": "حدد مصدر فصول المدرسة",
			"select_courses_source": "حدد مصدر الدورات",
			"select_sections_source": "حدد مصدر القسم",
			"select_school_classes_destination": "حدد وجهة فصول المدرسة",
			"select_courses_destination": "حدد وجهة الدورات",
			"select_sections_destination": "حدد وجهة القسم",
			"seen_by": "شوهد من قبل ",
			"select_year": "اختر سنة",
			"search_for_a_role_or_a_permission": "Search for a role or a permission",
			"select_semester": "اختر فصل",
			"select_rab": "اختر مادة",
			"select_rab_id": "الرجاء اختيار معرف المادة",
			"select_user_type": "اختر نوع المستخدم",
			"Synchronize Section": "Synchronize Section_$",
			"save_teacher_marks": "Save Teacher Marks_$",
			"student": "Student_$",
			"Submitting_Date": "Submitting Date",
			"Select a Rubric": "Select a Rubric_$",
			"Save Rubric": "Save Rubric_$",
			"Select a Type": "Select a Type_$",
			"Successfully Done": "Successfully Done_$",
			"student_evaluation": "Student Evaluation_$",
			"Search": "Search_$",
			"Select a Group First": "Select a Group First_$",
			"school": "school_$",
			"should_more_than": "Should More Than_$",
			"save_changes": "Save Changes_$",
			"send_notification_email": "Send notification/email",
			"Save New Question Set Changes": "Save New Question Set Changes_$",
			"sitemap": "Sitemap_$",
			"Students": "Students_$",
			"send_notification": "Send Notification_$",
			"Subject is required": "Subject is required_$",
			"select_files_from": "Select Files From_$",
			"sign in to oneDrive": "Sign In To OneDrive_$",
			"Select Files": "Select Files_$",
			"Student Name": "Student Name_$",
			"SeniorTeacher": "SeniorTeacher_$",
			"select a grade": "Select a grade_$",
			"Students Total Count": "Students Total Count_$",
			"students passed": "Students Passed_$",
			"students failed": "Students Failed_$",
			"Show_all_students": "Show_all_students",
			"Students_Final_Marks": "Students Final Marks",
			"submit": "Submit_$",
			"SIDEBAR BACKGROUND": "SIDEBAR BACKGROUND_$",
			"Select a School": "Select a School_$",
			"Select Collaboration Level": "Select Collaboration Level_$",
			"Submitted Successfully": "Submitted Successfully_$",
			"skip": "skip_$",
			"Safe Exam Browser": "Safe Exam Browser_$",
			"Student Mark": "Student Mark_$",
			"Select a Field": "Select a Field_$",
			"show": "show_$",
			"select file": "Select File_$",
			"science": "Science_$",
			"settings": "Settings_$",
			"Select": "Select_$",
			"starred": "Starred_$",
			"Start chatting with other people": "Start chatting with other people_$",
			"Social Studies": "Social Studies_$",
			"School Management": "School Management_$",
			"save_and_draft": "Save As A Draft",
			"status": "Status"
		},
		"t": {
			"this wil effect grading and assignments": "This will effect grading and assignments",
			"typically_offered": "Typically Offered",
			"this_action_cannot_be_undone": "This Action Cannot Be Undone",
			"to_score": "To Score",
			"trash_files": "Trash Files",
			"this": "This",
			"the_upload_was_made_successfully": "The Upload Was Made Successfully",
			"this_can't_be_undone,_are_you_sure": "This Can't Be Undone, Are You Sure",
			"the_whole_organization": "The Whole Organization",
			"this discount can be used since you share it with others": "This discount can be used since you share it with others",
			"the whole organization": "The whole organization",
			"thank_you_for_your_purchase": "Thank You For Your Purchase",
			"term": "Term",
			"to_start": "To Start",
			"to_start_creating_sections": "To Start Creating Sections",
			"title (for example: skills of reading)": "Title (for example: skills of reading)",
			"to_overdue": "To Overdue",
			"true_or_false": "True Or False",
			"top_categories": "Top Categories",
			"the_session_was_saved": "The Session Was Saved",
			"This_Template_Is_Assigned_To_All_Courses_By_Default": "This template is assigned to all courses by default",
			"This_Template_Is_Assigned_To": "This template is assigned to",
			"there is no modules yet": "There is no modules yet",
			"Tips for faster work": "Tips for faster work",
			"this category is empty": "This category is empty",
			"The Term is Finalized": "The Term is Finalized_$",
			"The Term is Active": "The Term is Active_$",
			"Technology And Engineering": "Technology And Engineering_$",
			"Total Grade": "Total Grade_$",
			"Term Initiation": "Term Initiation_$",
			"Typically_offered": "Typically offered",
			"Term Finalization": "Term Finalization_$",
			"title": "العنوان",
			"tags": "الوسوم",
			"total_points": "إجمالي النقاط",
			"type_here": "اكتب الرسالة",
			"text_to_show": "نص لإظهاره",
			"table_name": "اسم الجدول",
			"text_column_name": "اسم عمود النص",
			"title_on_all_pages": "العنوان في كافة الصفحات",
			"time_conflict": "تعارض الوقت",
			"Time": "Time",
			"text": "نص",
			"This_action_cannot_be_undone": "This action cannot be undone",
			"topics": "المواضيع",
			"Type delete to confirm": "أكتب Delete لتأكيد الحذف",
			"this rubric cannot be edited do you want to make a copy ?": "هذا التقييم غير قابل للتعديل هل تريد انشاء نسخة ؟",
			"this plan cannot be edited do you want to make a copy ?": "هذه الخطة غير قابلة للتعديل هل تريد إنشاء نسخة ؟",
			"type": "النوع",
			"template_name": "اسم القالب",
			"to do": "مهمات جديدة",
			"There are no attachments for this Lesson": "لا يوجد ملحقات لهذا الدرس",
			"type user name ...": "ادخل اسم المستخدم",
			"type new message..": "رسالة جديدة",
			"Try again later , please.": "رجاءا و حاول مرة اخرى لاحقا",
			"to_do": "To Do_$",
			"The_selected_users": "The selected users",
			"there_is_no_tags": "There is no task is checked !_$",
			"Topics": "Topics_$",
			"teacher_mark": "Teacher Mark_$",
			"topics_in": "Topics In_$",
			"Topics Bank": "Topics Bank_$",
			"This_can't_be_undone": "This can't be undone",
			"Topic Grade": "Topic Grade_$",
			"Today": "Today",
			"Topic Title": "Topic Title_$",
			"This message has been deleted": "This message has been deleted_$",
			"Teacher": "Teacher_$",
			"Teachers": "Teachers_$",
			"total_mark": "Total Mark_$",
			"The date column represents the date of publishing the report card": "The date column represents the date of publishing the report card_$",
			"Teacher Feedback": "Teacher Feedback_$",
			"Topic": "Topic_$",
			"Tardy with excuse": "Tardy with excuse_$",
			"Tardy": "Tardy_$",
			"Try again later , please": "Try again later , please_$",
			"Teacher_Can_Assign_Or_Edit_Attendance_Within": "Teacher Can Assign Or Edit Attendance Within"
		},
		"u": {
			"unpointed": "UnPointed",
			"un_favorite": "UnFavorite",
			"upload_scorm_package": "Upload Scorm Package",
			"upload_media": "Upload Media",
			"used_by": "Used By",
			"unit_time": "Unit Time",
			"upload_file": "Upload File",
			"unit_number": "Unit Number",
			"username_or_email_address": "Username or email address",
			"upload_from_my_device": "Upload From My Device",
			"Un Linked": "Un Linked_$",
			"unsend": "Unsend_$",
			"Users & Permissions": "Users & Permissions_$",
			"uncheck_all": "Uncheck all",
			"user_name": "اسم االمستخدم",
			"upper_margin": "الهامش العلوي",
			"UserType_Title_is_Required": "UserType Title is Required",
			"user_types": "أنواع المستخدمين",
			"User_Groups": "User Groups",
			"user_type": "User Type",
			"user_type_title": "User type title",
			"Upload File": "تحميل ملف",
			"unitplan": "خطة الوحدة",
			"unit plan": "خطة الوحدة",
			"User_group_name_is_Required": "User group name is Required",
			"unitplans": "خطط الوحدات",
			"unit plans": "خطط الوحدات",
			"unit": "وحدة",
			"URL": "الرابط",
			"Users": "المستخدمون",
			"Unit plan": "Unit plan_$",
			"User_group_picture": "User Group Picture",
			"User_Name_is_required": "User name is required",
			"User_Group_Name": "User Group Name",
			"Url": "Url_$",
			"user_id": "User ID",
			"User_account": "User Account",
			"Unit Plan Picker": "Unit Plan Picker_$",
			"Unit Plans": "Unit Plans_$",
			"undo": "Undo_$",
			"un_skip": "Un Skip_$",
			"user": "User_$",
			"Upload_files": "Upload files",
			"users": "Users_$",
			"unit_plans": "Unit Plans_$",
			"User_id_Is_Required": "User id is Required",
			"User Grades New Layout": "User Grades New Layout_$",
			"User_type_picture": "User type picture",
			"User_full_name": "User full name",
			"Upload_book": "Upload book",
			"upload": "Upload_$",
			"User_Group": "User Group",
			"Upload_your_CSV_file": "Upload your CSV file",
			"urgent": "Urgent_$"
		},
		"v": {
			"visible to learners": "Visible to learners",
			"view_course_map": "View Course Map",
			"view_full_profile": "View Full Profile",
			"view_as_learner": "View As Learner",
			"valid": "صحيح",
			"view_more_comments": "عرض المزيد من التعليقات",
			"value_column_name": "اسم عمود القيمة",
			"volunteer": "تطوع",
			"volunteered": "متطوع",
			"view all": "رؤية الكل",
			"view_all": "View All_$",
			"value": "Value_$",
			"views": "Views_$",
			"View more likes": "View more likes_$"
		},
		"w": {
			"will_be_no_longer_useable": "Will Be No Longer Useable",
			"weekly_schedule": "Weekly Schedule",
			"We are preparing your course to be cloned": "We are preparing your course to be cloned",
			"write_something_about_the_uploaded_file": "Write Something About The Uploaded file",
			"what students said about the course": "What Students Said About The Course",
			"Weekly Schedule Editor": "Weekly Schedule Editor_$",
			"write_new_post": "كتابة منشور جديد",
			"write_new_mpdal_post": "كتابة منشور جديد",
			"write_title": "اكتب العنوان",
			"write_content": "اكتب المحتوى",
			"write_a_comment": "أكتب تعليقا",
			"weight": "الوزن",
			"who_can_see_the_announcement": "من يمكنه رؤية الإعلان",
			"warning": "تنبيه",
			"weighted_mark": "Weighted Mark_$",
			"where_am_i": "Where Am I_$",
			"We will Notify you when the Import is finished": "We will Notify you when the Import is finished_$",
			"what_is_this_discussion_about": "What is this discussion about ?",
			"who_can_see_this": "Who Can See This ?"
		},
		"x": {},
		"y": {
			"you need to insert all the points for this rubric to proceed": "You need to insert all the points for this rubric to proceed",

			"your_cart_is_empty": "Your Cart Is Empty",
			"you can see today’s live sessions in your dashboard": "You can see today’s live sessions in your dashboard",
			"your first live session was created successfully!!": "Your first live session was created successfully!!",
			"you can see all recorded session in": "You can see all recorded session in",
			"you_have_started_at": "You Have Started At",
			"you can add a module by": "You can add a module by",
			"you can create sub category or new course": "You can create sub category or new course",
			"you_show_all_announcements": "رؤية كافة الاعلانات",
			"You'll find all new announcements in here": "You'll find all new announcements in here_$",
			"You Did not Set A Question Set Evaluation For This Course": "You Did not Set A Question Set Evaluation For This Course_$",
			"You Did not Set A Rubric Evaluation For This Course": "You Did not Set A Rubric Evaluation For This Course_$",
			"You Did not Set An Evaluation Of Type Other For This Course": "You Did not Set An Evaluation Of Type Other For This Course_$",
			"You Did not Set An Attendance Evaluation For This Course": "You Did not Set An Attendance Evaluation For This Course_$",
			"You Have To create One Group for": "You Have To create One Group for_$",
			"yes_delete_it": "yes_delete_it_$",
			"You Show All Posts": "You Show All Posts_$",
			"Your mark": "Your mark_$"
		},
		"z": {}
	}
}
