{
    "status": 1,
    "code": 200,
    "msg": null,
    "data": [
        {
            "id": 12,
            "name": "cat1",
            "parent_id": null,
            "creator_id": 855,
            "organization_id": 194,
            "created_at": "2024-01-10T09:15:03.000000Z",
            "updated_at": "2024-01-10T11:17:07.000000Z",
            "color": "#000",
            "can_delete": false,
            "courses": [
                {
                    "id": 1243,
                    "name": "c11",
                    "is_master": 1,
                    "creator_id": 855,
                    "is_published": 0
                },
                {
                    "id": 1244,
                    "name": "c22",
                    "is_master": 1,
                    "creator_id": 855,
                    "is_published": 0
                },
                {
                    "id": 1245,
                    "name": "cc2",
                    "is_master": 1,
                    "creator_id": 855,
                    "is_published": 0
                }
            ],
            "children": []
        },
        {
            "id": 15,
            "name": "cat3",
            "parent_id": null,
            "creator_id": 855,
            "organization_id": 194,
            "created_at": "2024-01-10T11:16:47.000000Z",
            "updated_at": "2024-01-10T11:16:47.000000Z",
            "color": "#000",
            "can_delete": false,
            "courses": [
                {
                    "id": 1249,
                    "name": "aaa",
                    "is_master": 1,
                    "creator_id": 855,
                    "is_published": 1
                }
            ],
            "children": []
        },
        {
            "id": 16,
            "name": "cat4",
            "parent_id": null,
            "creator_id": 855,
            "organization_id": 194,
            "created_at": "2024-01-13T08:22:57.000000Z",
            "updated_at": "2024-01-13T08:22:57.000000Z",
            "color": "#000",
            "can_delete": true,
            "courses": [],
            "children": []
        }
    ],
    "other": null,
    "other1": null
}
