<svg xmlns="http://www.w3.org/2000/svg" width="20" height="21" viewBox="0 0 20 21" fill="none">
  <g clip-path="url(#clip0_10512_85808)">
    <path d="M5 0.25C3.62109 0.25 2.5 1.37109 2.5 2.75V6.5H5V2.75H13.8555L15 3.89453V6.5H17.5V3.89453C17.5 3.23047 17.2383 2.59375 16.7695 2.125L15.625 0.980469C15.1562 0.511719 14.5195 0.25 13.8555 0.25H5ZM15 14V15.25V17.75H5V15.25V14.625V14H15ZM17.5 15.25H18.75C19.4414 15.25 20 14.6914 20 14V10.25C20 8.87109 18.8789 7.75 17.5 7.75H2.5C1.12109 7.75 0 8.87109 0 10.25V14C0 14.6914 0.558594 15.25 1.25 15.25H2.5V17.75C2.5 19.1289 3.62109 20.25 5 20.25H15C16.3789 20.25 17.5 19.1289 17.5 17.75V15.25ZM16.875 9.9375C17.1236 9.9375 17.3621 10.0363 17.5379 10.2121C17.7137 10.3879 17.8125 10.6264 17.8125 10.875C17.8125 11.1236 17.7137 11.3621 17.5379 11.5379C17.3621 11.7137 17.1236 11.8125 16.875 11.8125C16.6264 11.8125 16.3879 11.7137 16.2121 11.5379C16.0363 11.3621 15.9375 11.1236 15.9375 10.875C15.9375 10.6264 16.0363 10.3879 16.2121 10.2121C16.3879 10.0363 16.6264 9.9375 16.875 9.9375Z" fill="#668AD7"/>
  </g>
  <defs>
    <clipPath id="clip0_10512_85808">
      <rect width="20" height="20" fill="white" transform="translate(0 0.25)"/>
    </clipPath>
  </defs>
</svg>