<svg
  xmlns="http://www.w3.org/2000/svg"
  width="10"
  height="16"
  viewBox="0 0 10 16"
  fill="none"
>
  <g clip-path="url(#clip0_3073_114052)">
    <path
      d="M2.72898 13.8111C2.72926 13.9953 2.7821 14.1758 2.88125 14.3293L3.36676 15.082C3.4497 15.2106 3.5622 15.3161 3.69424 15.3891C3.82628 15.4621 3.97377 15.5003 4.12358 15.5003H5.8767C6.02652 15.5003 6.17401 15.4621 6.30605 15.3891C6.43809 15.3161 6.55058 15.2106 6.63352 15.082L7.11903 14.3293C7.21814 14.1758 7.27111 13.9955 7.27131 13.8111L7.27244 12.6875H2.72756L2.72898 13.8111ZM0 5.65627C0 6.95618 0.46733 8.14211 1.2375 9.04827C1.70682 9.60051 2.44091 10.7542 2.72074 11.7275C2.72187 11.7351 2.72273 11.7427 2.72386 11.7503H7.27614C7.27727 11.7427 7.27813 11.7354 7.27926 11.7275C7.55909 10.7542 8.29318 9.60051 8.7625 9.04827C9.53267 8.14211 10 6.95618 10 5.65627C10 2.80305 7.75313 0.491236 4.98438 0.500025C2.08636 0.509107 0 2.93079 0 5.65627ZM5 3.31252C3.74688 3.31252 2.72727 4.36399 2.72727 5.65627C2.72727 5.91526 2.52386 6.12502 2.27273 6.12502C2.02159 6.12502 1.81818 5.91526 1.81818 5.65627C1.81818 3.8469 3.24545 2.37502 5 2.37502C5.25114 2.37502 5.45455 2.58479 5.45455 2.84377C5.45455 3.10276 5.25114 3.31252 5 3.31252Z"
      fill="#FFD700"
    />
  </g>
  <defs>
    <clipPath id="clip0_3073_114052">
      <rect width="10" height="15" fill="white" transform="translate(0 0.5)" />
    </clipPath>
  </defs>
</svg>
