<svg width="19" height="22" viewBox="0 0 19 22" fill="none" xmlns="http://www.w3.org/2000/svg">
<path d="M3.67108 11.3455H2.16436C1.64642 11.3455 1.22266 11.7545 1.22266 12.2545V20.0909C1.22266 20.5909 1.64642 21 2.16436 21H3.67108C4.18901 21 4.61278 20.5909 4.61278 20.0909V13.1636C4.61278 12.6636 4.61278 11.3455 3.67108 11.3455ZM10.4513 5.71818H8.9446C8.42666 5.71818 8.0029 6.12727 8.0029 6.62727V20.0909C8.0029 20.5909 8.42666 21 8.9446 21H10.4513C10.9693 21 11.393 20.5909 11.393 20.0909V6.62727C11.393 6.12727 10.9693 5.71818 10.4513 5.71818ZM17.2316 1H15.7248C15.2069 1 14.7831 1.40909 14.7831 1.90909V20.0909C14.7831 20.5909 15.2069 21 15.7248 21H17.2316C17.7495 21 18.1733 20.5909 18.1733 20.0909V1.90909C18.1733 1.40909 17.7495 1 17.2316 1Z" stroke="#333333" stroke-width="1.2" stroke-linecap="round" stroke-linejoin="round"/>
<rect x="1.22266" y="11.335" width="3.39012" height="9.47368" fill="#333333"/>
</svg>
