{
  "swagger": "2.0",
  "info": {
    "description": "Microservicio crud para administración de Grupos escolares.",
    "version": "1.0.0",
    "title": "ids-tc-itmt-smdt-group-management"
  },
  "basePath": "/ids/practice/api",
  "consumes": ["application/json"],
  "produces": ["application/json"],
  "paths": {
    "/v1.0.0/itmt/system/development/group/management": {
      "post": {
        "tags": ["create-group"],
        "operationId": "create-group",
        "summary": "API que permite la creación de grupos.",
        "description": "API que permite la creación de grupos.",
        "parameters": [
          {
            "name": "Accept",
            "in": "header",
            "required": true,
            "type": "string",
            "description": "Media type que son aceptados en la petición"
          },
          {
            "name": "Content-Type",
            "in": "header",
            "required": true,
            "type": "string",
            "description": "Media type que son enviados en la petición"
          },
          {
            "name": "CreateGroupRequest",
            "in": "body",
            "required": true,
            "description": "Datos para crear un grupo.",
            "schema": {
              "$ref": "#/definitions/CreateGroupRequest"
            }
          }
        ],
        "responses": {
          "200": {
            "description": "<table><tr><td>Tipo</td><td>Código</td><td>Detalles</td></tr><tr><td>Successful</td><td>200</td><td>Respuesta satisfactoria al crear un grupo</td></tr></table>",
            "schema": {
              "$ref": "#/definitions/CreateGroupResponse"
            }
          },
          "400": {
            "description": "<table><tr><td>Tipo</td><td>Código</td><td>Detalles</td></tr><tr><td>error</td><td>invalidRequest</td><td>Parámetros faltantes/Parámetros inválidos</td></tr></table>",
            "schema": {
              "$ref": "#/definitions/ErrorResponse"
            }
          },
          "401": {
            "description": "<table><tr><td>Tipo</td><td>Código</td><td>Detalles</td></tr><tr><td>error</td><td>unAuthorized</td><td>Falta de credenciales/Credenciales inválidas</td></tr></table>",
            "schema": {
              "$ref": "#/definitions/ErrorResponse"
            }
          },
          "403": {
            "description": "<table><tr><td>Tipo</td><td>Código</td><td>Detalles</td><td>Más información</td></tr><tr><td>error</td><td>accessNotConfigured</td><td>La operación solicitada no ha sido configurada para acceder a este recurso</td><td>Canal/País/Negocio provisto en la petición no es soportado por el momento.</td></tr></table>",
            "schema": {
              "$ref": "#/definitions/ErrorResponse"
            }
          },
          "404": {
            "description": "<table><tr><td>Tipo</td><td>Código</td><td>Detalles</td><td>Más información</td></tr><tr><td>error</td><td>resourceNotFound</td><td>El recurso solicitado no ha sido encontrado</td><td>Recurso no existe/Recurso no encontrado</td></tr></table>",
            "schema": {
              "$ref": "#/definitions/ErrorResponse"
            }
          },
          "408": {
            "description": "<table><tr><td>Tipo</td><td>Codigo</td><td>Detalles</td></tr><tr><td>fatal</td><td>RequestTimeout</td><td>El servidor ha decidido cerrar la conexión en lugar de continuar esperando</td></tr></table>",
            "schema": {
              "$ref": "#/definitions/ErrorResponse"
            }
          },
          "500": {
            "description": "<table><tr><td>Tipo</td><td>Código</td><td>Detalles</td></tr><tr><td>fatal</td><td>serverUnavailable</td><td>La petición falló debido a un error interno del servidor/Servidor no disponible</td></tr></table>",
            "schema": {
              "$ref": "#/definitions/ErrorResponse"
            }
          }
        }
      },
      "get": {
        "tags": ["find-all-groups"],
        "summary": "API que permite consultar todos los grupos.",
        "description": "API que permite consultar todos los grupos.",
        "operationId": "find-all-groups",
        "parameters": [
          {
            "name": "Content-Type",
            "in": "header",
            "required": true,
            "type": "string",
            "description": "Media type que son enviados en la petición."
          },
          {
            "name": "Accept",
            "in": "header",
            "required": true,
            "type": "string",
            "description": "Media type que son aceptados en la petición."
          }
        ],
        "responses": {
          "200": {
            "description": "Operación exitosa.",
            "schema": {
              "$ref": "#/definitions/GroupsResponse"
            }
          },
          "400": {
            "description": "<table><tr><td>Tipo</td><td>Código</td><td>Detalles</td></tr><tr><td>error</td><td>invalidRequest</td><td>Parámetros faltantes/Parámetros inválidos</td></tr></table>",
            "schema": {
              "$ref": "#/definitions/ErrorResponse"
            }
          },
          "401": {
            "description": "<table><tr><td>Tipo</td><td>Código</td><td>Detalles</td></tr><tr><td>error</td><td>unAuthorized</td><td>Falta de credenciales/Credenciales inválidas</td></tr></table>",
            "schema": {
              "$ref": "#/definitions/ErrorResponse"
            }
          },
          "403": {
            "description": "<table><tr><td>Tipo</td><td>Código</td><td>Detalles</td><td>Más información</td></tr><tr><td>error</td><td>accessNotConfigured</td><td>La operación solicitada no ha sido configurada para acceder a este recurso</td><td>Canal/País/Negocio provisto en la petición no es soportado por el momento.</td></tr></table>",
            "schema": {
              "$ref": "#/definitions/ErrorResponse"
            }
          },
          "404": {
            "description": "<table><tr><td>Tipo</td><td>Código</td><td>Detalles</td><td>Más información</td></tr><tr><td>error</td><td>resourceNotFound</td><td>El recurso solicitado no ha sido encontrado</td><td>Recurso no existe/Recurso no encontrado</td></tr></table>",
            "schema": {
              "$ref": "#/definitions/ErrorResponse"
            }
          },
          "408": {
            "description": "<table><tr><td>Tipo</td><td>Codigo</td><td>Detalles</td></tr><tr><td>fatal</td><td>RequestTimeout</td><td>El servidor ha decidido cerrar la conexión en lugar de continuar esperando</td></tr></table>",
            "schema": {
              "$ref": "#/definitions/ErrorResponse"
            }
          },
          "500": {
            "description": "<table><tr><td>Tipo</td><td>Código</td><td>Detalles</td></tr><tr><td>fatal</td><td>serverUnavailable</td><td>La petición falló debido a un error interno del servidor/Servidor no disponible</td></tr></table>",
            "schema": {
              "$ref": "#/definitions/ErrorResponse"
            }
          }
        }
      }
    },
    "/v1.0.0/itmt/system/development/group/management/{groupId}": {
      "put": {
        "tags": ["update-by-groupId"],
        "summary": "API que permite actualizar la informacion de un grupo.",
        "description": "API que permite actualizar la informacion de un grupo.",
        "operationId": "update-by-groupId",
        "parameters": [
          {
            "name": "Content-Type",
            "in": "header",
            "required": true,
            "type": "string",
            "description": "Media type que son enviados en la petición."
          },
          {
            "name": "Accept",
            "in": "header",
            "required": true,
            "type": "string",
            "description": "Media type que son aceptados en la petición."
          },
          {
            "name": "groupId",
            "in": "path",
            "required": true,
            "type": "string",
            "description": "Id del grupo"
          },
          {
            "name": "UpdateRequest",
            "in": "body",
            "required": true,
            "description": "Datos de entrada para actualizar una materia.",
            "schema": {
              "$ref": "#/definitions/UpdateGroupRequest"
            }
          }
        ],
        "responses": {
          "204": {
            "description": "<table><tr><td>Tipo</td><td>Código</td><td>Detalles</td></tr><tr><td>successful</td><td>No content</td><td>No content</td></tr></table>"
          },
          "400": {
            "description": "<table><tr><td>Tipo</td><td>Código</td><td>Detalles</td></tr><tr><td>error</td><td>invalidRequest</td><td>Parámetros faltantes/Parámetros inválidos</td></tr></table>",
            "schema": {
              "$ref": "#/definitions/ErrorResponse"
            }
          },
          "401": {
            "description": "<table><tr><td>Tipo</td><td>Código</td><td>Detalles</td></tr><tr><td>error</td><td>unAuthorized</td><td>Falta de credenciales/Credenciales inválidas</td></tr></table>",
            "schema": {
              "$ref": "#/definitions/ErrorResponse"
            }
          },
          "403": {
            "description": "<table><tr><td>Tipo</td><td>Código</td><td>Detalles</td><td>Más información</td></tr><tr><td>error</td><td>accessNotConfigured</td><td>La operación solicitada no ha sido configurada para acceder a este recurso</td><td>Canal/País/Negocio provisto en la petición no es soportado por el momento.</td></tr></table>",
            "schema": {
              "$ref": "#/definitions/ErrorResponse"
            }
          },
          "404": {
            "description": "<table><tr><td>Tipo</td><td>Código</td><td>Detalles</td><td>Más información</td></tr><tr><td>error</td><td>resourceNotFound</td><td>El recurso solicitado no ha sido encontrado</td><td>Recurso no existe/Recurso no encontrado</td></tr></table>",
            "schema": {
              "$ref": "#/definitions/ErrorResponse"
            }
          },
          "408": {
            "description": "<table><tr><td>Tipo</td><td>Codigo</td><td>Detalles</td></tr><tr><td>fatal</td><td>RequestTimeout</td><td>El servidor ha decidido cerrar la conexión en lugar de continuar esperando</td></tr></table>",
            "schema": {
              "$ref": "#/definitions/ErrorResponse"
            }
          },
          "500": {
            "description": "<table><tr><td>Tipo</td><td>Código</td><td>Detalles</td></tr><tr><td>fatal</td><td>serverUnavailable</td><td>La petición falló debido a un error interno del servidor/Servidor no disponible</td></tr></table>",
            "schema": {
              "$ref": "#/definitions/ErrorResponse"
            }
          }
        }
      },
      "delete": {
        "tags": ["delete-by-groupId"],
        "summary": "API que permite eliminar un grupo.",
        "description": "API que permite eliminar un grupo.",
        "operationId": "dedelete-group",
        "parameters": [
          {
            "name": "Content-Type",
            "in": "header",
            "required": true,
            "type": "string",
            "description": "Media type que son enviados en la petición."
          },
          {
            "name": "Accept",
            "in": "header",
            "required": true,
            "type": "string",
            "description": "Media type que son aceptados en la petición."
          },
          {
            "name": "groupId",
            "in": "path",
            "required": true,
            "type": "string",
            "description": "Id del grupo"
          }
        ],
        "responses": {
          "204": {
            "description": "<table><tr><td>Tipo</td><td>Código</td><td>Detalles</td></tr><tr><td>successful</td><td>No content</td><td>No content</td></tr></table>"
          },
          "400": {
            "description": "<table><tr><td>Tipo</td><td>Código</td><td>Detalles</td></tr><tr><td>error</td><td>invalidRequest</td><td>Parámetros faltantes/Parámetros inválidos</td></tr></table>",
            "schema": {
              "$ref": "#/definitions/ErrorResponse"
            }
          },
          "401": {
            "description": "<table><tr><td>Tipo</td><td>Código</td><td>Detalles</td></tr><tr><td>error</td><td>unAuthorized</td><td>Falta de credenciales/Credenciales inválidas</td></tr></table>",
            "schema": {
              "$ref": "#/definitions/ErrorResponse"
            }
          },
          "403": {
            "description": "<table><tr><td>Tipo</td><td>Código</td><td>Detalles</td><td>Más información</td></tr><tr><td>error</td><td>accessNotConfigured</td><td>La operación solicitada no ha sido configurada para acceder a este recurso</td><td>Canal/País/Negocio provisto en la petición no es soportado por el momento.</td></tr></table>",
            "schema": {
              "$ref": "#/definitions/ErrorResponse"
            }
          },
          "404": {
            "description": "<table><tr><td>Tipo</td><td>Código</td><td>Detalles</td><td>Más información</td></tr><tr><td>error</td><td>resourceNotFound</td><td>El recurso solicitado no ha sido encontrado</td><td>Recurso no existe/Recurso no encontrado</td></tr></table>",
            "schema": {
              "$ref": "#/definitions/ErrorResponse"
            }
          },
          "408": {
            "description": "<table><tr><td>Tipo</td><td>Codigo</td><td>Detalles</td></tr><tr><td>fatal</td><td>RequestTimeout</td><td>El servidor ha decidido cerrar la conexión en lugar de continuar esperando</td></tr></table>",
            "schema": {
              "$ref": "#/definitions/ErrorResponse"
            }
          },
          "500": {
            "description": "<table><tr><td>Tipo</td><td>Código</td><td>Detalles</td></tr><tr><td>fatal</td><td>serverUnavailable</td><td>La petición falló debido a un error interno del servidor/Servidor no disponible</td></tr></table>",
            "schema": {
              "$ref": "#/definitions/ErrorResponse"
            }
          }
        }
      },
      "get": {
        "tags": ["find-by-groupId"],
        "summary": "API que permite consultar informacion de un grupo.",
        "description": "API que permite consultar informacion de un grupo.",
        "operationId": "find-by-groupId",
        "parameters": [
          {
            "name": "Content-Type",
            "in": "header",
            "required": true,
            "type": "string",
            "description": "Media type que son enviados en la petición."
          },
          {
            "name": "Accept",
            "in": "header",
            "required": true,
            "type": "string",
            "description": "Media type que son aceptados en la petición."
          },
          {
            "name": "groupId",
            "in": "path",
            "required": true,
            "type": "string",
            "description": "Id de Grupo"
          }
        ],
        "responses": {
          "200": {
            "description": "Operación exitosa.",
            "schema": {
              "$ref": "#/definitions/GroupResponse"
            }
          },
          "400": {
            "description": "<table><tr><td>Tipo</td><td>Código</td><td>Detalles</td></tr><tr><td>error</td><td>invalidRequest</td><td>Parámetros faltantes/Parámetros inválidos</td></tr></table>",
            "schema": {
              "$ref": "#/definitions/ErrorResponse"
            }
          },
          "401": {
            "description": "<table><tr><td>Tipo</td><td>Código</td><td>Detalles</td></tr><tr><td>error</td><td>unAuthorized</td><td>Falta de credenciales/Credenciales inválidas</td></tr></table>",
            "schema": {
              "$ref": "#/definitions/ErrorResponse"
            }
          },
          "403": {
            "description": "<table><tr><td>Tipo</td><td>Código</td><td>Detalles</td><td>Más información</td></tr><tr><td>error</td><td>accessNotConfigured</td><td>La operación solicitada no ha sido configurada para acceder a este recurso</td><td>Canal/País/Negocio provisto en la petición no es soportado por el momento.</td></tr></table>",
            "schema": {
              "$ref": "#/definitions/ErrorResponse"
            }
          },
          "404": {
            "description": "<table><tr><td>Tipo</td><td>Código</td><td>Detalles</td><td>Más información</td></tr><tr><td>error</td><td>resourceNotFound</td><td>El recurso solicitado no ha sido encontrado</td><td>Recurso no existe/Recurso no encontrado</td></tr></table>",
            "schema": {
              "$ref": "#/definitions/ErrorResponse"
            }
          },
          "408": {
            "description": "<table><tr><td>Tipo</td><td>Codigo</td><td>Detalles</td></tr><tr><td>fatal</td><td>RequestTimeout</td><td>El servidor ha decidido cerrar la conexión en lugar de continuar esperando</td></tr></table>",
            "schema": {
              "$ref": "#/definitions/ErrorResponse"
            }
          },
          "500": {
            "description": "<table><tr><td>Tipo</td><td>Código</td><td>Detalles</td></tr><tr><td>fatal</td><td>serverUnavailable</td><td>La petición falló debido a un error interno del servidor/Servidor no disponible</td></tr></table>",
            "schema": {
              "$ref": "#/definitions/ErrorResponse"
            }
          }
        }
      }
    },
    "/v1.0.0/itmt/system/development/group/management/find/name/{name}": {
      "get": {
        "tags": ["specific-queries"],
        "summary": "API que permite consultar informacion de una materia.",
        "description": "API que permite consultar informacion de una materia.",
        "operationId": "find-group-by-name",
        "parameters": [
          {
            "name": "Content-Type",
            "in": "header",
            "required": true,
            "type": "string",
            "description": "Media type que son enviados en la petición."
          },
          {
            "name": "Accept",
            "in": "header",
            "required": true,
            "type": "string",
            "description": "Media type que son aceptados en la petición."
          },
          {
            "name": "name",
            "in": "path",
            "required": true,
            "type": "string",
            "description": "Id de Materia"
          }
        ],
        "responses": {
          "200": {
            "description": "Operación exitosa.",
            "schema": {
              "$ref": "#/definitions/GroupResponse"
            }
          },
          "400": {
            "description": "<table><tr><td>Tipo</td><td>Código</td><td>Detalles</td></tr><tr><td>error</td><td>invalidRequest</td><td>Parámetros faltantes/Parámetros inválidos</td></tr></table>",
            "schema": {
              "$ref": "#/definitions/ErrorResponse"
            }
          },
          "401": {
            "description": "<table><tr><td>Tipo</td><td>Código</td><td>Detalles</td></tr><tr><td>error</td><td>unAuthorized</td><td>Falta de credenciales/Credenciales inválidas</td></tr></table>",
            "schema": {
              "$ref": "#/definitions/ErrorResponse"
            }
          },
          "403": {
            "description": "<table><tr><td>Tipo</td><td>Código</td><td>Detalles</td><td>Más información</td></tr><tr><td>error</td><td>accessNotConfigured</td><td>La operación solicitada no ha sido configurada para acceder a este recurso</td><td>Canal/País/Negocio provisto en la petición no es soportado por el momento.</td></tr></table>",
            "schema": {
              "$ref": "#/definitions/ErrorResponse"
            }
          },
          "404": {
            "description": "<table><tr><td>Tipo</td><td>Código</td><td>Detalles</td><td>Más información</td></tr><tr><td>error</td><td>resourceNotFound</td><td>El recurso solicitado no ha sido encontrado</td><td>Recurso no existe/Recurso no encontrado</td></tr></table>",
            "schema": {
              "$ref": "#/definitions/ErrorResponse"
            }
          },
          "408": {
            "description": "<table><tr><td>Tipo</td><td>Codigo</td><td>Detalles</td></tr><tr><td>fatal</td><td>RequestTimeout</td><td>El servidor ha decidido cerrar la conexión en lugar de continuar esperando</td></tr></table>",
            "schema": {
              "$ref": "#/definitions/ErrorResponse"
            }
          },
          "500": {
            "description": "<table><tr><td>Tipo</td><td>Código</td><td>Detalles</td></tr><tr><td>fatal</td><td>serverUnavailable</td><td>La petición falló debido a un error interno del servidor/Servidor no disponible</td></tr></table>",
            "schema": {
              "$ref": "#/definitions/ErrorResponse"
            }
          }
        }
      }
    },
    "/v1.0.0/itmt/system/development/group/management/find/abbreviation/{abbreviation}": {
      "get": {
        "tags": ["specific-queries"],
        "summary": "API que permite consultar informacion de una materia.",
        "description": "API que permite consultar informacion de una materia.",
        "operationId": "find-group-by-abbreviation",
        "parameters": [
          {
            "name": "Content-Type",
            "in": "header",
            "required": true,
            "type": "string",
            "description": "Media type que son enviados en la petición."
          },
          {
            "name": "Accept",
            "in": "header",
            "required": true,
            "type": "string",
            "description": "Media type que son aceptados en la petición."
          },
          {
            "name": "abbreviation",
            "in": "path",
            "required": true,
            "type": "string",
            "description": "Id de Materia"
          }
        ],
        "responses": {
          "200": {
            "description": "Operación exitosa.",
            "schema": {
              "$ref": "#/definitions/GroupResponse"
            }
          },
          "400": {
            "description": "<table><tr><td>Tipo</td><td>Código</td><td>Detalles</td></tr><tr><td>error</td><td>invalidRequest</td><td>Parámetros faltantes/Parámetros inválidos</td></tr></table>",
            "schema": {
              "$ref": "#/definitions/ErrorResponse"
            }
          },
          "401": {
            "description": "<table><tr><td>Tipo</td><td>Código</td><td>Detalles</td></tr><tr><td>error</td><td>unAuthorized</td><td>Falta de credenciales/Credenciales inválidas</td></tr></table>",
            "schema": {
              "$ref": "#/definitions/ErrorResponse"
            }
          },
          "403": {
            "description": "<table><tr><td>Tipo</td><td>Código</td><td>Detalles</td><td>Más información</td></tr><tr><td>error</td><td>accessNotConfigured</td><td>La operación solicitada no ha sido configurada para acceder a este recurso</td><td>Canal/País/Negocio provisto en la petición no es soportado por el momento.</td></tr></table>",
            "schema": {
              "$ref": "#/definitions/ErrorResponse"
            }
          },
          "404": {
            "description": "<table><tr><td>Tipo</td><td>Código</td><td>Detalles</td><td>Más información</td></tr><tr><td>error</td><td>resourceNotFound</td><td>El recurso solicitado no ha sido encontrado</td><td>Recurso no existe/Recurso no encontrado</td></tr></table>",
            "schema": {
              "$ref": "#/definitions/ErrorResponse"
            }
          },
          "408": {
            "description": "<table><tr><td>Tipo</td><td>Codigo</td><td>Detalles</td></tr><tr><td>fatal</td><td>RequestTimeout</td><td>El servidor ha decidido cerrar la conexión en lugar de continuar esperando</td></tr></table>",
            "schema": {
              "$ref": "#/definitions/ErrorResponse"
            }
          },
          "500": {
            "description": "<table><tr><td>Tipo</td><td>Código</td><td>Detalles</td></tr><tr><td>fatal</td><td>serverUnavailable</td><td>La petición falló debido a un error interno del servidor/Servidor no disponible</td></tr></table>",
            "schema": {
              "$ref": "#/definitions/ErrorResponse"
            }
          }
        }
      }
    }
  },
  "definitions": {
    "CreateGroupRequest": {
      "title": "CreateGroupRequest",
      "type": "object",
      "properties": {
        "name": {
          "description": "Nombre del grupo.",
          "type": "string",
          "example": "Ingenieria en Electronica"
        },
        "status": {
          "description": "Estatus del grupo.",
          "type": "integer",
          "example": 1
        },
        "abbreviation": {
          "description": "Abreviación del grupo.",
          "type": "string",
          "example": "IE3"
        },
        "generation": {
          "description": "Generacio del grupo.",
          "type": "string",
          "example": "2018"
        }
      },
      "required": ["name", "status", "abbreviation"]
    },
    "CreateGroupResponse": {
      "title": "CreateSubjectRequest",
      "type": "object",
      "properties": {
        "groupId": {
          "description": "Id del grupo",
          "type": "string",
          "example": "G003"
        }
      },
      "required": ["subjectId"]
    },
    "UpdateGroupRequest": {
      "title": "UpdateSubjectRequest",
      "type": "object",
      "properties": {
        "name": {
          "description": "Nombre del grupo.",
          "type": "string",
          "example": "Ingenieria en Electronica"
        },
        "status": {
          "description": "Estatus del grupo.",
          "type": "integer",
          "example": 1
        },
        "abbreviation": {
          "description": "Abreviación del grupo.",
          "type": "string",
          "example": "IE3"
        },
        "generation": {
          "description": "Generacio del grupo.",
          "type": "string",
          "example": "2018"
        }
      }
    },
    "GroupsResponse": {
      "title": "GroupsResponse",
      "type": "array",
      "description": "Grupos registrados",
      "items": {
        "$ref": "#/definitions/GroupResponse"
      }
    },
    "GroupResponse": {
      "title": "GroupResponse",
      "type": "object",
      "properties": {
        "groupId": {
          "description": "Id del grupo",
          "type": "string",
          "example": "G003"
        },
        "name": {
          "description": "Nombre del grupo.",
          "type": "string",
          "example": "Ingenieria en Electronica"
        },
        "status": {
          "description": "Estatus del grupo.",
          "type": "integer",
          "example": 1
        },
        "abbreviation": {
          "description": "Abreviación del grupo.",
          "type": "string",
          "example": "IE3"
        },
        "generation": {
          "description": "Generacio del grupo.",
          "type": "string",
          "example": "2018"
        },
        "createdBy": {
          "description": "Creado por.",
          "type": "string",
          "example": "API"
        },
        "createdAt": {
          "description": "Creado en.",
          "type": "string",
          "example": "2023-05-15T04:08:32"
        },
        "lastModifyBy": {
          "description": "Última modificación por.",
          "type": "number",
          "example": "APIM"
        },
        "lastModifyAt": {
          "description": "Última modificación en.",
          "type": "string",
          "example": "2023-05-15T04:20:54"
        }
      },
      "required": ["groupId", "name", "status", "abbreviation"]
    },
    "ErrorResponse": {
      "properties": {
        "type": {
          "type": "string",
          "description": "Invalido - La petición no cumple con las especificaciones, no fue procesada y se rechazó.",
          "enum": ["error", "warn", "invalid", "fatal"]
        },
        "code": {
          "description": "Código de error",
          "type": "string"
        },
        "details": {
          "description": "Detalles del error",
          "type": "string"
        },
        "location": {
          "description": "En dónde ocurrió el error",
          "type": "string"
        },
        "moreInfo": {
          "description": "Mas información del error",
          "type": "string"
        },
        "uuid": {
          "description": "UUID que se genera en cada petición",
          "type": "string"
        },
        "timestamp": {
          "description": "Tiempo y hora del error",
          "type": "string"
        }
      },
      "required": ["type", "code", "uuid"]
    }
  }
}
