{
  "swagger": "2.0",
  "info": {
    "description": "Microservicio crud para administración de profesores escolares.",
    "version": "1.0.0",
    "title": "ids-tc-itmt-smdt-teacher-management"
  },
  "basePath": "/ids/practice/api",
  "consumes": ["application/json"],
  "produces": ["application/json"],
  "paths": {
    "/v1.0.0/itmt/system/development/teacher/management": {
      "post": {
        "tags": ["create-teacher"],
        "operationId": "create-teacher",
        "summary": "API que permite la creación de profesores.",
        "description": "API que permite la creación de profesores.",
        "parameters": [
          {
            "name": "Accept",
            "in": "header",
            "required": true,
            "type": "string",
            "description": "Media type que son aceptados en la petición"
          },
          {
            "name": "Content-Type",
            "in": "header",
            "required": true,
            "type": "string",
            "description": "Media type que son enviados en la petición"
          },
          {
            "name": "CreateTeacherRequest",
            "in": "body",
            "required": true,
            "description": "Datos para crear un registro de profesor.",
            "schema": {
              "$ref": "#/definitions/CreateTeacherRequest"
            }
          }
        ],
        "responses": {
          "200": {
            "description": "<table><tr><td>Tipo</td><td>Código</td><td>Detalles</td></tr><tr><td>Successful</td><td>200</td><td>Respuesta satisfactoria al crear un grupo</td></tr></table>",
            "schema": {
              "$ref": "#/definitions/CreateTeacherResponse"
            }
          },
          "400": {
            "description": "<table><tr><td>Tipo</td><td>Código</td><td>Detalles</td></tr><tr><td>error</td><td>invalidRequest</td><td>Parámetros faltantes/Parámetros inválidos</td></tr></table>",
            "schema": {
              "$ref": "#/definitions/ErrorResponse"
            }
          },
          "401": {
            "description": "<table><tr><td>Tipo</td><td>Código</td><td>Detalles</td></tr><tr><td>error</td><td>unAuthorized</td><td>Falta de credenciales/Credenciales inválidas</td></tr></table>",
            "schema": {
              "$ref": "#/definitions/ErrorResponse"
            }
          },
          "403": {
            "description": "<table><tr><td>Tipo</td><td>Código</td><td>Detalles</td><td>Más información</td></tr><tr><td>error</td><td>accessNotConfigured</td><td>La operación solicitada no ha sido configurada para acceder a este recurso</td><td>Canal/País/Negocio provisto en la petición no es soportado por el momento.</td></tr></table>",
            "schema": {
              "$ref": "#/definitions/ErrorResponse"
            }
          },
          "404": {
            "description": "<table><tr><td>Tipo</td><td>Código</td><td>Detalles</td><td>Más información</td></tr><tr><td>error</td><td>resourceNotFound</td><td>El recurso solicitado no ha sido encontrado</td><td>Recurso no existe/Recurso no encontrado</td></tr></table>",
            "schema": {
              "$ref": "#/definitions/ErrorResponse"
            }
          },
          "408": {
            "description": "<table><tr><td>Tipo</td><td>Codigo</td><td>Detalles</td></tr><tr><td>fatal</td><td>RequestTimeout</td><td>El servidor ha decidido cerrar la conexión en lugar de continuar esperando</td></tr></table>",
            "schema": {
              "$ref": "#/definitions/ErrorResponse"
            }
          },
          "500": {
            "description": "<table><tr><td>Tipo</td><td>Código</td><td>Detalles</td></tr><tr><td>fatal</td><td>serverUnavailable</td><td>La petición falló debido a un error interno del servidor/Servidor no disponible</td></tr></table>",
            "schema": {
              "$ref": "#/definitions/ErrorResponse"
            }
          }
        }
      },
      "get": {
        "tags": ["find-all-teachers"],
        "summary": "API que permite consultar todos los profesores.",
        "description": "API que permite consultar todos los profesores.",
        "operationId": "find-all-teachers",
        "parameters": [
          {
            "name": "Content-Type",
            "in": "header",
            "required": true,
            "type": "string",
            "description": "Media type que son enviados en la petición."
          },
          {
            "name": "Accept",
            "in": "header",
            "required": true,
            "type": "string",
            "description": "Media type que son aceptados en la petición."
          }
        ],
        "responses": {
          "200": {
            "description": "Operación exitosa.",
            "schema": {
              "$ref": "#/definitions/TeachersResponse"
            }
          },
          "400": {
            "description": "<table><tr><td>Tipo</td><td>Código</td><td>Detalles</td></tr><tr><td>error</td><td>invalidRequest</td><td>Parámetros faltantes/Parámetros inválidos</td></tr></table>",
            "schema": {
              "$ref": "#/definitions/ErrorResponse"
            }
          },
          "401": {
            "description": "<table><tr><td>Tipo</td><td>Código</td><td>Detalles</td></tr><tr><td>error</td><td>unAuthorized</td><td>Falta de credenciales/Credenciales inválidas</td></tr></table>",
            "schema": {
              "$ref": "#/definitions/ErrorResponse"
            }
          },
          "403": {
            "description": "<table><tr><td>Tipo</td><td>Código</td><td>Detalles</td><td>Más información</td></tr><tr><td>error</td><td>accessNotConfigured</td><td>La operación solicitada no ha sido configurada para acceder a este recurso</td><td>Canal/País/Negocio provisto en la petición no es soportado por el momento.</td></tr></table>",
            "schema": {
              "$ref": "#/definitions/ErrorResponse"
            }
          },
          "404": {
            "description": "<table><tr><td>Tipo</td><td>Código</td><td>Detalles</td><td>Más información</td></tr><tr><td>error</td><td>resourceNotFound</td><td>El recurso solicitado no ha sido encontrado</td><td>Recurso no existe/Recurso no encontrado</td></tr></table>",
            "schema": {
              "$ref": "#/definitions/ErrorResponse"
            }
          },
          "408": {
            "description": "<table><tr><td>Tipo</td><td>Codigo</td><td>Detalles</td></tr><tr><td>fatal</td><td>RequestTimeout</td><td>El servidor ha decidido cerrar la conexión en lugar de continuar esperando</td></tr></table>",
            "schema": {
              "$ref": "#/definitions/ErrorResponse"
            }
          },
          "500": {
            "description": "<table><tr><td>Tipo</td><td>Código</td><td>Detalles</td></tr><tr><td>fatal</td><td>serverUnavailable</td><td>La petición falló debido a un error interno del servidor/Servidor no disponible</td></tr></table>",
            "schema": {
              "$ref": "#/definitions/ErrorResponse"
            }
          }
        }
      }
    },
    "/v1.0.0/itmt/system/development/teacher/management/{teacherId}": {
      "put": {
        "tags": ["update-by-teacherId"],
        "summary": "API que permite actualizar la informacion de un profesor.",
        "description": "API que permite actualizar la informacion de un profesor.",
        "operationId": "update-by-teacherId",
        "parameters": [
          {
            "name": "Content-Type",
            "in": "header",
            "required": true,
            "type": "string",
            "description": "Media type que son enviados en la petición."
          },
          {
            "name": "Accept",
            "in": "header",
            "required": true,
            "type": "string",
            "description": "Media type que son aceptados en la petición."
          },
          {
            "name": "teacherId",
            "in": "path",
            "required": true,
            "type": "string",
            "description": "Id del profesor"
          },
          {
            "name": "UpdateRequest",
            "in": "body",
            "required": true,
            "description": "Datos de entrada para actualizar el registro del profesor.",
            "schema": {
              "$ref": "#/definitions/UpdateTeacherRequest"
            }
          }
        ],
        "responses": {
          "204": {
            "description": "<table><tr><td>Tipo</td><td>Código</td><td>Detalles</td></tr><tr><td>successful</td><td>No content</td><td>No content</td></tr></table>"
          },
          "400": {
            "description": "<table><tr><td>Tipo</td><td>Código</td><td>Detalles</td></tr><tr><td>error</td><td>invalidRequest</td><td>Parámetros faltantes/Parámetros inválidos</td></tr></table>",
            "schema": {
              "$ref": "#/definitions/ErrorResponse"
            }
          },
          "401": {
            "description": "<table><tr><td>Tipo</td><td>Código</td><td>Detalles</td></tr><tr><td>error</td><td>unAuthorized</td><td>Falta de credenciales/Credenciales inválidas</td></tr></table>",
            "schema": {
              "$ref": "#/definitions/ErrorResponse"
            }
          },
          "403": {
            "description": "<table><tr><td>Tipo</td><td>Código</td><td>Detalles</td><td>Más información</td></tr><tr><td>error</td><td>accessNotConfigured</td><td>La operación solicitada no ha sido configurada para acceder a este recurso</td><td>Canal/País/Negocio provisto en la petición no es soportado por el momento.</td></tr></table>",
            "schema": {
              "$ref": "#/definitions/ErrorResponse"
            }
          },
          "404": {
            "description": "<table><tr><td>Tipo</td><td>Código</td><td>Detalles</td><td>Más información</td></tr><tr><td>error</td><td>resourceNotFound</td><td>El recurso solicitado no ha sido encontrado</td><td>Recurso no existe/Recurso no encontrado</td></tr></table>",
            "schema": {
              "$ref": "#/definitions/ErrorResponse"
            }
          },
          "408": {
            "description": "<table><tr><td>Tipo</td><td>Codigo</td><td>Detalles</td></tr><tr><td>fatal</td><td>RequestTimeout</td><td>El servidor ha decidido cerrar la conexión en lugar de continuar esperando</td></tr></table>",
            "schema": {
              "$ref": "#/definitions/ErrorResponse"
            }
          },
          "500": {
            "description": "<table><tr><td>Tipo</td><td>Código</td><td>Detalles</td></tr><tr><td>fatal</td><td>serverUnavailable</td><td>La petición falló debido a un error interno del servidor/Servidor no disponible</td></tr></table>",
            "schema": {
              "$ref": "#/definitions/ErrorResponse"
            }
          }
        }
      },
      "delete": {
        "tags": ["delete-by-teacherId"],
        "summary": "API que permite eliminar un profesor.",
        "description": "API que permite eliminar un profesor.",
        "operationId": "delete-by-teacherId",
        "parameters": [
          {
            "name": "Content-Type",
            "in": "header",
            "required": true,
            "type": "string",
            "description": "Media type que son enviados en la petición."
          },
          {
            "name": "Accept",
            "in": "header",
            "required": true,
            "type": "string",
            "description": "Media type que son aceptados en la petición."
          },
          {
            "name": "teacherId",
            "in": "path",
            "required": true,
            "type": "string",
            "description": "Id del profesor"
          }
        ],
        "responses": {
          "204": {
            "description": "<table><tr><td>Tipo</td><td>Código</td><td>Detalles</td></tr><tr><td>successful</td><td>No content</td><td>No content</td></tr></table>"
          },
          "400": {
            "description": "<table><tr><td>Tipo</td><td>Código</td><td>Detalles</td></tr><tr><td>error</td><td>invalidRequest</td><td>Parámetros faltantes/Parámetros inválidos</td></tr></table>",
            "schema": {
              "$ref": "#/definitions/ErrorResponse"
            }
          },
          "401": {
            "description": "<table><tr><td>Tipo</td><td>Código</td><td>Detalles</td></tr><tr><td>error</td><td>unAuthorized</td><td>Falta de credenciales/Credenciales inválidas</td></tr></table>",
            "schema": {
              "$ref": "#/definitions/ErrorResponse"
            }
          },
          "403": {
            "description": "<table><tr><td>Tipo</td><td>Código</td><td>Detalles</td><td>Más información</td></tr><tr><td>error</td><td>accessNotConfigured</td><td>La operación solicitada no ha sido configurada para acceder a este recurso</td><td>Canal/País/Negocio provisto en la petición no es soportado por el momento.</td></tr></table>",
            "schema": {
              "$ref": "#/definitions/ErrorResponse"
            }
          },
          "404": {
            "description": "<table><tr><td>Tipo</td><td>Código</td><td>Detalles</td><td>Más información</td></tr><tr><td>error</td><td>resourceNotFound</td><td>El recurso solicitado no ha sido encontrado</td><td>Recurso no existe/Recurso no encontrado</td></tr></table>",
            "schema": {
              "$ref": "#/definitions/ErrorResponse"
            }
          },
          "408": {
            "description": "<table><tr><td>Tipo</td><td>Codigo</td><td>Detalles</td></tr><tr><td>fatal</td><td>RequestTimeout</td><td>El servidor ha decidido cerrar la conexión en lugar de continuar esperando</td></tr></table>",
            "schema": {
              "$ref": "#/definitions/ErrorResponse"
            }
          },
          "500": {
            "description": "<table><tr><td>Tipo</td><td>Código</td><td>Detalles</td></tr><tr><td>fatal</td><td>serverUnavailable</td><td>La petición falló debido a un error interno del servidor/Servidor no disponible</td></tr></table>",
            "schema": {
              "$ref": "#/definitions/ErrorResponse"
            }
          }
        }
      },
      "get": {
        "tags": ["find-by-teacherId"],
        "summary": "API que permite consultar informacion de un grupo.",
        "description": "API que permite consultar informacion de un grupo.",
        "operationId": "find-by-teacherId",
        "parameters": [
          {
            "name": "Content-Type",
            "in": "header",
            "required": true,
            "type": "string",
            "description": "Media type que son enviados en la petición."
          },
          {
            "name": "Accept",
            "in": "header",
            "required": true,
            "type": "string",
            "description": "Media type que son aceptados en la petición."
          },
          {
            "name": "teacherId",
            "in": "path",
            "required": true,
            "type": "string",
            "description": "Id de profesor"
          }
        ],
        "responses": {
          "200": {
            "description": "Operación exitosa.",
            "schema": {
              "$ref": "#/definitions/TeacherResponse"
            }
          },
          "400": {
            "description": "<table><tr><td>Tipo</td><td>Código</td><td>Detalles</td></tr><tr><td>error</td><td>invalidRequest</td><td>Parámetros faltantes/Parámetros inválidos</td></tr></table>",
            "schema": {
              "$ref": "#/definitions/ErrorResponse"
            }
          },
          "401": {
            "description": "<table><tr><td>Tipo</td><td>Código</td><td>Detalles</td></tr><tr><td>error</td><td>unAuthorized</td><td>Falta de credenciales/Credenciales inválidas</td></tr></table>",
            "schema": {
              "$ref": "#/definitions/ErrorResponse"
            }
          },
          "403": {
            "description": "<table><tr><td>Tipo</td><td>Código</td><td>Detalles</td><td>Más información</td></tr><tr><td>error</td><td>accessNotConfigured</td><td>La operación solicitada no ha sido configurada para acceder a este recurso</td><td>Canal/País/Negocio provisto en la petición no es soportado por el momento.</td></tr></table>",
            "schema": {
              "$ref": "#/definitions/ErrorResponse"
            }
          },
          "404": {
            "description": "<table><tr><td>Tipo</td><td>Código</td><td>Detalles</td><td>Más información</td></tr><tr><td>error</td><td>resourceNotFound</td><td>El recurso solicitado no ha sido encontrado</td><td>Recurso no existe/Recurso no encontrado</td></tr></table>",
            "schema": {
              "$ref": "#/definitions/ErrorResponse"
            }
          },
          "408": {
            "description": "<table><tr><td>Tipo</td><td>Codigo</td><td>Detalles</td></tr><tr><td>fatal</td><td>RequestTimeout</td><td>El servidor ha decidido cerrar la conexión en lugar de continuar esperando</td></tr></table>",
            "schema": {
              "$ref": "#/definitions/ErrorResponse"
            }
          },
          "500": {
            "description": "<table><tr><td>Tipo</td><td>Código</td><td>Detalles</td></tr><tr><td>fatal</td><td>serverUnavailable</td><td>La petición falló debido a un error interno del servidor/Servidor no disponible</td></tr></table>",
            "schema": {
              "$ref": "#/definitions/ErrorResponse"
            }
          }
        }
      }
    },
    "/v1.0.0/itmt/system/development/teacher/management/find-by-name/{name}": {
      "get": {
        "tags": ["specific-queries"],
        "summary": "API que permite consultar informacion de una profesor.",
        "description": "API que permite consultar informacion de una profesor.",
        "operationId": "find-teacher-by-name",
        "parameters": [
          {
            "name": "Content-Type",
            "in": "header",
            "required": true,
            "type": "string",
            "description": "Media type que son enviados en la petición."
          },
          {
            "name": "Accept",
            "in": "header",
            "required": true,
            "type": "string",
            "description": "Media type que son aceptados en la petición."
          },
          {
            "name": "name",
            "in": "path",
            "required": true,
            "type": "string",
            "description": "Id de Profesor"
          }
        ],
        "responses": {
          "200": {
            "description": "Operación exitosa.",
            "schema": {
              "$ref": "#/definitions/TeacherResponse"
            }
          },
          "400": {
            "description": "<table><tr><td>Tipo</td><td>Código</td><td>Detalles</td></tr><tr><td>error</td><td>invalidRequest</td><td>Parámetros faltantes/Parámetros inválidos</td></tr></table>",
            "schema": {
              "$ref": "#/definitions/ErrorResponse"
            }
          },
          "401": {
            "description": "<table><tr><td>Tipo</td><td>Código</td><td>Detalles</td></tr><tr><td>error</td><td>unAuthorized</td><td>Falta de credenciales/Credenciales inválidas</td></tr></table>",
            "schema": {
              "$ref": "#/definitions/ErrorResponse"
            }
          },
          "403": {
            "description": "<table><tr><td>Tipo</td><td>Código</td><td>Detalles</td><td>Más información</td></tr><tr><td>error</td><td>accessNotConfigured</td><td>La operación solicitada no ha sido configurada para acceder a este recurso</td><td>Canal/País/Negocio provisto en la petición no es soportado por el momento.</td></tr></table>",
            "schema": {
              "$ref": "#/definitions/ErrorResponse"
            }
          },
          "404": {
            "description": "<table><tr><td>Tipo</td><td>Código</td><td>Detalles</td><td>Más información</td></tr><tr><td>error</td><td>resourceNotFound</td><td>El recurso solicitado no ha sido encontrado</td><td>Recurso no existe/Recurso no encontrado</td></tr></table>",
            "schema": {
              "$ref": "#/definitions/ErrorResponse"
            }
          },
          "408": {
            "description": "<table><tr><td>Tipo</td><td>Codigo</td><td>Detalles</td></tr><tr><td>fatal</td><td>RequestTimeout</td><td>El servidor ha decidido cerrar la conexión en lugar de continuar esperando</td></tr></table>",
            "schema": {
              "$ref": "#/definitions/ErrorResponse"
            }
          },
          "500": {
            "description": "<table><tr><td>Tipo</td><td>Código</td><td>Detalles</td></tr><tr><td>fatal</td><td>serverUnavailable</td><td>La petición falló debido a un error interno del servidor/Servidor no disponible</td></tr></table>",
            "schema": {
              "$ref": "#/definitions/ErrorResponse"
            }
          }
        }
      }
    },
    "/v1.0.0/itmt/system/development/teacher/management/find-by-licenseNumber/{licenseNumber}": {
      "get": {
        "tags": ["specific-queries"],
        "summary": "API que permite consultar informacion de una profesor.",
        "description": "API que permite consultar informacion de una profesor.",
        "operationId": "find-teacher-by-licenseNumber",
        "parameters": [
          {
            "name": "Content-Type",
            "in": "header",
            "required": true,
            "type": "string",
            "description": "Media type que son enviados en la petición."
          },
          {
            "name": "Accept",
            "in": "header",
            "required": true,
            "type": "string",
            "description": "Media type que son aceptados en la petición."
          },
          {
            "name": "name",
            "in": "path",
            "required": true,
            "type": "string",
            "description": "Id de Profesor"
          }
        ],
        "responses": {
          "200": {
            "description": "Operación exitosa.",
            "schema": {
              "$ref": "#/definitions/TeacherResponse"
            }
          },
          "400": {
            "description": "<table><tr><td>Tipo</td><td>Código</td><td>Detalles</td></tr><tr><td>error</td><td>invalidRequest</td><td>Parámetros faltantes/Parámetros inválidos</td></tr></table>",
            "schema": {
              "$ref": "#/definitions/ErrorResponse"
            }
          },
          "401": {
            "description": "<table><tr><td>Tipo</td><td>Código</td><td>Detalles</td></tr><tr><td>error</td><td>unAuthorized</td><td>Falta de credenciales/Credenciales inválidas</td></tr></table>",
            "schema": {
              "$ref": "#/definitions/ErrorResponse"
            }
          },
          "403": {
            "description": "<table><tr><td>Tipo</td><td>Código</td><td>Detalles</td><td>Más información</td></tr><tr><td>error</td><td>accessNotConfigured</td><td>La operación solicitada no ha sido configurada para acceder a este recurso</td><td>Canal/País/Negocio provisto en la petición no es soportado por el momento.</td></tr></table>",
            "schema": {
              "$ref": "#/definitions/ErrorResponse"
            }
          },
          "404": {
            "description": "<table><tr><td>Tipo</td><td>Código</td><td>Detalles</td><td>Más información</td></tr><tr><td>error</td><td>resourceNotFound</td><td>El recurso solicitado no ha sido encontrado</td><td>Recurso no existe/Recurso no encontrado</td></tr></table>",
            "schema": {
              "$ref": "#/definitions/ErrorResponse"
            }
          },
          "408": {
            "description": "<table><tr><td>Tipo</td><td>Codigo</td><td>Detalles</td></tr><tr><td>fatal</td><td>RequestTimeout</td><td>El servidor ha decidido cerrar la conexión en lugar de continuar esperando</td></tr></table>",
            "schema": {
              "$ref": "#/definitions/ErrorResponse"
            }
          },
          "500": {
            "description": "<table><tr><td>Tipo</td><td>Código</td><td>Detalles</td></tr><tr><td>fatal</td><td>serverUnavailable</td><td>La petición falló debido a un error interno del servidor/Servidor no disponible</td></tr></table>",
            "schema": {
              "$ref": "#/definitions/ErrorResponse"
            }
          }
        }
      }
    }
  },
  "definitions": {
    "CreateTeacherRequest": {
      "title": "CreateTeacherRequest",
      "type": "object",
      "properties": {
        "name": {
          "description": "Nombre del profesor.",
          "type": "string",
          "example": "Victor Huerta"
        },
        "status": {
          "description": "Estatus del profesor.",
          "type": "integer",
          "example": 1
        },
        "hours": {
          "description": "Horas de trabajo del profesor.",
          "type": "integer",
          "example": 8
        },
        "shedule": {
          "description": "Dias de trabajo.",
          "type": "string",
          "example": "L-V"
        },

        "licenseNumber": {
          "description": "Cedula profesional",
          "type": "string",
          "example": "312990987263123123"
        }
      },
      "required": ["name", "status", "hours", "shedule", "licenseNumber"]
    },
    "CreateTeacherResponse": {
      "title": "CreateTeacherResponse",
      "type": "object",
      "properties": {
        "teacherId": {
          "description": "Id del teacher",
          "type": "string",
          "example": "G003"
        }
      },
      "required": ["teacherId"]
    },
    "UpdateTeacherRequest": {
      "title": "UpdateTeacherRequest",
      "type": "object",
      "properties": {
        "name": {
          "description": "Nombre del profesor.",
          "type": "string",
          "example": "Victor Huerta"
        },
        "status": {
          "description": "Estatus del profesor.",
          "type": "integer",
          "example": 1
        },
        "hours": {
          "description": "Horas de trabajo del profesor.",
          "type": "integer",
          "example": 8
        },
        "shedule": {
          "description": "Dias de trabajo.",
          "type": "string",
          "example": "L-V"
        },
        "licenseNumber": {
          "description": "Cedula profesional",
          "type": "string",
          "example": "312990987263123123"
        }
      }
    },
    "TeachersResponse": {
      "title": "TeachersResponse",
      "type": "array",
      "description": "Profesores registrados",
      "items": {
        "$ref": "#/definitions/TeacherResponse"
      }
    },
    "TeacherResponse": {
      "title": "TeacherResponse",
      "type": "object",
      "properties": {
        "teacherId": {
          "description": "Id del profesor.",
          "type": "string",
          "example": "G003"
        },
        "name": {
          "description": "Nombre del profesor.",
          "type": "string",
          "example": "Ingenieria en Electronica"
        },
        "status": {
          "description": "Estatus del profesor.",
          "type": "integer",
          "example": 1
        },
        "hours": {
          "description": "Horas de trabajo del profesor.",
          "type": "integer",
          "example": 8
        },
        "shedule": {
          "description": "Dias de trabajo.",
          "type": "string",
          "example": "L-V"
        },
        "licenseNumber": {
          "description": "Cedula profesional",
          "type": "string",
          "example": "312990987263123123"
        },
        "createdBy": {
          "description": "Creado por.",
          "type": "string",
          "example": "API"
        },
        "createdAt": {
          "description": "Creado en.",
          "type": "string",
          "example": "2023-05-15T04:08:32"
        },
        "lastModifyBy": {
          "description": "Última modificación por.",
          "type": "number",
          "example": "APIM"
        },
        "lastModifyAt": {
          "description": "Última modificación en.",
          "type": "string",
          "example": "2023-05-15T04:20:54"
        }
      },
      "required": ["teacherId", "name", "status"]
    },
    "ErrorResponse": {
      "properties": {
        "type": {
          "type": "string",
          "description": "Invalido - La petición no cumple con las especificaciones, no fue procesada y se rechazó.",
          "enum": ["error", "warn", "invalid", "fatal"]
        },
        "code": {
          "description": "Código de error",
          "type": "string"
        },
        "details": {
          "description": "Detalles del error",
          "type": "string"
        },
        "location": {
          "description": "En dónde ocurrió el error",
          "type": "string"
        },
        "moreInfo": {
          "description": "Mas información del error",
          "type": "string"
        },
        "uuid": {
          "description": "UUID que se genera en cada petición",
          "type": "string"
        },
        "timestamp": {
          "description": "Tiempo y hora del error",
          "type": "string"
        }
      },
      "required": ["type", "code", "uuid"]
    }
  }
}
