{
    "scopes": ["https://www.googleapis.com/auth/drive"],
    "endPoints": ["drive.googleapis.com"],
    "appAccount": {
        "name": "My-App-Name",
        "email": "***@gmail.com",
        "password": "1234"
    },
    "connectUserAccount": {
        "email": "***@gmail.com",
        "password": "1234"
    }
}