<?xml version="1.0"?>
<robot
        name="trx_robot">
    <link
            name="base_footprint"/>
    <joint
            name="base_footprint_joint"
            type="fixed">
        <origin
                xyz="0 0 0.1249217"
                rpy="0 0 0"/>
        <parent
                link="base_footprint"/>
        <child
                link="base_link"/>
        <axis
                xyz="0 0 0"/>
    </joint>
    <link
            name="base_link">
        <inertial>
            <origin
                    xyz="-0.0692440825092598 0.0182922624656937 0.237170529840157"
                    rpy="0 0 0"/>
            <mass
                    value="30"/>

            <inertia
                    ixx="0.31639"
                    ixy="-9.1727E-05"
                    ixz="-0.093044"
                    iyy="0.17997"
                    iyz="5.3231E-05"
                    izz="0.16693"/>
        </inertial>
        <visual>
            <origin
                    xyz="-0.34 -0.245 -0.125"
                    rpy="0 0 0"/>
            <geometry>
                <mesh
                        filename="package://trx_description/meshes/hri_base_link.STL"/>
            </geometry>
            <material
                    name="">
                <color
                        rgba="0.792156862745098 0.819607843137255 0.933333333333333 1"/>
            </material>
        </visual>
        <collision>
            <origin
                    xyz="-0.085 0 0.099"
                    rpy="0 0 0"/>
            <geometry>
                <box size="0.505 0.49 0.30"/>
            </geometry>
        </collision>
    </link>
    <link
            name="wheel_front_left">
        <inertial>
            <origin
                    xyz="-1.21644384353906E-05 5.02355698706047E-09 -9.95261350565096E-07"
                    rpy="0 0 0"/>
            <mass
                    value="1.19468309242743"/>
            <!--            <mass-->
            <!--                    value="0.19468309242743"/>-->
            <inertia
                    ixx="7.74298617751514E-12"
                    ixy="4.77668429431615E-13"
                    ixz="-9.46351217357088E-11"
                    iyy="1.16440692697894E-09"
                    iyz="3.90815349771352E-14"
                    izz="1.15666433532758E-09"/>
        </inertial>
        <visual>
            <origin
                    xyz="0 0 0"
                    rpy="0 0 0"/>
            <geometry>
                <mesh
                        filename="package://trx_description/meshes/wheel.STL"/>
            </geometry>
            <material
                    name="">
                <color
                        rgba="0.792156862745098 0.819607843137255 0.933333333333333 1"/>
            </material>
        </visual>
        <collision>
            <origin
                    xyz="0 0 0"
                    rpy="1.57079632679 0 0"/>
            <geometry>
                <cylinder length="0.05" radius="0.1016"/>
            </geometry>
        </collision>
    </link>
    <joint
            name="left_wheel_joint"
            type="continuous">
        <origin
                xyz="0 0.161374439975416 -0.0234217078108803"
                rpy="0 0 0"/>
        <parent
                link="base_link"/>
        <child
                link="wheel_front_left"/>
        <axis
                xyz="0 1 0"/>
        <limit upper="1.79769e+308" lower="1.79769e+308" effort="1000" velocity="1000.00"/>
    </joint>
    <link
            name="wheel_front_right">
        <inertial>
            <origin
                    xyz="-1.21644384353906E-05 5.02355698706047E-09 9.95261350565096E-07"
                    rpy="0 0 0"/>
            <mass
                    value="1.19468309242743"/>
            <!--            <mass-->
            <!--                    value="0.19468309242743"/>-->
            <inertia
                    ixx="7.74298617751514E-12"
                    ixy="4.77668429431615E-13"
                    ixz="-9.46351217357088E-11"
                    iyy="1.16440692697894E-09"
                    iyz="3.90815349771352E-14"
                    izz="1.15666433532758E-09"/>
        </inertial>
        <visual>
            <origin
                    xyz="0 0 0"
                    rpy="0 0 0"/>
            <geometry>
                <mesh
                        filename="package://trx_description/meshes/wheel.STL"/>
            </geometry>
            <material
                    name="">
                <color
                        rgba="0.792156862745098 0.819607843137255 0.933333333333333 1"/>
            </material>
        </visual>
        <collision>
            <origin
                    xyz="0 0 0"
                    rpy="1.57079632679 0 0"/>
            <geometry>
                <cylinder length="0.05" radius="0.1016"/>
            </geometry>
        </collision>
    </link>
    <joint
            name="right_wheel_joint"
            type="continuous">
        <origin
                xyz="0 -0.162374439255704 -0.0236218050730315"
                rpy="0 0 0"/>
        <parent
                link="base_link"/>
        <child
                link="wheel_front_right"/>
        <axis
                xyz="0 1 0"/>
        <limit upper="1.79769e+308" lower="1.79769e+308" effort="1000" velocity="1000.00"/>
    </joint>

    <link
            name="wheel_stable_left">
        <collision>
            <origin
                    xyz="0 0 0"
                    rpy="1.57079632679 0 0"/>
            <geometry>
<!--                <sphere radius="0.1016"/>-->
                 <cylinder length="0.05" radius="0.1016"/>
            </geometry>
        </collision>
    </link>
    <joint
            name="wheel_stable_left_joint"
            type="fixed">
        <origin
                xyz="0.05 0.161374439975416 -0.0234217078108803"
                rpy="0 0 0"/>
        <parent
                link="base_link"/>
        <child
                link="wheel_stable_left"/>
        <axis
                xyz="0 0 0"/>
    </joint>

    <link
            name="wheel_stable_right">
        <collision>
            <origin
                    xyz="0 0 0"
                    rpy="1.57079632679 0 0"/>
            <geometry>
<!--                <sphere radius="0.1016"/>-->
                 <cylinder length="0.05" radius="0.1016"/>
            </geometry>
        </collision>
    </link>
    <joint
            name="wheel_stable_right_joint"
            type="fixed">
        <origin
                xyz="0.05 -0.161374439975416 -0.0234217078108803"
                rpy="0 0 0"/>
        <parent
                link="base_link"/>
        <child
                link="wheel_stable_right"/>
        <axis
                xyz="0 0 0"/>
    </joint>

    <link
            name="wheel_rear_right">
        <collision>
            <origin
                    xyz="0 0 0"
                    rpy="1.57079632679 0 0"/>
            <geometry>
<!--                <sphere radius="0.1016"/>-->
                 <cylinder length="0.05" radius="0.1016"/>
            </geometry>
        </collision>
    </link>
    <joint
            name="wheel_rear_right_joint"
            type="fixed">
        <origin
                xyz="-0.271003476510462 -0.161374439975416 -0.0234217078108803"
                rpy="0 0 0"/>
        <parent
                link="base_link"/>
        <child
                link="wheel_rear_right"/>
        <axis
                xyz="0 0 0"/>
    </joint>
    <link
            name="wheel_rear_left">
        <collision>
            <origin
                    xyz="0 0 0"
                    rpy="1.57079632679 0 0"/>
            <geometry>
<!--                <sphere radius="0.1016"/>-->
                 <cylinder length="0.05" radius="0.1016"/>
            </geometry>
        </collision>
    </link>
    <joint
            name="wheel_rear_left_joint"
            type="fixed">
        <origin
                xyz="-0.271003476510462 0.161374439975416 -0.0234217078108803"
                rpy="0 0 0"/>
        <parent
                link="base_link"/>
        <child
                link="wheel_rear_left"/>
        <axis
                xyz="0 0 0"/>
    </joint>
    <!-- <link
      name="top_cam" />
    <joint
      name="top_cam_joint"
      type="fixed">
      <origin
        xyz="-0.172253476510556 0.041150000000327 1.637"
        rpy="0 0 -1.5707963267949" />
      <parent
        link="base_link" />
      <child
        link="top_cam" />
      <axis
        xyz="0 0 0" />
    </joint>
    <link
      name="middle_cam" />
    <joint
      name="middle_cam_joint"
      type="fixed">
      <origin
        xyz="-0.172253476510554 0.0411500000003268 1.025"
        rpy="0 0 -1.5707963267949" />
      <parent
        link="base_link" />
      <child
        link="middle_cam" />
      <axis
        xyz="0 0 0" />
    </joint>
    <link
      name="bottom_cam" />
    <joint
      name="bottom_cam_joint"
      type="fixed">
      <origin
        xyz="-0.172253476510552 0.0411500000003266 0.413"
        rpy="0 0 -1.5707963267949" />
      <parent
        link="base_link" />
      <child
        link="bottom_cam" />
      <axis
        xyz="0 0 0" />
    </joint>
    <link
      name="urf_right_link" />
    <joint
      name="urf_right_joint"
      type="fixed">
      <origin
        xyz="0.17884165009831 -0.15 0.133211187882727"
        rpy="0 0 0" />
      <parent
        link="base_link" />
      <child
        link="urf_right_link" />
      <axis
        xyz="0 0 0" />
    </joint>
    <link
      name="urf_rear_link" />
    <joint
      name="urf_rear_joint"
      type="fixed">
      <origin
        xyz="-0.36313 -0.00158789542081382 0.133211187882727"
        rpy="0 0 3.1415926535897931" />
      <parent
        link="base_link" />
      <child
        link="urf_rear_link" />
      <axis
        xyz="0 0 0" />
    </joint>
    <link
      name="urf_left_link" />
    <joint
      name="urf_left_joint"
      type="fixed">
      <origin
        xyz="0.17884165009831 0.15 0.133211187882727"
        rpy="0 0 0" />
      <parent
        link="base_link" />
      <child
        link="urf_left_link" />
      <axis
        xyz="0 0 0" />
    </joint> -->

    <!-- RealSense camera -->
    <!-- <link
      name="depth_cam_link" />
    <joint
      name="depth_cam_joint"
      type="fixed">
      <origin
        xyz="0.157059201989492 0.00610692694567507 0.230098853117374"
        rpy="0 0 0" />
      <parent
        link="base_link" />
      <child
        link="depth_cam_link" />
      <axis
        xyz="0 0 0" />
    </joint> -->

    <!-- <link name="depth_cam_rgb_frame"/>
    <link name="depth_cam_rgb_optical_frame"/>
    <link name="depth_cam_depth_frame"/>
    <link name="depth_cam_depth_optical_frame"/>

    <joint name="depth_cam_rgb_joint" type="fixed">
       <origin xyz="0 -0.0935 0" rpy="0 0 0"/>
       <parent link="depth_cam_link"/>
       <child link="depth_cam_rgb_frame" />
    </joint>

    <joint name="depth_cam_rgb_optical_joint" type="fixed">
      <origin xyz="0 0 0" rpy="${-3.1415926535897931/2} 0 ${-3.1415926535897931/2}" />
      <parent link="depth_cam_rgb_frame" />
      <child link="depth_cam_rgb_optical_frame" />
    </joint>

    <joint name="depth_cam_depth_joint" type="fixed">
      <origin xyz="0 0 0" rpy="0 0 0" />
      <parent link="depth_cam_rgb_frame" />
      <child link="depth_cam_depth_frame" />
    </joint>

    <joint name="depth_cam_depth_optical_joint" type="fixed">
      <origin xyz="0 0 0" rpy="${-3.1415926535897931/2} 0 ${-3.1415926535897931/2}" />
      <parent link="depth_cam_depth_frame" />
      <child link="depth_cam_depth_optical_frame" />
    </joint> -->

    <link
      name="velodyne" />
    <joint
      name="velodyne_joint"
      type="fixed">
      <origin
        xyz="0.0892465234900025 0.00125000000023005 0.328054161265183"
        rpy="0 0 0" />
      <parent
        link="base_link" />
      <child
        link="velodyne" />
      <axis
        xyz="0 0 0" />
    </joint>

</robot>
