Inbound agent connected from 10.244.0.36
Remoting version: 3206.vb_15dcf73f6a_9
Launcher: JNLPLauncher
Communication Protocol: WebSocket
This is a Unix agent
ERROR: Connection terminated
java.nio.channels.ClosedChannelException
	at jenkins.agents.WebSocketAgents$Session.closed(WebSocketAgents.java:157)
	at jenkins.websocket.WebSockets$1.onWebSocketClose(WebSockets.java:88)
	at jenkins.websocket.WebSockets$1.onWebSocketError(WebSockets.java:94)
	at jenkins.websocket.Jetty10Provider$2.onWebSocketError(Jetty10Provider.java:174)
	at org.eclipse.jetty.websocket.common.JettyWebSocketFrameHandler.onError(JettyWebSocketFrameHandler.java:261)
	at org.eclipse.jetty.websocket.core.internal.WebSocketCoreSession.lambda$closeConnection$2(WebSocketCoreSession.java:284)
	at org.eclipse.jetty.server.handler.ContextHandler.handle(ContextHandler.java:1469)
	at org.eclipse.jetty.server.handler.ContextHandler.handle(ContextHandler.java:1488)
	at org.eclipse.jetty.websocket.core.server.internal.AbstractHandshaker$1.handle(AbstractHandshaker.java:212)
	at org.eclipse.jetty.websocket.core.internal.WebSocketCoreSession.closeConnection(WebSocketCoreSession.java:284)
	at org.eclipse.jetty.websocket.core.internal.WebSocketCoreSession.onEof(WebSocketCoreSession.java:254)
	at org.eclipse.jetty.websocket.core.internal.WebSocketConnection.fillAndParse(WebSocketConnection.java:491)
	at org.eclipse.jetty.websocket.core.internal.WebSocketConnection.onFillable(WebSocketConnection.java:349)
	at org.eclipse.jetty.io.AbstractConnection$ReadCallback.succeeded(AbstractConnection.java:314)
	at org.eclipse.jetty.io.FillInterest.fillable(FillInterest.java:100)
	at org.eclipse.jetty.io.SelectableChannelEndPoint$1.run(SelectableChannelEndPoint.java:53)
	at org.eclipse.jetty.util.thread.strategy.AdaptiveExecutionStrategy.runTask(AdaptiveExecutionStrategy.java:421)
	at org.eclipse.jetty.util.thread.strategy.AdaptiveExecutionStrategy.consumeTask(AdaptiveExecutionStrategy.java:390)
	at org.eclipse.jetty.util.thread.strategy.AdaptiveExecutionStrategy.tryProduce(AdaptiveExecutionStrategy.java:277)
	at org.eclipse.jetty.util.thread.strategy.AdaptiveExecutionStrategy.run(AdaptiveExecutionStrategy.java:199)
	at org.eclipse.jetty.util.thread.ReservedThreadExecutor$ReservedThread.run(ReservedThreadExecutor.java:411)
	at org.eclipse.jetty.util.thread.QueuedThreadPool.runJob(QueuedThreadPool.java:969)
	at org.eclipse.jetty.util.thread.QueuedThreadPool$Runner.doRunJob(QueuedThreadPool.java:1194)
	at org.eclipse.jetty.util.thread.QueuedThreadPool$Runner.run(QueuedThreadPool.java:1149)
	at java.base/java.lang.Thread.run(Unknown Source)
ERROR: Connection terminated
java.nio.channels.ClosedChannelException
	at jenkins.agents.WebSocketAgents$Session.closed(WebSocketAgents.java:157)
	at jenkins.websocket.WebSockets$1.onWebSocketClose(WebSockets.java:88)
	at jenkins.websocket.Jetty10Provider$2.onWebSocketClose(Jetty10Provider.java:164)
	at org.eclipse.jetty.websocket.common.JettyWebSocketFrameHandler.notifyOnClose(JettyWebSocketFrameHandler.java:322)
	at org.eclipse.jetty.websocket.common.JettyWebSocketFrameHandler.onClosed(JettyWebSocketFrameHandler.java:306)
	at org.eclipse.jetty.websocket.core.internal.WebSocketCoreSession.lambda$closeConnection$0(WebSocketCoreSession.java:272)
	at org.eclipse.jetty.server.handler.ContextHandler.handle(ContextHandler.java:1451)
	at org.eclipse.jetty.server.handler.ContextHandler.handle(ContextHandler.java:1488)
	at org.eclipse.jetty.websocket.core.server.internal.AbstractHandshaker$1.handle(AbstractHandshaker.java:212)
	at org.eclipse.jetty.websocket.core.internal.WebSocketCoreSession.lambda$closeConnection$1(WebSocketCoreSession.java:272)
	at org.eclipse.jetty.util.Callback$4.completed(Callback.java:184)
	at org.eclipse.jetty.util.Callback$Completing.succeeded(Callback.java:344)
	at org.eclipse.jetty.websocket.common.JettyWebSocketFrameHandler.onError(JettyWebSocketFrameHandler.java:269)
	at org.eclipse.jetty.websocket.core.internal.WebSocketCoreSession.lambda$closeConnection$2(WebSocketCoreSession.java:284)
	at org.eclipse.jetty.server.handler.ContextHandler.handle(ContextHandler.java:1469)
	at org.eclipse.jetty.server.handler.ContextHandler.handle(ContextHandler.java:1488)
	at org.eclipse.jetty.websocket.core.server.internal.AbstractHandshaker$1.handle(AbstractHandshaker.java:212)
	at org.eclipse.jetty.websocket.core.internal.WebSocketCoreSession.closeConnection(WebSocketCoreSession.java:284)
	at org.eclipse.jetty.websocket.core.internal.WebSocketCoreSession.onEof(WebSocketCoreSession.java:254)
	at org.eclipse.jetty.websocket.core.internal.WebSocketConnection.fillAndParse(WebSocketConnection.java:491)
	at org.eclipse.jetty.websocket.core.internal.WebSocketConnection.onFillable(WebSocketConnection.java:349)
	at org.eclipse.jetty.io.AbstractConnection$ReadCallback.succeeded(AbstractConnection.java:314)
	at org.eclipse.jetty.io.FillInterest.fillable(FillInterest.java:100)
	at org.eclipse.jetty.io.SelectableChannelEndPoint$1.run(SelectableChannelEndPoint.java:53)
	at org.eclipse.jetty.util.thread.strategy.AdaptiveExecutionStrategy.runTask(AdaptiveExecutionStrategy.java:421)
	at org.eclipse.jetty.util.thread.strategy.AdaptiveExecutionStrategy.consumeTask(AdaptiveExecutionStrategy.java:390)
	at org.eclipse.jetty.util.thread.strategy.AdaptiveExecutionStrategy.tryProduce(AdaptiveExecutionStrategy.java:277)
	at org.eclipse.jetty.util.thread.strategy.AdaptiveExecutionStrategy.run(AdaptiveExecutionStrategy.java:199)
	at org.eclipse.jetty.util.thread.ReservedThreadExecutor$ReservedThread.run(ReservedThreadExecutor.java:411)
	at org.eclipse.jetty.util.thread.QueuedThreadPool.runJob(QueuedThreadPool.java:969)
	at org.eclipse.jetty.util.thread.QueuedThreadPool$Runner.doRunJob(QueuedThreadPool.java:1194)
	at org.eclipse.jetty.util.thread.QueuedThreadPool$Runner.run(QueuedThreadPool.java:1149)
	at java.base/java.lang.Thread.run(Unknown Source)
java.nio.channels.ClosedChannelException
	at jenkins.agents.WebSocketAgents$Session.closed(WebSocketAgents.java:157)
	at jenkins.websocket.WebSockets$1.onWebSocketClose(WebSockets.java:88)
	at jenkins.websocket.Jetty10Provider$2.onWebSocketClose(Jetty10Provider.java:164)
	at org.eclipse.jetty.websocket.common.JettyWebSocketFrameHandler.notifyOnClose(JettyWebSocketFrameHandler.java:322)
	at org.eclipse.jetty.websocket.common.JettyWebSocketFrameHandler.onClosed(JettyWebSocketFrameHandler.java:306)
	at org.eclipse.jetty.websocket.core.internal.WebSocketCoreSession.lambda$closeConnection$0(WebSocketCoreSession.java:272)
	at org.eclipse.jetty.server.handler.ContextHandler.handle(ContextHandler.java:1451)
	at org.eclipse.jetty.server.handler.ContextHandler.handle(ContextHandler.java:1488)
	at org.eclipse.jetty.websocket.core.server.internal.AbstractHandshaker$1.handle(AbstractHandshaker.java:212)
	at org.eclipse.jetty.websocket.core.internal.WebSocketCoreSession.lambda$closeConnection$1(WebSocketCoreSession.java:272)
	at org.eclipse.jetty.util.Callback$4.completed(Callback.java:184)
	at org.eclipse.jetty.util.Callback$Completing.succeeded(Callback.java:344)
	at org.eclipse.jetty.websocket.common.JettyWebSocketFrameHandler.onError(JettyWebSocketFrameHandler.java:269)
	at org.eclipse.jetty.websocket.core.internal.WebSocketCoreSession.lambda$closeConnection$2(WebSocketCoreSession.java:284)
	at org.eclipse.jetty.server.handler.ContextHandler.handle(ContextHandler.java:1469)
	at org.eclipse.jetty.server.handler.ContextHandler.handle(ContextHandler.java:1488)
	at org.eclipse.jetty.websocket.core.server.internal.AbstractHandshaker$1.handle(AbstractHandshaker.java:212)
	at org.eclipse.jetty.websocket.core.internal.WebSocketCoreSession.closeConnection(WebSocketCoreSession.java:284)
	at org.eclipse.jetty.websocket.core.internal.WebSocketCoreSession.onEof(WebSocketCoreSession.java:254)
	at org.eclipse.jetty.websocket.core.internal.WebSocketConnection.fillAndParse(WebSocketConnection.java:491)
	at org.eclipse.jetty.websocket.core.internal.WebSocketConnection.onFillable(WebSocketConnection.java:349)
	at org.eclipse.jetty.io.AbstractConnection$ReadCallback.succeeded(AbstractConnection.java:314)
	at org.eclipse.jetty.io.FillInterest.fillable(FillInterest.java:100)
	at org.eclipse.jetty.io.SelectableChannelEndPoint$1.run(SelectableChannelEndPoint.java:53)
	at org.eclipse.jetty.util.thread.strategy.AdaptiveExecutionStrategy.runTask(AdaptiveExecutionStrategy.java:421)
	at org.eclipse.jetty.util.thread.strategy.AdaptiveExecutionStrategy.consumeTask(AdaptiveExecutionStrategy.java:390)
	at org.eclipse.jetty.util.thread.strategy.AdaptiveExecutionStrategy.tryProduce(AdaptiveExecutionStrategy.java:277)
	at org.eclipse.jetty.util.thread.strategy.AdaptiveExecutionStrategy.run(AdaptiveExecutionStrategy.java:199)
	at org.eclipse.jetty.util.thread.ReservedThreadExecutor$ReservedThread.run(ReservedThreadExecutor.java:411)
	at org.eclipse.jetty.util.thread.QueuedThreadPool.runJob(QueuedThreadPool.java:969)
	at org.eclipse.jetty.util.thread.QueuedThreadPool$Runner.doRunJob(QueuedThreadPool.java:1194)
	at org.eclipse.jetty.util.thread.QueuedThreadPool$Runner.run(QueuedThreadPool.java:1149)
Caused: hudson.remoting.ChannelClosedException: Channel "hudson.remoting.Channel@3e91f9c2:jenkins-agent": Remote call on jenkins-agent failed. The channel is closing down or has closed down
	at hudson.remoting.Channel.call(Channel.java:996)
	at jenkins.util.SystemProperties$AgentCopier.preOnline(SystemProperties.java:140)
	at hudson.slaves.SlaveComputer.setChannel(SlaveComputer.java:720)
	at jenkins.slaves.DefaultJnlpSlaveReceiver.afterChannel(DefaultJnlpSlaveReceiver.java:176)
	at org.jenkinsci.remoting.engine.JnlpConnectionState.fire(JnlpConnectionState.java:337)
	at org.jenkinsci.remoting.engine.JnlpConnectionState.fireAfterChannel(JnlpConnectionState.java:428)
	at jenkins.agents.WebSocketAgents$Session.lambda$opened$2(WebSocketAgents.java:136)
	at jenkins.util.ContextResettingExecutorService$1.run(ContextResettingExecutorService.java:28)
	at jenkins.security.ImpersonatingExecutorService$1.run(ImpersonatingExecutorService.java:68)
	at jenkins.util.ErrorLoggingExecutorService.lambda$wrap$0(ErrorLoggingExecutorService.java:51)
	at java.base/java.util.concurrent.Executors$RunnableAdapter.call(Unknown Source)
	at java.base/java.util.concurrent.FutureTask.run(Unknown Source)
	at java.base/java.util.concurrent.ThreadPoolExecutor.runWorker(Unknown Source)
	at java.base/java.util.concurrent.ThreadPoolExecutor$Worker.run(Unknown Source)
	at java.base/java.lang.Thread.run(Unknown Source)
