Started at Sun May 19 22:22:37 UTC 2024
Processing curl-clone
Offering curl-clone to Project Build Discarder
Processing omc-assignment
Offering omc-assignment to Project Build Discarder
Processing test-alpine-maven
Offering test-alpine-maven to Project Build Discarder
Processing test-aws-log
Offering test-aws-log to Project Build Discarder
Finished at Sun May 19 22:22:37 UTC 2024. 9ms
Started at Sun May 19 23:22:41 UTC 2024
Processing add-master-logs-2-repo
Offering add-master-logs-2-repo to Project Build Discarder
Processing curl-clone
Offering curl-clone to Project Build Discarder
Processing omc-assignment
Offering omc-assignment to Project Build Discarder
Processing test-alpine-maven
Offering test-alpine-maven to Project Build Discarder
Processing test-aws-log
Offering test-aws-log to Project Build Discarder
Finished at Sun May 19 23:22:41 UTC 2024. 1ms
