Started at Thu May 09 15:03:18 UTC 2024
Processing curl-clone
Offering curl-clone to Project Build Discarder
Processing test-alpine-maven
Offering test-alpine-maven to Project Build Discarder
Finished at Thu May 09 15:03:18 UTC 2024. 1ms
Started at Thu May 09 16:03:18 UTC 2024
Processing curl-clone
Offering curl-clone to Project Build Discarder
Processing test-alpine-maven
Offering test-alpine-maven to Project Build Discarder
Finished at Thu May 09 16:03:18 UTC 2024. 0ms
Started at Thu May 09 17:03:18 UTC 2024
Processing curl-clone
Offering curl-clone to Project Build Discarder
Processing test-alpine-maven
Offering test-alpine-maven to Project Build Discarder
Finished at Thu May 09 17:03:18 UTC 2024. 1ms
Started at Thu May 09 18:03:18 UTC 2024
Processing curl-clone
Offering curl-clone to Project Build Discarder
Processing test-alpine-maven
Offering test-alpine-maven to Project Build Discarder
Finished at Thu May 09 18:03:18 UTC 2024. 0ms
Started at Thu May 09 19:03:18 UTC 2024
Processing curl-clone
Offering curl-clone to Project Build Discarder
Processing test-alpine-maven
Offering test-alpine-maven to Project Build Discarder
Finished at Thu May 09 19:03:18 UTC 2024. 0ms
Started at Thu May 09 20:03:18 UTC 2024
Processing curl-clone
Offering curl-clone to Project Build Discarder
Processing test-alpine-maven
Offering test-alpine-maven to Project Build Discarder
Finished at Thu May 09 20:03:18 UTC 2024. 0ms
Started at Thu May 09 21:03:18 UTC 2024
Processing curl-clone
Offering curl-clone to Project Build Discarder
Processing test-alpine-maven
Offering test-alpine-maven to Project Build Discarder
Finished at Thu May 09 21:03:18 UTC 2024. 1ms
Started at Thu May 09 22:03:18 UTC 2024
Processing curl-clone
Offering curl-clone to Project Build Discarder
Processing test-alpine-maven
Offering test-alpine-maven to Project Build Discarder
Finished at Thu May 09 22:03:18 UTC 2024. 0ms
Started at Thu May 09 23:03:18 UTC 2024
Processing curl-clone
Offering curl-clone to Project Build Discarder
Processing test-alpine-maven
Offering test-alpine-maven to Project Build Discarder
Finished at Thu May 09 23:03:18 UTC 2024. 0ms
