Started at Sun May 19 21:19:35 UTC 2024
Processing curl-clone
Offering curl-clone to Project Build Discarder
Processing omc-assignment
Offering omc-assignment to Project Build Discarder
Processing test-alpine-maven
Offering test-alpine-maven to Project Build Discarder
Finished at Sun May 19 21:19:35 UTC 2024. 1ms
Started at Sun May 19 22:19:39 UTC 2024
Processing curl-clone
Offering curl-clone to Project Build Discarder
Processing omc-assignment
Offering omc-assignment to Project Build Discarder
Processing test-alpine-maven
Offering test-alpine-maven to Project Build Discarder
Finished at Sun May 19 22:19:39 UTC 2024. 1ms
