Started at Fri May 10 12:12:40 UTC 2024
Processing curl-clone
Offering curl-clone to Project Build Discarder
Processing test-alpine-maven
Offering test-alpine-maven to Project Build Discarder
Finished at Fri May 10 12:12:40 UTC 2024. 2ms
Started at Fri May 10 13:12:40 UTC 2024
Processing curl-clone
Offering curl-clone to Project Build Discarder
Processing test-alpine-maven
Offering test-alpine-maven to Project Build Discarder
Finished at Fri May 10 13:12:40 UTC 2024. 0ms
Started at Fri May 10 14:12:40 UTC 2024
Processing curl-clone
Offering curl-clone to Project Build Discarder
Processing test-alpine-maven
Offering test-alpine-maven to Project Build Discarder
Finished at Fri May 10 14:12:40 UTC 2024. 3ms
Started at Fri May 10 15:12:40 UTC 2024
Processing curl-clone
Offering curl-clone to Project Build Discarder
Processing test-alpine-maven
Offering test-alpine-maven to Project Build Discarder
Finished at Fri May 10 15:12:40 UTC 2024. 1ms
Started at Fri May 10 16:12:40 UTC 2024
Processing curl-clone
Offering curl-clone to Project Build Discarder
Processing test-alpine-maven
Offering test-alpine-maven to Project Build Discarder
Finished at Fri May 10 16:12:40 UTC 2024. 0ms
Started at Fri May 10 17:12:40 UTC 2024
Processing curl-clone
Offering curl-clone to Project Build Discarder
Processing test-alpine-maven
Offering test-alpine-maven to Project Build Discarder
Finished at Fri May 10 17:12:40 UTC 2024. 1ms
Started at Fri May 10 18:12:40 UTC 2024
Processing curl-clone
Offering curl-clone to Project Build Discarder
Processing test-alpine-maven
Offering test-alpine-maven to Project Build Discarder
Finished at Fri May 10 18:12:40 UTC 2024. 0ms
Started at Fri May 10 19:12:40 UTC 2024
Processing curl-clone
Offering curl-clone to Project Build Discarder
Processing test-alpine-maven
Offering test-alpine-maven to Project Build Discarder
Finished at Fri May 10 19:12:40 UTC 2024. 0ms
Started at Fri May 10 20:12:40 UTC 2024
Processing curl-clone
Offering curl-clone to Project Build Discarder
Processing test-alpine-maven
Offering test-alpine-maven to Project Build Discarder
Finished at Fri May 10 20:12:40 UTC 2024. 1ms
Started at Fri May 10 21:12:40 UTC 2024
Processing curl-clone
Offering curl-clone to Project Build Discarder
Processing test-alpine-maven
Offering test-alpine-maven to Project Build Discarder
Finished at Fri May 10 21:12:40 UTC 2024. 0ms
Started at Fri May 10 22:12:40 UTC 2024
Processing curl-clone
Offering curl-clone to Project Build Discarder
Processing test-alpine-maven
Offering test-alpine-maven to Project Build Discarder
Finished at Fri May 10 22:12:40 UTC 2024. 0ms
Started at Fri May 10 23:12:40 UTC 2024
Processing curl-clone
Offering curl-clone to Project Build Discarder
Processing test-alpine-maven
Offering test-alpine-maven to Project Build Discarder
Finished at Fri May 10 23:12:40 UTC 2024. 0ms
Started at Sat May 11 00:12:40 UTC 2024
Processing curl-clone
Offering curl-clone to Project Build Discarder
Processing test-alpine-maven
Offering test-alpine-maven to Project Build Discarder
Finished at Sat May 11 00:12:40 UTC 2024. 1ms
