Started at Wed May 15 19:30:35 UTC 2024
Processing add-master-logs-2-repo
Offering add-master-logs-2-repo to Project Build Discarder
Processing omc-assignment
Offering omc-assignment to Project Build Discarder
Processing test-alpine-maven
Offering test-alpine-maven to Project Build Discarder
Processing test-write-to-s3
Offering test-write-to-s3 to Project Build Discarder
Finished at Wed May 15 19:30:35 UTC 2024. 5ms
