<?xml version="1.0" encoding="UTF-8" standalone="no"?>
<svg
   id="chocolate"
   width="1920"
   height="1920"
   viewBox="0 0 1920 1920"
   version="1.1"
   sodipodi:docname="rps_logo_choco_vector.svg"
   inkscape:version="1.2.2 (732a01da63, 2022-12-09)"
   xmlns:inkscape="http://www.inkscape.org/namespaces/inkscape"
   xmlns:sodipodi="http://sodipodi.sourceforge.net/DTD/sodipodi-0.dtd"
   xmlns="http://www.w3.org/2000/svg"
   xmlns:svg="http://www.w3.org/2000/svg">
  <sodipodi:namedview
     id="namedview31"
     pagecolor="#ffffff"
     bordercolor="#000000"
     borderopacity="0.25"
     inkscape:showpageshadow="2"
     inkscape:pageopacity="0.0"
     inkscape:pagecheckerboard="0"
     inkscape:deskcolor="#d1d1d1"
     showgrid="false"
     inkscape:zoom="0.16"
     inkscape:cx="1196.875"
     inkscape:cy="1281.25"
     inkscape:window-width="1920"
     inkscape:window-height="1004"
     inkscape:window-x="-8"
     inkscape:window-y="-8"
     inkscape:window-maximized="1"
     inkscape:current-layer="chocolate" />
  <defs
     id="defs23">
    <linearGradient
       id="linearGradient2060"
       inkscape:swatch="solid">
      <stop
         style="stop-color:#ff0000;stop-opacity:1;"
         offset="0"
         id="stop2058" />
    </linearGradient>
    <style
       id="style21">
      .cls-1 {
        font-size: 499.889px;
        fill: #ddeefa;
        font-family: Arial;
        font-weight: 700;
      }
    </style>
    <clipPath
       clipPathUnits="userSpaceOnUse"
       id="clipPath3465">
      <g
         inkscape:label="Clip"
         id="use3467"
         style="display:inline" />
    </clipPath>
    <pattern
       id="EMFhbasepattern"
       patternUnits="userSpaceOnUse"
       width="6"
       height="6"
       x="0"
       y="0" />
  </defs>
  <path
     id="path2588-73"
     style="fill:#b0b9d8;fill-opacity:1;stroke:none;stroke-width:3.88344;stroke-dasharray:none"
     inkscape:label="Choco_base"
     d="M 449.41097,0 C 430.70852,0 415.65213,14.839804 415.65213,33.273157 V 960 H 1584.348 V 747.50393 A 170.43478,168.7912 0 0 1 1413.9132,578.71267 170.43478,168.7912 0 0 1 1243.4782,409.92149 170.43478,168.7912 0 0 1 1073.0434,241.1303 170.43478,168.7912 0 0 1 902.60866,72.339097 170.43478,168.7912 0 0 1 764.34914,0 Z" />
  <g
     id="g4214"
     inkscape:label="Choco_raw"
     transform="matrix(1.2173913,0,0,1.2151899,-168.69563,-66.835444)">
    <g
       id="g4528"
       inkscape:label="choko_unit"
       transform="translate(2.65088,-4.4108734)">
      <path
         id="rect4525"
         style="fill:#0f2d64;fill-opacity:1;stroke:none;stroke-width:3.479"
         inkscape:label="lower"
         d="m 778.58154,93.178452 -54.58398,54.583988 c 8.20674,9.01511 13.35156,21.8201 13.35156,36.11718 v 81.0625 c 0,27.4057 -18.79269,49.46875 -42.13476,49.46875 h -95.73047 c -11.16492,0 -21.25867,-5.08585 -28.78321,-13.35156 L 516.1167,355.6433 c 5.4225,5.42249 12.92244,8.76757 21.23242,8.76757 h 220 c 16.61996,0 30,-13.38002 30,-30 v -220 c 0,-8.30998 -3.34508,-15.809922 -8.76758,-21.232418 z" />
      <path
         id="path5075"
         style="fill:#6275a3;fill-opacity:1;stroke:none;stroke-width:3.479"
         inkscape:label="upper"
         d="m 537.34912,84.410873 c -16.61996,0 -30,13.380037 -30,29.999997 v 220 c 0,8.30999 3.34508,15.80993 8.76758,21.23243 l 54.58398,-54.58399 c -8.20673,-9.01511 -13.35156,-21.8201 -13.35156,-36.11719 v -81.0625 c 0,-27.40568 18.79268,-49.46875 42.13477,-49.46875 h 95.73047 c 11.16491,0 21.25867,5.08585 28.7832,13.35157 l 54.58398,-54.583988 c -5.42249,-5.422497 -12.92244,-8.767579 -21.23242,-8.767579 z" />
    </g>
    <g
       id="g4528-8"
       inkscape:label="choko_unit"
       transform="translate(312.65088,-4.410871)">
      <path
         id="path2588-73-7"
         style="display:inline;fill:#6275a3;fill-opacity:1;stroke:none;stroke-width:3.18037;stroke-dasharray:none"
         inkscape:label="upper_cut"
         d="m 508.85618,105.21192 c -0.96714,2.96017 -1.50706,6.11759 -1.50706,9.41162 v 219.80605 c 0,8.30265 3.3219,15.79599 8.70681,21.2137 l 54.20568,-54.53586 c -8.14984,-9.00715 -13.25903,-21.80087 -13.25903,-36.08535 v -80.99104 c 0,-14.52151 5.28206,-27.49942 13.67022,-36.52636 a 139.02971,138.77865 0 0 1 -3.73952,-28.35584 139.02971,138.77865 0 0 1 -58.0771,-13.93692 z" />
      <path
         id="path2588-73-8"
         style="fill:#0f2d64;fill-opacity:1;stroke:none;stroke-width:3.18269;stroke-dasharray:none"
         inkscape:label="lower_cut"
         d="m 570.35335,301.05931 -54.23665,54.58398 c 5.38799,5.42249 12.84022,8.76758 21.09731,8.76758 h 218.60011 c 0.62192,0 1.22942,-0.0563 1.8417,-0.0937 a 139.10917,138.9011 0 0 1 -41.364,-57.45703 c -6.43668,4.75984 -14.03274,7.55078 -22.21713,7.55078 h -95.12128 c -11.09387,0 -21.12341,-5.08586 -28.60006,-13.35156 z" />
    </g>
  </g>
  <g
     id="g4214-7"
     inkscape:label="Choco_raw"
     transform="matrix(1.2173913,0,0,1.2151899,-168.69563,309.87342)">
    <g
       id="g4528-88"
       inkscape:label="choko_unit"
       transform="translate(2.65088,-4.4108734)">
      <path
         id="rect4525-25"
         style="fill:#0f2d64;fill-opacity:1;stroke:none;stroke-width:3.479"
         inkscape:label="lower"
         d="m 778.58154,93.178452 -54.58398,54.583988 c 8.20674,9.01511 13.35156,21.8201 13.35156,36.11718 v 81.0625 c 0,27.4057 -18.79269,49.46875 -42.13476,49.46875 h -95.73047 c -11.16492,0 -21.25867,-5.08585 -28.78321,-13.35156 L 516.1167,355.6433 c 5.4225,5.42249 12.92244,8.76757 21.23242,8.76757 h 220 c 16.61996,0 30,-13.38002 30,-30 v -220 c 0,-8.30998 -3.34508,-15.809922 -8.76758,-21.232418 z" />
      <path
         id="path5075-4"
         style="fill:#6275a3;fill-opacity:1;stroke:none;stroke-width:3.479"
         inkscape:label="upper"
         d="m 537.34912,84.410873 c -16.61996,0 -30,13.380037 -30,29.999997 v 220 c 0,8.30999 3.34508,15.80993 8.76758,21.23243 l 54.58398,-54.58399 c -8.20673,-9.01511 -13.35156,-21.8201 -13.35156,-36.11719 v -81.0625 c 0,-27.40568 18.79268,-49.46875 42.13477,-49.46875 h 95.73047 c 11.16491,0 21.25867,5.08585 28.7832,13.35157 l 54.58398,-54.583988 c -5.42249,-5.422497 -12.92244,-8.767579 -21.23242,-8.767579 z" />
    </g>
    <g
       id="g4528-8-6"
       inkscape:label="choko_unit"
       transform="translate(312.65088,-4.410871)">
      <path
         id="rect4525-0-0"
         style="fill:#0f2d64;fill-opacity:1;stroke:none;stroke-width:3.479"
         inkscape:label="lower"
         d="m 778.58154,93.178452 -54.58398,54.583988 c 8.20674,9.01511 13.35156,21.8201 13.35156,36.11718 v 81.0625 c 0,27.4057 -18.79269,49.46875 -42.13476,49.46875 h -95.73047 c -11.16492,0 -21.25867,-5.08585 -28.78321,-13.35156 L 516.1167,355.6433 c 5.4225,5.42249 12.92244,8.76757 21.23242,8.76757 h 220 c 16.61996,0 30,-13.38002 30,-30 v -220 c 0,-8.30998 -3.34508,-15.809922 -8.76758,-21.232418 z" />
      <path
         id="path5075-8-0"
         style="fill:#6275a3;fill-opacity:1;stroke:none;stroke-width:3.479"
         inkscape:label="upper"
         d="m 537.34912,84.410873 c -16.61996,0 -30,13.380037 -30,29.999997 v 220 c 0,8.30999 3.34508,15.80993 8.76758,21.23243 l 54.58398,-54.58399 c -8.20673,-9.01511 -13.35156,-21.8201 -13.35156,-36.11719 v -81.0625 c 0,-27.40568 18.79268,-49.46875 42.13477,-49.46875 h 95.73047 c 11.16491,0 21.25867,5.08585 28.7832,13.35157 l 54.58398,-54.583988 c -5.42249,-5.422497 -12.92244,-8.767579 -21.23242,-8.767579 z" />
    </g>
    <g
       id="g4528-7-1"
       inkscape:label="choko_unit"
       transform="translate(622.65088,-4.410873)">
      <path
         id="path2588-73-5"
         style="fill:#6275a3;fill-opacity:1;stroke:none;stroke-width:3.17958;stroke-dasharray:none"
         inkscape:label="upper_cut"
         d="m 528.76834,86.57298 c -12.40183,3.630022 -21.41922,15.05151 -21.41922,28.67548 v 219.23613 c 0,8.28113 3.3286,15.75504 8.72436,21.1587 l 54.31474,-54.39446 c -8.16632,-8.9838 -13.28574,-21.74435 -13.28574,-35.99178 V 184.476 c 0,-7.47795 1.44195,-14.52916 3.955,-20.86674 a 139.30942,138.41882 0 0 1 -23.85634,-75.932705 139.30942,138.41882 0 0 1 -8.4328,-1.103575 z" />
      <path
         id="path2588-73-56"
         style="fill:#0f2d64;fill-opacity:1;stroke:none;stroke-width:3.17954;stroke-dasharray:none"
         inkscape:label="lower_cut"
         d="m 570.24159,301.05931 -54.12487,54.58398 c 5.37689,5.42249 12.8137,8.76758 21.0538,8.76758 h 218.14947 c 7.08738,0 13.57049,-2.48626 18.66973,-6.6289 a 138.8224,138.9011 0 0 1 -66.66876,-46.08985 c -4.26889,1.73286 -8.83575,2.71875 -13.61312,2.71875 h -94.92516 c -11.07099,0 -21.07989,-5.08586 -28.54109,-13.35156 z" />
    </g>
  </g>
  <g
     id="g4214-9"
     inkscape:label="Choco_raw"
     transform="matrix(1.2173913,0,0,1.2151899,-168.69563,686.58228)">
    <g
       id="g4528-1"
       inkscape:label="choko_unit"
       transform="translate(2.65088,-4.4108734)">
      <path
         id="rect4525-4"
         style="fill:#0f2d64;fill-opacity:1;stroke:none;stroke-width:3.479"
         inkscape:label="lower"
         d="m 778.58154,93.178452 -54.58398,54.583988 c 8.20674,9.01511 13.35156,21.8201 13.35156,36.11718 v 81.0625 c 0,27.4057 -18.79269,49.46875 -42.13476,49.46875 h -95.73047 c -11.16492,0 -21.25867,-5.08585 -28.78321,-13.35156 L 516.1167,355.6433 c 5.4225,5.42249 12.92244,8.76757 21.23242,8.76757 h 220 c 16.61996,0 30,-13.38002 30,-30 v -220 c 0,-8.30998 -3.34508,-15.809922 -8.76758,-21.232418 z" />
      <path
         id="path5075-9"
         style="fill:#6275a3;fill-opacity:1;stroke:none;stroke-width:3.479"
         inkscape:label="upper"
         d="m 537.34912,84.410873 c -16.61996,0 -30,13.380037 -30,29.999997 v 220 c 0,8.30999 3.34508,15.80993 8.76758,21.23243 l 54.58398,-54.58399 c -8.20673,-9.01511 -13.35156,-21.8201 -13.35156,-36.11719 v -81.0625 c 0,-27.40568 18.79268,-49.46875 42.13477,-49.46875 h 95.73047 c 11.16491,0 21.25867,5.08585 28.7832,13.35157 l 54.58398,-54.583988 c -5.42249,-5.422497 -12.92244,-8.767579 -21.23242,-8.767579 z" />
    </g>
    <g
       id="g4528-8-2"
       inkscape:label="choko_unit"
       transform="translate(312.65088,-4.410871)">
      <path
         id="rect4525-0-2"
         style="fill:#0f2d64;fill-opacity:1;stroke:none;stroke-width:3.479"
         inkscape:label="lower"
         d="m 778.58154,93.178452 -54.58398,54.583988 c 8.20674,9.01511 13.35156,21.8201 13.35156,36.11718 v 81.0625 c 0,27.4057 -18.79269,49.46875 -42.13476,49.46875 h -95.73047 c -11.16492,0 -21.25867,-5.08585 -28.78321,-13.35156 L 516.1167,355.6433 c 5.4225,5.42249 12.92244,8.76757 21.23242,8.76757 h 220 c 16.61996,0 30,-13.38002 30,-30 v -220 c 0,-8.30998 -3.34508,-15.809922 -8.76758,-21.232418 z" />
      <path
         id="path5075-8-2"
         style="fill:#6275a3;fill-opacity:1;stroke:none;stroke-width:3.479"
         inkscape:label="upper"
         d="m 537.34912,84.410873 c -16.61996,0 -30,13.380037 -30,29.999997 v 220 c 0,8.30999 3.34508,15.80993 8.76758,21.23243 l 54.58398,-54.58399 c -8.20673,-9.01511 -13.35156,-21.8201 -13.35156,-36.11719 v -81.0625 c 0,-27.40568 18.79268,-49.46875 42.13477,-49.46875 h 95.73047 c 11.16491,0 21.25867,5.08585 28.7832,13.35157 l 54.58398,-54.583988 c -5.42249,-5.422497 -12.92244,-8.767579 -21.23242,-8.767579 z" />
    </g>
    <g
       id="g4528-7-5"
       inkscape:label="choko_unit"
       transform="translate(622.65088,-4.410873)">
      <path
         id="rect4525-2-9"
         style="fill:#0f2d64;fill-opacity:1;stroke:none;stroke-width:3.479"
         inkscape:label="lower"
         d="m 778.58154,93.178452 -54.58398,54.583988 c 8.20674,9.01511 13.35156,21.8201 13.35156,36.11718 v 81.0625 c 0,27.4057 -18.79269,49.46875 -42.13476,49.46875 h -95.73047 c -11.16492,0 -21.25867,-5.08585 -28.78321,-13.35156 L 516.1167,355.6433 c 5.4225,5.42249 12.92244,8.76757 21.23242,8.76757 h 220 c 16.61996,0 30,-13.38002 30,-30 v -220 c 0,-8.30998 -3.34508,-15.809922 -8.76758,-21.232418 z" />
      <path
         id="path5075-5-7"
         style="fill:#6275a3;fill-opacity:1;stroke:none;stroke-width:3.479"
         inkscape:label="upper"
         d="m 537.34912,84.410873 c -16.61996,0 -30,13.380037 -30,29.999997 v 220 c 0,8.30999 3.34508,15.80993 8.76758,21.23243 l 54.58398,-54.58399 c -8.20673,-9.01511 -13.35156,-21.8201 -13.35156,-36.11719 v -81.0625 c 0,-27.40568 18.79268,-49.46875 42.13477,-49.46875 h 95.73047 c 11.16491,0 21.25867,5.08585 28.7832,13.35157 l 54.58398,-54.583988 c -5.42249,-5.422497 -12.92244,-8.767579 -21.23242,-8.767579 z" />
    </g>
  </g>
  <g
     id="g3246"
     inkscape:label="Pack"
     transform="matrix(1.2168595,0,0,1.1034483,-168.18515,-89.310326)">
    <path
       id="rect2176"
       style="fill:#0f2d64;fill-opacity:1;stroke:none;stroke-width:3.34554"
       inkscape:label="pack_outer"
       d="M 1440.2098,950.93749 H 479.79026 v 839.95711 c 0,16.6443 12.37325,30.0429 27.74271,30.0429 h 904.93413 c 15.3694,0 27.7427,-13.3986 27.7427,-30.0429 z" />
    <path
       id="rect2660"
       style="fill:#ddeefa;fill-opacity:1;stroke:none;stroke-width:3.38552"
       inkscape:label="pack_inner"
       d="m 384.74874,950.9375 v 300.5827 L 528.56155,1101.2289 672.37437,1251.5202 816.18718,1101.2289 960,1251.5202 l 143.8128,-150.2913 143.8128,150.2913 143.8128,-150.2913 143.8129,150.2913 V 950.9375 Z" />
  </g>
  <text
     id="by_Tulsky_VA_2023"
     class="cls-1"
     x="563.89667"
     y="1559.186"
     transform="scale(0.83793633,1.1934081)"
     style="font-size:610.87px;stroke-width:9.04298"><tspan
       sodipodi:role="line"
       id="tspan3240"
       x="563.89667"
       y="1559.186"
       inkscape:label="RPS_text"
       style="font-size:610.87px;display:inline;stroke-width:9.04298"
       transform="matrix(1.2639463,0,0,1.165094,-394.1274,-192.39178)">RPS</tspan></text>
</svg>
