Standort ,Abteilung,Ort,Anrede,Titel,Vorname (fakultativ),Name,Nutzername (vorname.nachname),E-Mail,Telefon,Gruppen (klein geschrieben & mit Leerzeichen getrennt),Eigentümer Gruppen (klein geschrieben & mit Leerzeichen getrennt)
Testklinik1,Testabteilung,Testort1,Herr,Dr.,Max1,Mustermann,max.mustermann1,max.mustermann1@napkon.de,123456789,fosa-infektiologie site-uk-koeln,
Testklinik2,,Testort2,Herr,Dr.,Max2,Mustermann,max.mustermann2,max.mustermann2@napkon.de,123456790,fosa-infektiologie site-uk-koeln,
Testklinik3,Testabteilung,,Herr,Dr.,Max3,Mustermann,max.mustermann3,max.mustermann3@napkon.de,123456791,fosa-infektiologie site-uk-koeln,
,Testabteilung,Testort4,Herr,Dr.,Max4,Mustermann,max.mustermann4,max.mustermann4@napkon.de,123456792,fosa-infektiologie site-uk-koeln,
Testklinik5,Testabteilung,Testort5,Herr,Dr.,Max5,Mustermann,max.mustermann5,max.mustermann5@napkon.de,123456793,fosa-infektiologie site-uk-koeln,
Testklinik6,Testabteilung,Testort6,,Dr.,Max6,Mustermann,max.mustermann6,max.mustermann6@napkon.de,123456794,fosa-infektiologie site-uk-koeln,
Testklinik7,Testabteilung,Testort7,Herr,Dr.,Max7,Mustermann,max.mustermann7,max.mustermann7@napkon.de,123456795,fosa-infektiologie site-uk-koeln,
Testklinik8,Testabteilung,Testort8,Herr,,Max8,Mustermann,max.mustermann8,max.mustermann8@napkon.de,123456796,fosa-infektiologie site-uk-koeln,
Testklinik9,Testabteilung,Testort9,Herr,Dr.,,Mustermann,max.mustermann9,max.mustermann9@napkon.de,123456797,fosa-infektiologie site-uk-koeln,
Testklinik10,Testabteilung,Testort10,Herr,Dr.,Max10,,max.mustermann10,max.mustermann10@napkon.de,123456798,fosa-infektiologie site-uk-koeln,
