{
  "name": "discourse-theme",
  "about_url": "https://github.com/awesomerobot/minima/tree/master",
  "license_url": "https://github.com/awesomerobot/minima/blob/master/LICENSE",
  "color_schemes": {}
}