{
  "CLIENT_ID": "clientidhere",
  "SECRET": "clientsecrethere",
  "TOKEN_URL": "https://sso.studyhub.nfdi4health.de/realms/nfdi4health/protocol/openid-connect/token",
  "UPLOAD_URL": "https://csh.nfdi4health.de/api/resource/",
  "SOURCE_DIR": "path/to/study_files/"
}
