<?xml version="1.0" encoding="UTF-8"?>
<svg xmlns="http://www.w3.org/2000/svg" xmlns:v="https://vecta.io/nano" width="104" height="60" fill="none">
    <path
        d="M101.939 19.188c0-9.483-7.739-17.147-17.271-17.147-7.556 0-13.992 4.833-16.334 11.546C65.992 6.873 59.576 2.04 52 2.04S37.967 6.893 35.646 13.647A17.28 17.28 0 0 0 19.332 2.142c-9.552 0-17.271 7.684-17.271 17.147S9.8 36.436 19.332 36.436c7.576 0 14.033-4.853 16.354-11.607C38.049 31.522 44.444 36.314 52 36.314s13.992-4.833 16.334-11.546c2.342 6.713 8.758 11.546 16.334 11.546 9.532.02 17.271-7.664 17.271-17.127"
        fill="#fc9"></path>
    <g fill-rule="evenodd">
        <path
            d="M54.159 2.162L52 2.02c-1.202 0-2.383.121-3.523.364l5.051 9.423-.244.121-5.071-9.483c-5.866 1.314-10.57 5.54-12.525 11.081l18.493 2.588.367-1.618.265.061-3.829 16.419c.733.243 1.263.93 1.263 1.739 0 .04-.005.086-.01.131h0c-.005.046-.01.091-.01.131l6.354 2.042c3.238-1.335 5.988-3.62 7.882-6.531l-3.849-17.956c-.367 0-.692-.142-.957-.384l-4.745 3.559-.122-.182 4.746-3.539c-.163-.222-.244-.485-.244-.789 0-.586.387-1.092.896-1.294l-1.242-3.417c-1.935-1.173-4.134-1.961-6.477-2.285v10.11h-.285V2.162h-.02zm-30.346.566c-1.426-.384-2.933-.586-4.481-.586-1.833 0-3.585.283-5.234.809l-7.23 19.715c.244.121.428.303.57.526l20.794-10.07-.012-.042a1.28 1.28 0 0 1-.069-.382c0-.465.244-.89.591-1.132l-4.929-8.836zM2.285 16.518C3.324 10.21 7.804 5.074 13.772 3.051L6.623 22.564a1.16 1.16 0 0 0-.367-.061 1.31 1.31 0 0 0-.57.121l-3.401-6.107zm61.731-7.502h1.894c-.305-.425-.652-.829-.998-1.213l-1.039.768a1.43 1.43 0 0 1 .143.445zm4.318 15.772a18.03 18.03 0 0 1-1.629 3.397l-3.768-17.653a1.36 1.36 0 0 0 1.1-1.254h2.077c.916 1.314 1.69 2.77 2.22 4.307.529-1.557 1.283-2.993 2.22-4.307h23.279c.02.303.102.586.244.829L69.413 27.256a17.76 17.76 0 0 1-1.079-2.467zm33.605-5.601a17.01 17.01 0 0 0-2.709-9.221l-1.772-.303a1.83 1.83 0 0 1-1.772 1.375c-.031 0-.056-.005-.082-.01s-.051-.01-.082-.01l-2.811 17.471c.346.081.652.283.896.526l7.597-4.893c.468-1.577.733-3.215.733-4.934zm-7.841 14.377c3.259-2.103 5.764-5.278 6.985-9.039l-7.291 4.711c.204.283.306.647.306 1.031a1.83 1.83 0 0 1-.876 1.557l.876 1.739zm-9.43 2.77c-2.322 0-4.521-.445-6.538-1.274l12.464-4.024c.285.607.916 1.031 1.65 1.031.265 0 .509-.04.733-.141l.876 1.779c-2.648 1.658-5.804 2.629-9.185 2.629zm-15.112-8.836a17.29 17.29 0 0 0 8.187 7.401l12.77-4.125c-.061-.162-.081-.344-.081-.526 0-1.011.835-1.84 1.853-1.84a.56.56 0 0 1 .092.01.56.56 0 0 0 .092.01l2.79-17.471c-.407-.101-.754-.324-.998-.627L69.556 27.498zm-17.373 8.836l-.957-1.961c.448-.222.815-.627.957-1.112l6.008 1.941a17.42 17.42 0 0 1-6.008 1.132zm-7.23-1.476c2.118.95 4.46 1.476 6.925 1.496l-.916-1.86a1.53 1.53 0 0 1-.529.081 1.83 1.83 0 0 1-1.609-.95l-3.87 1.233zm-9.267-10.009c-.672 1.961-1.69 3.761-2.994 5.338l-2.872-16.116c.489-.101.896-.465 1.039-.93l23.259 3.235-3.381 14.539c-.102-.02-.204-.04-.305-.04-1.018 0-1.853.829-1.853 1.84 0 .222.041.425.122.627l-4.114 1.335c-4.134-1.941-7.373-5.48-8.9-9.827zM7.825 32.088c3.055 2.71 7.088 4.368 11.507 4.368 5.255 0 9.959-2.325 13.116-5.985l-2.912-16.358a1.39 1.39 0 0 1-1.202-.708L7.56 23.474c.041.142.081.283.081.445a1.35 1.35 0 0 1-1.039 1.314l1.222 6.855zm-.346-.303a17.45 17.45 0 0 1-3.809-5.237l1.67-1.638c.244.223.55.344.896.344h.081l1.161 6.531zm-2.037-9.018l-3.218-5.783c-.102.748-.163 1.537-.163 2.325a16.94 16.94 0 0 0 1.487 6.976l1.609-1.557c-.183-.243-.305-.526-.305-.849.02-.445.244-.849.591-1.112zM24.179 2.829a17.29 17.29 0 0 1 11.426 10.697l-4.684-.647c.02-.04.02-.101.02-.142 0-.768-.611-1.375-1.385-1.375-.204 0-.387.04-.55.101l-4.827-8.634zM61.308 4.73a17.75 17.75 0 0 1 3.422 2.851l-.998.748c-.265-.303-.652-.506-1.08-.506-.061 0-.142 0-.204.02L61.308 4.73zm31.914-.445a17.32 17.32 0 0 0-8.574-2.265c-5.703 0-10.754 2.75-13.91 6.976h23.075c.061-.627.448-1.173.998-1.436l-1.589-3.276zm.428.243c2.139 1.314 3.972 3.053 5.377 5.116l-1.528-.263c0-.03.005-.061.01-.091a.55.55 0 0 0 .01-.091c0-1.011-.835-1.84-1.853-1.84-.204 0-.387.04-.57.101L93.65 4.528z"
            fill="#ec6825"></path>
        <path
            d="M7.295 56.414c-.468.344-1.1.526-1.914.526-.55 0-1.018-.101-1.426-.324a2.28 2.28 0 0 1-.978-.93c-.224-.404-.346-.869-.346-1.415s.122-1.011.346-1.415a2.53 2.53 0 0 1 .978-.93c.407-.222.876-.323 1.426-.323a3.59 3.59 0 0 1 .978.121c.305.061.55.202.794.364v.89c-.224-.182-.468-.324-.754-.404a3.54 3.54 0 0 0-.957-.121 2.15 2.15 0 0 0-.957.222 1.54 1.54 0 0 0-.672.627 1.91 1.91 0 0 0-.244.971 1.91 1.91 0 0 0 .244.971c.163.263.367.485.652.627a2.08 2.08 0 0 0 .957.222c.387 0 .692-.061.937-.182v-1.153h-.876v-.728h1.813v2.386zm54.053.526a2.86 2.86 0 0 0 1.385-.344c.407-.223.733-.546.978-.93.244-.404.367-.869.367-1.375s-.122-.991-.367-1.395-.57-.728-.978-.95-.876-.344-1.385-.344a2.86 2.86 0 0 0-1.385.344c-.407.223-.733.546-.978.95s-.367.869-.367 1.395.122.991.367 1.395a2.53 2.53 0 0 0 .978.93c.407.222.876.324 1.385.324zm37.495 0c.815 0 1.446-.182 1.915-.526v-2.386h-1.813v.728h.876v1.153c-.244.121-.55.182-.937.182a2.09 2.09 0 0 1-.957-.222c-.285-.141-.489-.364-.652-.627a1.91 1.91 0 0 1-.244-.971 1.91 1.91 0 0 1 .244-.971 1.54 1.54 0 0 1 .672-.627 2.15 2.15 0 0 1 .957-.222 3.54 3.54 0 0 1 .957.121c.285.081.529.222.753.404v-.89c-.244-.162-.489-.303-.794-.364-.285-.081-.611-.121-.978-.121-.55 0-1.018.101-1.426.323a2.53 2.53 0 0 0-.978.93c-.224.404-.346.87-.346 1.415s.122 1.011.346 1.415a2.28 2.28 0 0 0 .978.93c.407.222.876.324 1.426.324zm-8.004-.101h.937V53.28l2.403 3.559h.876v-5.116h-.937v3.559l-2.403-3.559h-.876v5.116zm-1.69-.465c-.367.384-.916.566-1.65.566s-1.263-.182-1.65-.566c-.367-.384-.55-.89-.55-1.537v-3.114h.937v3.134c0 .404.122.728.346.93.224.222.529.324.916.324s.692-.121.916-.324c.224-.222.346-.526.346-.93v-3.134h.937v3.114c0 .647-.183 1.153-.55 1.537zm-9.328.465h.937v-2.224h2.464v2.224h.937v-5.116h-.937v2.123h-2.464v-2.123h-.937v5.116zm-1.039-1.314v.89c-.448.344-1.059.526-1.833.526-.53 0-1.018-.101-1.426-.303a2.28 2.28 0 0 1-.978-.93 2.86 2.86 0 0 1-.346-1.416c0-.546.122-1.011.346-1.415a2.53 2.53 0 0 1 .978-.93c.407-.222.876-.324 1.426-.324.692 0 1.303.162 1.772.506v.89c-.407-.364-.978-.546-1.69-.546-.387 0-.713.081-.998.222a1.54 1.54 0 0 0-.672.627c-.163.283-.244.586-.244.971s.081.708.244.971a1.67 1.67 0 0 0 .672.627c.285.142.611.222.978.222s.692-.061.978-.142c.285-.101.55-.243.794-.445zm-7.23 1.415c.652 0 1.12-.121 1.466-.384.326-.243.489-.607.489-1.051 0-.263-.041-.485-.142-.667a1.44 1.44 0 0 0-.448-.485c-.204-.142-.468-.283-.815-.425l-.573-.243-.14-.061c-.122-.061-.244-.142-.305-.243a.56.56 0 0 1-.122-.364c0-.202.082-.364.265-.485.163-.121.407-.162.733-.162.428 0 .876.101 1.303.303v-.768c-.224-.101-.448-.162-.672-.222h0 0c-.224-.041-.489-.061-.774-.061-.367 0-.672.061-.957.182s-.489.283-.631.505-.224.465-.224.728c0 .364.102.647.326.89s.57.465 1.039.647l.692.303c.143.081.265.162.346.263a.58.58 0 0 1 .122.384c0 .222-.081.384-.265.506-.163.121-.428.182-.754.182a3.53 3.53 0 0 1-.794-.081c-.265-.061-.529-.142-.774-.263v.789c.183.101.428.162.733.222a5.96 5.96 0 0 0 .876.061zm-5.519-4.449v1.678h1.039c.306 0 .55-.061.733-.202a.74.74 0 0 0 .285-.627c0-.566-.346-.849-1.018-.849h-1.039zm-.937 4.347h.937v-1.88h1.018l.998 1.88h.957l-1.039-1.961c.346-.121.611-.303.794-.566a1.64 1.64 0 0 0 .285-.95c0-.526-.163-.93-.468-1.213s-.754-.425-1.324-.425h-2.159v5.116zm-4.644-.95a1.89 1.89 0 0 0 .896.222 1.9 1.9 0 0 0 .896-.222 1.5 1.5 0 0 0 .652-.627 1.91 1.91 0 0 0 .244-.971c0-.364-.102-.667-.244-.95a1.5 1.5 0 0 0-.631-.647 1.83 1.83 0 0 0-.896-.222 1.92 1.92 0 0 0-.916.222 1.67 1.67 0 0 0-.652.647c-.163.263-.244.586-.244.95 0 .384.082.688.244.971.163.263.387.485.652.627zm-4.929.95h-.937v-5.096h3.483v.768h-2.546v1.436h1.894v.688h-1.894v2.204zm-3.91.101c.652 0 1.12-.121 1.466-.384.326-.243.489-.607.489-1.051 0-.263-.041-.485-.142-.667a1.44 1.44 0 0 0-.448-.485c-.204-.142-.468-.283-.815-.425l-.572-.243h0 0 0l-.001-.001-.139-.06c-.122-.061-.244-.142-.306-.243s-.122-.222-.122-.364c0-.202.082-.364.265-.485.163-.121.407-.162.733-.162.428 0 .876.101 1.303.303v-.768c-.224-.101-.448-.162-.672-.222h0 0c-.224-.041-.489-.061-.774-.061-.367 0-.672.061-.957.182s-.489.283-.631.505-.224.465-.224.728c0 .364.102.647.326.89s.57.465 1.039.647l.693.303c.143.081.265.162.346.263a.58.58 0 0 1 .122.384c0 .222-.081.384-.265.506-.163.121-.428.182-.754.182a3.53 3.53 0 0 1-.794-.081c-.265-.061-.529-.142-.774-.263v.789c.183.101.428.162.733.222a5.96 5.96 0 0 0 .876.061zm-3.747-.101h-.937v-4.347h-1.548v-.768h4.033v.768h-1.548v4.347zm-4.297 0h.937v-5.116h-.937v5.116zm-.957 0h-3.483v-5.096h3.483v.768h-2.546v1.395h1.894v.768h-1.894v1.395h2.546v.768zm-9.002 0h.937v-2.224h2.464v2.224h.937v-5.116h-.937v2.123h-2.464v-2.123h-.937v5.116zm-4.562-4.347v3.579h.692c.611 0 1.059-.162 1.385-.485s.489-.768.489-1.335c0-.344-.061-.647-.204-.91a1.52 1.52 0 0 0-.611-.627c-.265-.142-.57-.222-.937-.222h-.815zm-.917 4.347h1.65c.896 0 1.589-.222 2.077-.647.489-.445.733-1.072.733-1.921 0-.526-.102-.971-.326-1.335-.224-.384-.53-.667-.957-.869-.407-.202-.896-.303-1.466-.303H28.11v5.075h.02zm-4.481 0h-.937v-5.116h.876l2.403 3.559v-3.559h.937v5.116h-.876l-2.403-3.559v3.559zm-4.257.101c.733 0 1.283-.182 1.65-.566s.55-.89.55-1.537v-3.114h-.937v3.134c0 .404-.122.708-.346.93-.224.202-.53.324-.916.324s-.692-.101-.916-.324c-.224-.202-.346-.526-.346-.93v-3.134h-.937v3.114c0 .647.183 1.153.55 1.537s.916.566 1.65.566zm-3.686-.384c-.346.263-.815.384-1.466.384a5.96 5.96 0 0 1-.876-.061c-.305-.061-.55-.121-.733-.222v-.789c.244.121.509.202.774.263a3.53 3.53 0 0 0 .794.081c.326 0 .591-.061.754-.182.183-.121.265-.283.265-.506a.58.58 0 0 0-.122-.384c-.081-.101-.204-.182-.346-.263s-.387-.182-.692-.303c-.468-.182-.815-.404-1.039-.647s-.326-.526-.326-.89a1.33 1.33 0 0 1 .224-.728c.143-.223.367-.384.631-.505a2.38 2.38 0 0 1 .957-.182c.285 0 .55.02.774.061.224.061.448.121.672.222v.768a3.07 3.07 0 0 0-1.303-.303c-.326 0-.57.04-.733.162-.183.121-.265.283-.265.485a.56.56 0 0 0 .122.364c.061.101.183.182.306.243l.14.061.573.243c.346.142.611.283.815.425a1.44 1.44 0 0 1 .448.485c.102.182.142.404.142.667 0 .445-.142.789-.489 1.051zm-7.393.283h3.483v-.768H9.251v-1.395h1.894v-.768H9.251v-1.395h2.546v-.768H8.314v5.096zm16.7-8.775c.652 0 1.12-.121 1.466-.384.326-.243.489-.607.489-1.051 0-.263-.041-.485-.143-.667a1.44 1.44 0 0 0-.448-.485c-.204-.142-.468-.283-.815-.425l-.573-.243h0 0 0l-.14-.06a.9.9 0 0 1-.305-.243c-.081-.101-.122-.223-.122-.364 0-.202.081-.364.265-.485.163-.121.407-.162.733-.162.428 0 .876.101 1.303.303v-.768c-.224-.101-.448-.162-.672-.222-.224-.04-.489-.061-.774-.061-.367 0-.672.061-.957.182-.265.121-.489.283-.631.506a1.34 1.34 0 0 0-.224.728c0 .364.102.647.326.89s.57.465 1.039.647l.692.303c.143.081.265.162.346.263a.58.58 0 0 1 .122.384.56.56 0 0 1-.265.506c-.163.121-.428.182-.754.182-.265 0-.53-.02-.794-.081s-.53-.142-.774-.263v.789c.183.101.428.162.733.222.265.04.57.061.876.061zm7.454-1.416v.89c-.448.344-1.059.526-1.833.526-.53 0-1.018-.101-1.426-.303a2.28 2.28 0 0 1-.978-.93c-.224-.404-.346-.87-.346-1.415s.122-1.011.346-1.415a2.53 2.53 0 0 1 .978-.93c.407-.222.876-.323 1.426-.323.692 0 1.303.162 1.772.505v.89c-.407-.364-.978-.546-1.69-.546-.387 0-.713.081-.998.223s-.509.364-.672.627a1.91 1.91 0 0 0-.244.971c0 .384.082.708.244.971a1.67 1.67 0 0 0 .672.627c.285.142.611.222.978.222s.692-.061.978-.142c.285-.101.55-.243.794-.445zm1.263 1.314h.937v-2.224h2.464v2.224h.937v-5.116h-.937v2.123h-2.464v-2.123h-.937v5.116zm9.206 0h-3.483v-5.116h3.483v.789h-2.546v1.395h1.894v.768h-1.894v1.395h2.546v.768zm4.216 0h3.951v-.768h-2.811l2.688-3.741v-.607h-3.768v.768h2.627l-2.688 3.741v.607zm8.697 0h-3.483v-5.116h3.483v.789h-2.546v1.395h1.894v.768h-1.894v1.395h2.546v.768zm1.181 0h.916v-3.559l2.403 3.559h.876v-5.116h-.937v3.559l-2.383-3.559h-.876v5.116zm7.801 0h-.937v-4.347h-1.548v-.768h4.033v.768h-1.548v4.347zm2.668 0h.937v-1.88h1.018l.998 1.88h.957L70.371 46c.346-.121.611-.303.794-.566a1.64 1.64 0 0 0 .285-.95c0-.526-.163-.93-.468-1.213s-.754-.425-1.324-.425h-2.159v5.116zm5.173 0h3.483v-.768H73.61v-1.395h1.894v-.768H73.61v-1.395h2.546v-.789h-3.483v5.116zm5.601 0h-.937v-5.116h.876l2.403 3.559v-3.559h.937v5.116h-.876l-2.403-3.559v3.559zm13.564 0h3.483v-.768h-2.546v-1.395h1.894v-.768h-1.894v-1.395h2.546v-.789h-3.483v5.116zm5.58 0h-.937v-5.116h2.159c.57 0 1.018.142 1.324.425s.469.688.469 1.213a1.64 1.64 0 0 1-.285.95c-.183.262-.448.445-.795.566l1.039 1.961h-.957l-.998-1.88h-1.018v1.88zm0-4.347v1.678h1.039c.306 0 .55-.061.733-.202s.285-.344.285-.627c0-.566-.346-.849-1.018-.849h-1.039zm-10.367 0v3.579h.692c.611 0 1.059-.162 1.385-.485s.489-.768.489-1.335c0-.344-.061-.647-.204-.91a1.52 1.52 0 0 0-.611-.627 1.94 1.94 0 0 0-.937-.222h-.815zm-.937 4.347h1.65c.896 0 1.589-.222 2.077-.647.489-.445.733-1.072.733-1.921 0-.526-.102-.971-.326-1.335-.224-.384-.53-.667-.957-.869-.407-.202-.896-.303-1.466-.303h-1.711v5.075zm-17.699-4.347v1.678h1.039c.305 0 .55-.061.733-.202s.285-.344.285-.627c0-.566-.346-.849-1.018-.849h-1.039zm-47.352 4.347h-.937v-4.347h-1.548v-.768h4.033v.768h-1.548v4.347zm-5.764.101c.733 0 1.283-.182 1.65-.566s.55-.89.55-1.537v-3.114h-.937v3.134c0 .404-.122.708-.346.93-.224.202-.53.324-.917.324s-.693-.101-.917-.324c-.224-.202-.346-.526-.346-.93v-3.134H13.1v3.114c0 .647.183 1.153.55 1.537.387.384.937.566 1.65.566zm-3.34-.101H8.477v-5.116h3.483v.789H9.413v1.395h1.894v.768H9.413v1.395h2.546v.768zm-8.249-.768v-3.579h.815a1.94 1.94 0 0 1 .937.222 1.52 1.52 0 0 1 .611.627c.143.263.204.566.204.91 0 .566-.163 1.011-.489 1.335s-.774.485-1.385.485h-.692zm.713.768h-1.65-.02v-5.075h1.731c.57 0 1.059.101 1.466.303a2.1 2.1 0 0 1 .957.869c.224.364.326.809.326 1.335 0 .849-.244 1.476-.733 1.921-.489.425-1.181.647-2.077.647z"
            fill="#1d1d1b"></path>
        <path
            d="M26.521 14.901c.733 1.254 1.1 2.71 1.1 4.408 0 2.79-.815 4.893-2.444 6.289-1.629 1.436-3.89 2.143-6.802 2.143h-5.662V11.018h5.845c1.833 0 3.442.344 4.807 1.011s2.424 1.618 3.157 2.871zm-3.992 8.371c.917-.95 1.365-2.265 1.365-3.963 0-.991-.204-1.901-.591-2.71-.387-.789-.978-1.415-1.752-1.86s-1.69-.667-2.729-.667h-2.444v10.636h2.2c1.711 0 3.035-.485 3.951-1.436z"
            fill="#fff"></path>
    </g>
    <path
        d="M45 28h14v-3.083h-9.175l8.68-11.429V11h-13.29v3.083h8.486L45 25.554V28zm40.861 1c2.543 0 4.589-.564 6.139-1.671v-8.332h-6.119v2.777h2.662v3.341c-.715.355-1.57.543-2.543.543-1.073 0-2.007-.23-2.821-.689a4.62 4.62 0 0 1-1.887-1.963c-.437-.856-.675-1.838-.675-2.986 0-1.128.238-2.109.735-2.944.477-.835 1.152-1.483 1.987-1.942s1.788-.689 2.841-.689c1.133 0 2.126.146 3.02.418s1.669.71 2.364 1.295v-3.592a8.06 8.06 0 0 0-2.523-1.19c-.914-.25-1.968-.376-3.16-.376-1.748 0-3.298.376-4.649 1.107a7.58 7.58 0 0 0-3.119 3.132C77.378 16.596 77 18.183 77 20.021s.377 3.425 1.113 4.761a7.7 7.7 0 0 0 3.119 3.132c1.311.71 2.861 1.086 4.629 1.086"
        fill="#fff"></path>
</svg>
