<?xml version="1.0" encoding="UTF-8" standalone="no"?>
<svg
   xmlns:dc="http://purl.org/dc/elements/1.1/"
   xmlns:cc="http://creativecommons.org/ns#"
   xmlns:rdf="http://www.w3.org/1999/02/22-rdf-syntax-ns#"
   xmlns:svg="http://www.w3.org/2000/svg"
   xmlns="http://www.w3.org/2000/svg"
   xmlns:sodipodi="http://sodipodi.sourceforge.net/DTD/sodipodi-0.dtd"
   xmlns:inkscape="http://www.inkscape.org/namespaces/inkscape"
   width="500"
   height="350"
   viewBox="0 0 132.29166 92.604169"
   version="1.1"
   id="svg8"
   inkscape:version="1.0.1 (3bc2e813f5, 2020-09-07)"
   sodipodi:docname="tmux.svg"
   inkscape:export-filename="D:\work\iconwork\edited-final\tmux.png"
   inkscape:export-xdpi="96"
   inkscape:export-ydpi="96">
  <defs
     id="defs2" />
  <sodipodi:namedview
     id="base"
     pagecolor="#ffffff"
     bordercolor="#666666"
     borderopacity="1.0"
     inkscape:pageopacity="0.0"
     inkscape:pageshadow="2"
     inkscape:zoom="1.488411"
     inkscape:cx="274.77304"
     inkscape:cy="147.1627"
     inkscape:document-units="mm"
     inkscape:current-layer="layer1"
     inkscape:document-rotation="0"
     showgrid="false"
     units="px"
     inkscape:window-width="1456"
     inkscape:window-height="1018"
     inkscape:window-x="452"
     inkscape:window-y="1152"
     inkscape:window-maximized="0" />
  <metadata
     id="metadata5">
    <rdf:RDF>
      <cc:Work
         rdf:about="">
        <dc:format>image/svg+xml</dc:format>
        <dc:type
           rdf:resource="http://purl.org/dc/dcmitype/StillImage" />
        <dc:title></dc:title>
      </cc:Work>
    </rdf:RDF>
  </metadata>
  <g
     inkscape:label="Layer 1"
     inkscape:groupmode="layer"
     id="layer1">
    <g
       id="g1846"
       transform="translate(0,2.23915)">
      <path
         id="path688"
         d="m 84.830896,72.730766 7.00689,14.013796 H 66.145835 40.453881 l 7.006897,-14.013796 z"
         fill="#7f8c8d"
         style="fill-rule:nonzero;stroke-width:2.33563" />
      <g
         id="g1825"
         transform="matrix(0.98514772,0,0,0.98514772,0.69997531,0.19563763)">
        <path
           id="Shape"
           d="m 81.921564,1.2035424 h 45.795246 c 2.61721,0.081535 4.64476,1.5520154 4.53958,3.2923259 V 70.336356 c 0.10518,1.740311 -1.92237,3.210792 -4.53958,3.292326 H 5.1482516 C 2.5310454,73.547148 0.50349528,72.076667 0.60867518,70.336356 V 4.4958683 C 0.50349528,2.7555578 2.5310454,1.2850774 5.1482516,1.2035424 Z"
           fill="#f0c419"
           style="fill-rule:nonzero;stroke-width:1.85062" />
        <path
           id="path686"
           d="M 44.364219,43.451541 V 73.628682 H 3.6250777 C 1.8864959,73.547139 0.53914764,72.078529 0.60736312,70.339374 V 43.451541 Z"
           fill="#955ba5"
           style="fill-rule:nonzero;stroke-width:1.50886" />
        <rect
           style="fill:#f29c1f;fill-opacity:1;stroke-width:0.196487"
           id="rect1651"
           width="43.655285"
           height="41.894608"
           x="44.571117"
           y="1.5569303" />
        <path
           id="path691"
           d="m 66.981986,38.924969 c -0.833319,0 -1.508857,-0.675538 -1.508857,-1.508857 v -3.017714 c 0,-0.833319 0.675538,-1.508857 1.508857,-1.508857 0.833319,0 1.508857,0.675538 1.508857,1.508857 v 3.017714 c 0,0.833319 -0.675538,1.508857 -1.508857,1.508857 z"
           fill="#35495e"
           style="fill-rule:nonzero;stroke-width:1.50886" />
        <path
           id="path693"
           d="m 21.746451,38.924969 c -0.833319,0 -1.508857,-0.675538 -1.508857,-1.508857 v -3.017714 c 0,-0.833319 0.675538,-1.508857 1.508857,-1.508857 0.833319,0 1.508857,0.675538 1.508857,1.508857 v 3.017714 c 0,0.833319 -0.675538,1.508857 -1.508857,1.508857 z"
           fill="#35495e"
           style="fill-rule:nonzero;stroke-width:1.50886" />
        <path
           id="path695"
           d="M 38.32879,8.7478278 H 6.6427916 c -0.8333188,0 -1.508857,-0.6755382 -1.508857,-1.508857 0,-0.8333187 0.6755382,-1.5088569 1.508857,-1.5088569 H 38.32879 c 0.833319,0 1.508857,0.6755382 1.508857,1.5088569 0,0.8333188 -0.675538,1.508857 -1.508857,1.508857 z"
           fill="#ecf0f1"
           style="fill-rule:nonzero;stroke-width:1.50886" />
        <path
           id="path697"
           d="M 82.085646,8.7478278 H 50.399647 c -0.833319,0 -1.508857,-0.6755382 -1.508857,-1.508857 0,-0.8333187 0.675538,-1.5088569 1.508857,-1.5088569 h 31.685999 c 0.833319,0 1.508856,0.6755382 1.508856,1.5088569 0,0.8333188 -0.675537,1.508857 -1.508856,1.508857 z"
           fill="#ecf0f1"
           style="fill-rule:nonzero;stroke-width:1.50886" />
        <path
           id="path701"
           d="m 60.946558,64.575539 c 0,-0.671441 -0.03319,-4.733284 0,-6.035427 0,0 1.508857,-16.597429 3.017714,-21.124 H 69.9997 c 1.508857,4.526571 3.017714,21.124 3.017714,21.124 0.03319,1.302143 0,5.363986 0,6.035427 z"
           fill="#3f5c6c"
           style="fill-rule:nonzero;stroke-width:1.50886" />
        <path
           id="path703"
           d="M 73.017414,58.540112 H 60.946558 l 6.035428,-6.035429 z"
           fill="#547580"
           style="fill-rule:nonzero;stroke-width:1.50886" />
        <path
           id="path705"
           d="m 15.711023,64.575539 c 0,-0.671441 -0.03319,-4.733284 0,-6.035427 0,0 1.508857,-16.597429 3.017714,-21.124 h 6.035428 c 1.508857,4.526571 3.017714,21.124 3.017714,21.124 0.03319,1.302143 0,5.363986 0,6.035427 z"
           fill="#3f5c6c"
           style="fill-rule:nonzero;stroke-width:1.50886" />
        <path
           id="path707"
           d="M 27.781879,58.540112 H 15.711023 l 6.035428,-6.035429 z"
           fill="#547580"
           style="fill-rule:nonzero;stroke-width:1.50886" />
        <path
           id="path697-9"
           d="M 126.3326,8.5854322 H 94.646598 c -0.833318,0 -1.508856,-0.6755383 -1.508856,-1.508857 0,-0.8333187 0.675538,-1.5088569 1.508856,-1.5088569 H 126.3326 c 0.83331,0 1.50885,0.6755382 1.50885,1.5088569 0,0.8333187 -0.67554,1.508857 -1.50885,1.508857 z"
           fill="#ecf0f1"
           style="fill-rule:nonzero;stroke-width:1.50886" />
        <path
           id="path686-7"
           d="m 88.226402,43.451537 v 30.177145 h 40.931758 c 1.74681,-0.08155 3.10052,-1.550155 3.03198,-3.289309 V 43.451537 Z"
           fill="#955ba5"
           style="fill-rule:nonzero;stroke-width:1.51242" />
        <path
           id="path693-5"
           d="m 109.26264,38.924967 c -0.83332,0 -1.50885,-0.675539 -1.50885,-1.508855 V 34.3984 c 0,-0.833322 0.67553,-1.508862 1.50885,-1.508862 0.83332,0 1.50886,0.67554 1.50886,1.508862 v 3.017712 c 0,0.833316 -0.67554,1.508855 -1.50886,1.508855 z"
           fill="#35495e"
           style="fill-rule:nonzero;stroke-width:1.50886" />
        <path
           id="path705-8"
           d="m 103.22721,64.575539 c 0,-0.671443 -0.0332,-4.733285 0,-6.035429 0,0 1.50886,-16.597425 3.01771,-21.123998 h 6.03543 c 1.50887,4.526573 3.01772,21.123998 3.01772,21.123998 0.0332,1.302144 0,5.363986 0,6.035429 z"
           fill="#3f5c6c"
           style="fill-rule:nonzero;stroke-width:1.50886" />
        <path
           id="path707-3"
           d="m 115.29807,58.54011 h -12.07086 l 6.03543,-6.035429 z"
           fill="#547580"
           style="fill-rule:nonzero;stroke-width:1.50886" />
        <path
           id="path699"
           d="m 132.19468,65.838774 v 5.15212 c 0.10257,1.55458 -1.9233,2.86733 -4.53745,2.94022 H 5.1460641 c -2.6141414,-0.0729 -4.64002093,-1.38564 -4.53745223,-2.94022 v -5.15212 z"
           fill="#95a5a5"
           style="fill-rule:nonzero;stroke-width:1.74926" />
      </g>
    </g>
  </g>
</svg>
