{
  "type": "service_account",
  "project_id": "potholego",
  "private_key_id": "22115190c4756c78914cfc020afe489b1dfd40d1",
  "private_key": "-----BEGIN PRIVATE KEY-----\nMIIEvQIBADANBgkqhkiG9w0BAQEFAASCBKcwggSjAgEAAoIBAQC4Dy8uzYSkGtde\nXyRUUa0l68vGBCQddUXNFUrm7yCHSj3uFFs0kWeS9xxW3gNleZ4vNuVPfn/+Kx3S\nMN+XOChaAGtU033wE2rUDXEAajqNngJpHSEdMpyltlHWc/NYe+xnK2GYDzVIfYrB\n4+faEq4P1zZ75KOj+gw4p4SI63LsQmZ5rTaUBXPViGSfnvnjdCjCrcUuinfXlI6i\nBpngx6dC79ntdlAgqRYKKz/JLJ1lMy5V3yCs9AouciG5E0zrIoE+eIw5VNRzxW6H\nlhI26iIQw1u9XQ+BOl6AWhlXfejiYsVFVqdEukiubHmmlp/rtHkDTQ8seWprDfFC\neQxEJd3dAgMBAAECggEACRyzVMlW6jrr85+ZMFV00X5Jcc2trgmqwXru4NzwytHZ\nnApE86bJLmTucbx/BYyOUL8SfiuAkag3yzqhLx7YHJCNv77SqsqDTOk3cXJQ4Mb0\nTpjjFUt2ptuOVKQb5YMJEph6tej21dZlQrESPuES3fTlHSAWG92asklUzeR+JYUU\ng0g8Cxrui14NdmKhQf8i0h0CDujXZKSH6bAw6lBDHw23w1thcaW9tEJBl8cnN9b3\neONe8YEEkMjsPoOn5Us//4t/7tP3jTkhNpSA5kihmZdeX0Eq5RWRKLRSVOlJ2u0p\nMUXh99IuIMsGNgtLA/+X1+qvfejTD+wLIedGmuBpEQKBgQDis+y6AtF2yQ0nuWAX\n8hzSzCjl9Zlh9EOXzkYjiHGqVA3sWwE3nTt8IWW0k9cV3De7O6SfR4geQFE5IVZY\nWkwFWw3sFm+q1qmT/LA0iwZwO3PggLnZIyVSDTZ/5CRvKqd3x1TiuO3Cw6Glpgwp\ns5i62fkMyKkKFER/a2mboo9UlQKBgQDP2HjHGn7vLX6azG/ozBuAoTL/Lz6ffuEJ\nRep4Rx7/ePmdAajVDKAcVeW1Vvd6R6z0ymQt7UuQ5Fh0LTouXbKFS0Cwwklg6NdU\n53kjtuTZEd7t86Y9A9IKfsdb94qmemIsM1HLq7QRONrEIyOvrUU3/IxumPgvXEMl\n3GS7sfWKKQKBgAztR41fxcPpOPfP6TvUUXJvs9FRDNr6C7SnTXaPPDQDMPwOQGaE\nb7TnTp5aY8RaV0802nE+qfNXpYoFbaACHh2cEJIqwVlTfj3zBbUpTEewDC58CJzq\nFSG1oSrvvmgcXYpF8oAvHVeiwh/o9P6XwBi/fyUMeB8cAr/lRxNZ1KR1AoGBAIq8\nspIky4oX0iS+Rg0dAVaxQ3s3LBQG+2vXMZWr07MwK150VyAvV0jSxYxwSq1i3r5f\nwtMtTH2hDrIt5mJAxQNYogvbBGQdyG6yPBhs4wFKfoZTVynvPOsoiSaIbBKIKrPa\nZcUQDhhY3R6DXjTL8iJW/95rWW8zpNbG8K6hMYdRAoGAARR63xWJz6q+OV4nfIyh\nepqnhxTtDuAjL9a03VTmCHXBP45pLox/YKwxusZISWALHTb7HBbOPSheubprrYSr\nAUxvYwTdZPzoAZG1l8KEnmiu+CvUgg2yQvwSCOC82hG8lmyyKBTu3NgRKtOzIfJ6\n/5YHHW4yWo8G+k/P/82h350=\n-----END PRIVATE KEY-----\n",
  "client_email": "firebase-adminsdk-6mhza@potholego.iam.gserviceaccount.com",
  "client_id": "108869982435826197088",
  "auth_uri": "https://accounts.google.com/o/oauth2/auth",
  "token_uri": "https://oauth2.googleapis.com/token",
  "auth_provider_x509_cert_url": "https://www.googleapis.com/oauth2/v1/certs",
  "client_x509_cert_url": "https://www.googleapis.com/robot/v1/metadata/x509/firebase-adminsdk-6mhza%40potholego.iam.gserviceaccount.com"
}
