/Users/ida/work/caffeApp/src/main/java/com/shop/caffe/domain/enumeration/CartState.java
/Users/ida/work/caffeApp/src/main/java/com/shop/caffe/web/data/OrderDto.java
/Users/ida/work/caffeApp/src/main/java/com/shop/caffe/web/data/CartDto.java
/Users/ida/work/caffeApp/src/main/java/com/shop/caffe/controller/ControllerOrderApiResource.java
/Users/ida/work/caffeApp/src/main/java/com/shop/caffe/web/data/CashDeskDto.java
/Users/ida/work/caffeApp/src/main/java/com/shop/caffe/controller/ControllerCashDeskApiResource.java
/Users/ida/work/caffeApp/src/main/java/com/shop/caffe/controller/ControllerCartApiResource.java
/Users/ida/work/caffeApp/src/main/java/com/shop/caffe/controller/ControllerDrinkApiResource.java
/Users/ida/work/caffeApp/src/main/java/com/shop/caffe/service/CashDeskService.java
/Users/ida/work/caffeApp/src/main/java/com/shop/caffe/service/component/CaffeComponent.java
/Users/ida/work/caffeApp/src/main/java/com/shop/caffe/service/CartService.java
/Users/ida/work/caffeApp/src/main/java/com/shop/caffe/domain/Drink.java
/Users/ida/work/caffeApp/src/main/java/com/shop/caffe/domain/enumeration/CashDeskState.java
/Users/ida/work/caffeApp/src/main/java/com/shop/caffe/service/mapper/FoodMapper.java
/Users/ida/work/caffeApp/src/main/java/com/shop/caffe/repository/CaffeRepository.java
/Users/ida/work/caffeApp/src/main/java/com/shop/caffe/web/data/CaffeDto.java
/Users/ida/work/caffeApp/src/main/java/com/shop/caffe/service/FoodService.java
/Users/ida/work/caffeApp/src/main/java/com/shop/caffe/domain/Caffe.java
/Users/ida/work/caffeApp/src/main/java/com/shop/caffe/service/mapper/DrinkMapper.java
/Users/ida/work/caffeApp/src/main/java/com/shop/caffe/service/mapper/CartMapper.java
/Users/ida/work/caffeApp/src/main/java/com/shop/caffe/service/mapper/OrderMapper.java
/Users/ida/work/caffeApp/src/main/java/com/shop/caffe/repository/OrderRepository.java
/Users/ida/work/caffeApp/src/main/java/com/shop/caffe/LiquibaseConfiguration.java
/Users/ida/work/caffeApp/src/main/java/com/shop/caffe/web/data/DrinkDto.java
/Users/ida/work/caffeApp/src/main/java/com/shop/caffe/web/data/FoodDto.java
/Users/ida/work/caffeApp/src/main/java/com/shop/caffe/domain/CartItem.java
/Users/ida/work/caffeApp/src/main/java/com/shop/caffe/repository/CartRepository.java
/Users/ida/work/caffeApp/src/main/java/com/shop/caffe/CaffeApplication.java
/Users/ida/work/caffeApp/src/main/java/com/shop/caffe/domain/enumeration/OrderType.java
/Users/ida/work/caffeApp/src/main/java/com/shop/caffe/domain/Order.java
/Users/ida/work/caffeApp/src/main/java/com/shop/caffe/controller/ControllerCaffeApiResource.java
/Users/ida/work/caffeApp/src/main/java/com/shop/caffe/service/mapper/CashDeskMapper.java
/Users/ida/work/caffeApp/src/main/java/com/shop/caffe/domain/enumeration/OrderState.java
/Users/ida/work/caffeApp/src/main/java/com/shop/caffe/domain/Food.java
/Users/ida/work/caffeApp/src/main/java/com/shop/caffe/repository/DrinkRepository.java
/Users/ida/work/caffeApp/src/main/java/com/shop/caffe/web/data/CartItemDto.java
/Users/ida/work/caffeApp/src/main/java/com/shop/caffe/service/component/FoodComponent.java
/Users/ida/work/caffeApp/src/main/java/com/shop/caffe/service/mapper/CaffeMapper.java
/Users/ida/work/caffeApp/src/main/java/com/shop/caffe/service/component/OrderComponent.java
/Users/ida/work/caffeApp/src/main/java/com/shop/caffe/repository/FoodRepository.java
/Users/ida/work/caffeApp/src/main/java/com/shop/caffe/controller/ControllerFoodApiResource.java
/Users/ida/work/caffeApp/src/main/java/com/shop/caffe/repository/CashDeskRepository.java
/Users/ida/work/caffeApp/src/main/java/com/shop/caffe/domain/enumeration/CartItemType.java
/Users/ida/work/caffeApp/src/main/java/com/shop/caffe/domain/CashDesk.java
/Users/ida/work/caffeApp/src/main/java/com/shop/caffe/service/component/DrinkComponent.java
/Users/ida/work/caffeApp/src/main/java/com/shop/caffe/service/OrderService.java
/Users/ida/work/caffeApp/src/main/java/com/shop/caffe/service/CaffeService.java
/Users/ida/work/caffeApp/src/main/java/com/shop/caffe/domain/Cart.java
/Users/ida/work/caffeApp/src/main/java/com/shop/caffe/repository/CartItemRepository.java
/Users/ida/work/caffeApp/src/main/java/com/shop/caffe/service/DrinkService.java
