{
  "leaspy_version": "1.4.0",
  "name": "univariate_linear",
  "features": [
    "Y0"
  ],
  "dimension": 1,
  "source_dimension": 0,
  "fit_metrics": {
    "nll_regul_tau": 54.76991653442383,
    "nll_regul_xi": 9.980655670166016,
    "nll_regul_tot": 64.75057220458984,
    "nll_attach": -193.7796173095703,
    "nll_tot": -129.029052734375
  },
  "noise_model": {
    "name": "gaussian-scalar",
    "scale": 0.0704135000705719
  },
  "parameters": {
    "g": [
      0.4445808529853821
    ],
    "v0": [
      -3.442329168319702
    ],
    "betas": [],
    "tau_mean": 77.91061401367188,
    "tau_std": 6.064311981201172,
    "xi_mean": 0.0,
    "xi_std": 0.43325600028038025,
    "sources_mean": 0.0,
    "sources_std": 1.0,
    "mixing_matrix": []
  }
}