{
  "leaspy_version": "1.3.1",
  "name": "logistic",
  "features": [
    "Y0",
    "Y1",
    "Y2",
    "Y3"
  ],
  "dimension": 4,
  "source_dimension": 2,
  "fit_metrics": {
    "nll_regul_tau": 57.55354309082031,
    "nll_regul_xi": 23.720869064331055,
    "nll_regul_sources": 136.3329315185547,
    "nll_regul_tot": 217.60736083984375,
    "nll_attach": 1252.8314208984375,
    "nll_tot": 1470.4388427734375
  },
  "noise_model": {
    "name": "ordinal-ranking",
    "max_levels": {
      "Y0": 3,
      "Y1": 4,
      "Y2": 6,
      "Y3": 10
    }
  },
  "parameters": {
    "g": [
      -4.499634265899658,
      1.2778937816619873,
      -0.7202731370925903,
      -4.405316352844238
    ],
    "v0": [
      -5.686366081237793,
      -5.382143020629883,
      -5.278314113616943,
      -4.173903942108154
    ],
    "betas": [
      [
        0.03707998991012573,
        0.039677828550338745
      ],
      [
        0.03405308723449707,
        0.060343317687511444
      ],
      [
        0.05020579695701599,
        -0.00813770666718483
      ]
    ],
    "tau_mean": 84.77056884765625,
    "tau_std": 7.142180442810059,
    "xi_mean": 0.0,
    "xi_std": 0.9765195846557617,
    "sources_mean": 0.0,
    "sources_std": 1.0,
    "deltas": [
      [
        0.9236375689506531,
        1.7164947986602783,
        Infinity,
        Infinity,
        Infinity,
        Infinity,
        Infinity,
        Infinity,
        Infinity
      ],
      [
        0.6574715375900269,
        -0.39918339252471924,
        -2.1384897232055664,
        Infinity,
        Infinity,
        Infinity,
        Infinity,
        Infinity,
        Infinity
      ],
      [
        1.2160637378692627,
        -0.022643107920885086,
        -0.7879307866096497,
        -2.2876834869384766,
        -2.2257614135742188,
        Infinity,
        Infinity,
        Infinity,
        Infinity
      ],
      [
        -2.372408151626587,
        0.22651010751724243,
        -2.2626821994781494,
        0.3838151693344116,
        -2.291982889175415,
        0.8893356323242188,
        -2.3617446422576904,
        -0.31691497564315796,
        -2.2487330436706543
      ]
    ],
    "mixing_matrix": [
      [
        -0.04861541464924812,
        0.007753565441817045
      ],
      [
        0.037025321274995804,
        0.039686545729637146
      ],
      [
        0.03401675075292587,
        0.06034911051392555
      ],
      [
        0.01279404852539301,
        -0.0021709895227104425
      ]
    ]
  },
  "batch_deltas_ordinal": true
}