{
  "leaspy_version": "1.2.1rc1",
  "name": "logistic",
  "features": [
    "Y0",
    "Y1",
    "Y2",
    "Y3"
  ],
  "dimension": 4,
  "source_dimension": 2,
  "fit_metrics": {
    "nll_regul_tau": 54.41007614135742,
    "nll_regul_xi": 5.905141830444336,
    "nll_regul_sources": 49.555908203125,
    "nll_regul_tot": 109.87112426757812,
    "nll_attach": -714.929931640625,
    "nll_tot": -605.0587768554688
  },
  "noise_model": {
    "name": "gaussian-diagonal",
    "scale": [
      0.07895240932703018,
      0.03838488459587097,
      0.07264634221792221,
      0.16387245059013367
    ]
  },
  "parameters": {
    "g": [
      0.11188201606273651,
      2.9315195083618164,
      2.6609199047088623,
      1.2024152278900146
    ],
    "v0": [
      -3.409837245941162,
      -3.9957292079925537,
      -4.113552093505859,
      -3.0488367080688477
    ],
    "betas": [
      [
        0.04589006304740906,
        -0.06790392845869064
      ],
      [
        0.0025464254431426525,
        -0.02800276130437851
      ],
      [
        -0.059750474989414215,
        -0.07242604345083237
      ]
    ],
    "tau_mean": 79.97933959960938,
    "tau_std": 5.937911033630371,
    "xi_mean": 0.0,
    "xi_std": 0.3416271507740021,
    "sources_mean": 0.0,
    "sources_std": 1.0,
    "mixing_matrix": [
      [
        -0.03108210675418377,
        0.08367841690778732
      ],
      [
        0.020533431321382523,
        0.0003605149104259908
      ],
      [
        -0.011417060159146786,
        0.009589358232915401
      ],
      [
        -0.06453242152929306,
        -0.05955222621560097
      ]
    ]
  }
}