{
  "leaspy_version": "1.2.1rc1",
  "name": "logistic",
  "features": [
    "Y0",
    "Y1",
    "Y2",
    "Y3"
  ],
  "dimension": 4,
  "source_dimension": 2,
  "fit_metrics": {
    "nll_regul_tau": 54.07808303833008,
    "nll_regul_xi": 16.32254981994629,
    "nll_regul_sources": 51.33702087402344,
    "nll_regul_tot": 121.7376480102539,
    "nll_attach": 127.0842056274414,
    "nll_tot": 248.82186889648438
  },
  "noise_model": {
    "name": "bernoulli"
  },
  "parameters": {
    "g": [
      0.4274013042449951,
      4.254385948181152,
      3.5935158729553223,
      1.5749180316925049
    ],
    "v0": [
      -2.81472110748291,
      -4.979306697845459,
      -4.327756881713867,
      -2.9363088607788086
    ],
    "betas": [
      [
        0.01992490142583847,
        0.07577461004257202
      ],
      [
        0.023400360718369484,
        0.04309355467557907
      ],
      [
        -0.06584642082452774,
        0.09192021936178207
      ]
    ],
    "tau_mean": 81.15730285644531,
    "tau_std": 5.813129901885986,
    "xi_mean": 0.0,
    "xi_std": 0.6313338279724121,
    "sources_mean": 0.0,
    "sources_std": 1.0,
    "mixing_matrix": [
      [
        -0.024362800642848015,
        -0.09282050281763077
      ],
      [
        -0.0009373249486088753,
        -0.00370896328240633
      ],
      [
        0.012156049720942974,
        0.00025353662203997374
      ],
      [
        -0.06736568361520767,
        0.08613192290067673
      ]
    ]
  }
}