{
  "leaspy_version": "2.0.0-dev",
  "name": "logistic_parallel",
  "features": [
    "Y0",
    "Y1",
    "Y2",
    "Y3"
  ],
  "dimension": 4,
  "fit_metrics": {
    "nll_regul_tau": 57.68247985839844,
    "nll_regul_xi": 22.72775650024414,
    "nll_regul_sources": 56.596065521240234,
    "nll_regul_tot": 137.0063018798828,
    "nll_attach": 160.73797607421875,
    "nll_tot": 297.7442932128906
  },
  "noise_model": {
    "name": "bernoulli"
  },
  "parameters": {
    "g": [
      2.563664436340332
    ],
    "deltas": [
      0.06483139842748642,
      -0.1020086482167244,
      -0.06896036863327026
    ],
    "betas": [
      [
        0.10010167956352234,
        -0.02210504561662674
      ],
      [
        0.07761898636817932,
        -0.024249738082289696
      ],
      [
        -0.017103346064686775,
        -0.07278779149055481
      ]
    ],
    "tau_mean": 67.82373809814453,
    "tau_std": 7.188450813293457,
    "xi_mean": -3.2867846488952637,
    "xi_std": 0.9190117120742798,
    "sources_mean": 0.0,
    "sources_std": 1.0,
    "mixing_matrix": [
      [
        -0.07859119027853012,
        0.06071687489748001
      ],
      [
        0.07574240118265152,
        -0.0032859016209840775
      ],
      [
        0.049504730850458145,
        -0.0025296213570982218
      ],
      [
        -0.044422660022974014,
        -0.051681820303201675
      ]
    ]
  },
  "source_dimension": 2
}