{
  "leaspy_version": "1.2.1rc1",
  "name": "logistic_parallel",
  "features": [
    "Y0",
    "Y1",
    "Y2",
    "Y3"
  ],
  "dimension": 4,
  "source_dimension": 2,
  "fit_metrics": {
    "nll_regul_tau": 57.64768600463867,
    "nll_regul_xi": 18.723709106445312,
    "nll_regul_sources": 82.90409851074219,
    "nll_regul_tot": 159.27549743652344,
    "nll_attach": -635.8499755859375,
    "nll_tot": -476.57452392578125
  },
  "noise_model": {
    "name": "gaussian-diagonal",
    "scale": [
      0.07457099109888077,
      0.059008970856666565,
      0.07196062058210373,
      0.18851949274539948
    ]
  },
  "parameters": {
    "g": [
      1.8288748264312744
    ],
    "deltas": [
      -0.057543642818927765,
      -0.12584973871707916,
      -0.05702492967247963
    ],
    "betas": [
      [
        0.08081834763288498,
        -0.06899514049291611
      ],
      [
        0.10321052372455597,
        0.0046482025645673275
      ],
      [
        -0.031318508088588715,
        -0.04498787969350815
      ]
    ],
    "tau_mean": 78.63411712646484,
    "tau_std": 7.182607173919678,
    "xi_mean": -1.9899516105651855,
    "xi_std": 0.7268328666687012,
    "sources_mean": 0.0,
    "sources_std": 1.0,
    "mixing_matrix": [
      [
        -0.07880023866891861,
        0.05436328053474426
      ],
      [
        0.05424399673938751,
        -0.0506618358194828
      ],
      [
        0.0752500593662262,
        0.02393776923418045
      ],
      [
        -0.05788269639015198,
        -0.026661580428481102
      ]
    ]
  }
}