{
  "leaspy_version": "1.1",
  "name": "logistic",
  "features": ["Y0", "Y1", "Y2", "Y3"],
  "dimension": 4,
  "source_dimension": 2,
  "noise_model": {
    "name": "gaussian-diagonal",
    "scale": [0.2, 0.05, 0.15, 0.1]
  },
  "parameters": {
    "g": [0.5, 1.5, 1.0, 2.0],
    "v0": [-2.0, -3.5, -3.0, -2.5],
    "betas": [[0.1, 0.6], [-0.1, 0.4], [0.3, 0.8]],
    "tau_mean": 75.2,
    "tau_std": 7.1,
    "xi_mean": 0.0,
    "xi_std": 0.2,
    "sources_mean": 0.0,
    "sources_std": 1.0,
    "mixing_matrix": [[-0.27804073691368103, -0.9041260480880737], [0.0640869215130806, 0.4832187592983246], [-0.1340726613998413, 0.289203405380249], [0.10300853103399277, 0.1594279408454895]]
  }
}