109
E: -859.24968706 | E_rel_metal 0.15133117999994283: | E_rel_global -1.295067670000094: 
Ce  1.884954  3.843916  1.372921
Ce  1.884954  7.726816  1.372921
Ce  1.884954 11.609716  1.372921
Ce  5.767854  3.843916  1.372921
Ce  5.767854  7.726816  1.372921
Ce  5.767854 11.609716  1.372921
Ce  9.650754  3.843916  1.372921
Ce  9.650754  7.726816  1.372921
Ce  9.650754 11.609716  1.372921
Ce  3.826404  1.902466  4.118502
Ce  3.826404  5.785366  4.118502
Ce  3.826404  9.668266  4.118502
Ce  7.709304  1.902466  4.118502
Ce  7.709304  5.785366  4.118502
Ce  7.709304  9.668266  4.118502
Ce 11.592204  1.902466  4.118502
Ce 11.592204  5.785366  4.118502
Ce 11.592204  9.668266  4.118502
Ce  1.885311  3.839158  6.841640
Ce  1.887552  7.747325  6.892797
Ce  1.873893 11.607413  6.908774
Ce  5.758014  3.816612  6.841668
Ce  5.752016  7.754816  6.844449
Ce  5.752673 11.592508  6.897951
Ce  9.670152  3.871815  6.854009
Ce  9.676063  7.768660  6.907941
Ce  9.682044 11.588328  6.868403
Ce  3.686939  1.970196  9.587285
Ce  3.933624  5.681715  9.655532
Ce  3.862577  9.703537  9.646357
Ce  7.830226  1.879366  9.496508
Ce  7.570832  5.845524  9.482640
Ce  7.696688  9.674975  9.681254
Ce 11.482192  2.034921  9.728324
Ce  0.108957  5.752729  9.563923
Ce 11.619112  9.691757  9.680148
 O  1.884954  1.902466  0.000000
 O  1.884954  5.785366  0.000000
 O  1.884954  9.668266  0.000000
 O  5.767854  1.902466  0.000000
 O  5.767854  5.785366  0.000000
 O  5.767854  9.668266  0.000000
 O  9.650754  1.902466  0.000000
 O  9.650754  5.785366  0.000000
 O  9.650754  9.668266  0.000000
 O  3.826404  3.843916  2.745841
 O  1.884954  1.902466  2.745841
 O  3.826404  7.726816  2.745841
 O  1.884954  5.785366  2.745841
 O  3.826404 11.609716  2.745841
 O  1.884954  9.668266  2.745841
 O  7.709304  3.843916  2.745841
 O  5.767854  1.902466  2.745841
 O  7.709304  7.726816  2.745841
 O  5.767854  5.785366  2.745841
 O  7.709304 11.609716  2.745841
 O  5.767854  9.668266  2.745841
 O 11.592204  3.843916  2.745841
 O  9.650754  1.902466  2.745841
 O 11.592204  7.726816  2.745841
 O  9.650754  5.785366  2.745841
 O 11.592204 11.609716  2.745841
 O  9.650754  9.668266  2.745841
 O  1.876840  1.907857  5.455406
 O  1.889733  5.778951  5.455306
 O  1.887395  9.675560  5.422705
 O  5.783665  1.895378  5.518749
 O  5.761362  5.776875  5.442691
 O  5.760705  9.678210  5.429888
 O  9.653814  1.923285  5.444094
 O  9.652211  5.793192  5.525115
 O  9.655035  9.654738  5.424144
 O  3.844598  3.825987  5.487027
 O  3.827180  7.729938  5.563649
 O  3.834428 11.624277  5.538253
 O  7.710735  3.850769  5.537860
 O  7.702928  7.721529  5.552928
 O  7.711189 11.608550  5.553198
 O 11.584299  3.856360  5.489505
 O 11.597813  7.719942  5.546386
 O 11.588642 11.608411  5.547268
 O  1.871499  1.938667  8.174741
 O  1.953082  5.767768  8.167362
 O  1.939910  9.660821  8.058257
 O  5.832104  1.900873  8.355227
 O  5.807098  5.753414  8.093074
 O  5.765813  9.659051  8.060031
 O  9.581740  1.945153  8.103012
 O  9.583712  5.828847  8.396534
 O  9.619164  9.674003  8.055865
 O  3.872008  3.859158  8.219882
 O  3.885996  7.680899  8.524794
 O  3.834886 11.600580  8.363026
 O  7.701107  3.872906  8.422483
 O  7.648400  7.747028  8.393514
 O  7.746867 11.599272  8.418954
 O 11.554783  3.871841  8.228622
 O 11.628392  7.750886  8.353648
 O 11.565520 11.644734  8.424615
 O  1.833512  2.108523 11.052970
 O  2.053475  5.718719 10.958480
 O  2.119587  9.828193 10.757947
 O  3.735044  3.845706 11.022347
 O  5.936501  5.985448 10.736931
 O  5.811109 10.058054 10.716858
 O  9.365449  1.830373 10.812547
 O  0.117238  4.024140 11.119833
 O  9.444184  9.313231 10.747863
Co  1.903249  3.893580 11.211449