109
E: -856.56675838 | E_rel_metal 0.2070195500000409: | E_rel_global -0.2204289900000731: 
Ce  1.884954  3.843916  1.372921
Ce  1.884954  7.726816  1.372921
Ce  1.884954 11.609716  1.372921
Ce  5.767854  3.843916  1.372921
Ce  5.767854  7.726816  1.372921
Ce  5.767854 11.609716  1.372921
Ce  9.650754  3.843916  1.372921
Ce  9.650754  7.726816  1.372921
Ce  9.650754 11.609716  1.372921
Ce  3.826404  1.902466  4.118502
Ce  3.826404  5.785366  4.118502
Ce  3.826404  9.668266  4.118502
Ce  7.709304  1.902466  4.118502
Ce  7.709304  5.785366  4.118502
Ce  7.709304  9.668266  4.118502
Ce 11.592204  1.902466  4.118502
Ce 11.592204  5.785366  4.118502
Ce 11.592204  9.668266  4.118502
Ce  1.896127  3.830955  6.826781
Ce  1.898820  7.737142  6.880333
Ce  1.879596 11.616373  6.894547
Ce  5.753400  3.785328  6.875408
Ce  5.750733  7.746910  6.843718
Ce  5.752467 11.617517  6.920250
Ce  9.665069  3.856770  6.861194
Ce  9.668272  7.753624  6.894429
Ce  9.667100 11.610633  6.868060
Ce  3.650157  1.986623  9.617238
Ce  3.909260  5.668882  9.708170
Ce  3.812187  9.680059  9.616352
Ce  7.886011  1.853586  9.608144
Ce  7.568260  5.827136  9.480714
Ce  7.693725  9.672466  9.652972
Ce 11.513080  2.040117  9.743306
Ce  0.137822  5.726948  9.524890
Ce 11.590459  9.702452  9.633235
 O  1.884954  1.902466  0.000000
 O  1.884954  5.785366  0.000000
 O  1.884954  9.668266  0.000000
 O  5.767854  1.902466  0.000000
 O  5.767854  5.785366  0.000000
 O  5.767854  9.668266  0.000000
 O  9.650754  1.902466  0.000000
 O  9.650754  5.785366  0.000000
 O  9.650754  9.668266  0.000000
 O  3.826404  3.843916  2.745841
 O  1.884954  1.902466  2.745841
 O  3.826404  7.726816  2.745841
 O  1.884954  5.785366  2.745841
 O  3.826404 11.609716  2.745841
 O  1.884954  9.668266  2.745841
 O  7.709304  3.843916  2.745841
 O  5.767854  1.902466  2.745841
 O  7.709304  7.726816  2.745841
 O  5.767854  5.785366  2.745841
 O  7.709304 11.609716  2.745841
 O  5.767854  9.668266  2.745841
 O 11.592204  3.843916  2.745841
 O  9.650754  1.902466  2.745841
 O 11.592204  7.726816  2.745841
 O  9.650754  5.785366  2.745841
 O 11.592204 11.609716  2.745841
 O  9.650754  9.668266  2.745841
 O  1.880831  1.896195  5.439215
 O  1.892177  5.792597  5.441851
 O  1.889032  9.670277  5.423301
 O  5.782171  1.887677  5.489435
 O  5.763903  5.792445  5.438135
 O  5.763144  9.671325  5.433132
 O  9.651404  1.913422  5.445015
 O  9.653320  5.796513  5.526459
 O  9.652341  9.653551  5.429639
 O  3.845630  3.824676  5.483298
 O  3.823629  7.733492  5.568650
 O  3.829489 11.619579  5.556649
 O  7.713109  3.847601  5.545133
 O  7.715089  7.724274  5.562297
 O  7.717132 11.612138  5.564127
 O 11.579730  3.853006  5.468218
 O 11.593693  7.723878  5.573543
 O 11.585145 11.606767  5.559478
 O  1.847028  1.918489  8.129732
 O  1.916705  5.780440  8.131449
 O  1.878335  9.652038  8.062667
 O  5.769479  1.874271  8.266281
 O  5.802874  5.761725  8.098744
 O  5.753114  9.645417  8.078125
 O  9.645337  1.945896  8.098922
 O  9.632956  5.831918  8.399598
 O  9.686415  9.667720  8.059792
 O  3.838409  3.884003  8.209400
 O  3.848766  7.709977  8.512809
 O  3.794202 11.545222  8.395718
 O  7.711138  3.871904  8.433239
 O  7.680186  7.763630  8.400520
 O  7.751089 11.546003  8.427719
 O 11.594985  3.893042  8.181053
 O 11.628461  7.748447  8.446834
 O 11.580052 11.613838  8.480743
 O  1.699384  1.937972 10.999199
 O  1.960674  6.000285 10.873807
 O  1.870083  9.761813 10.679316
 O  3.861998  3.886105 11.022587
 O  5.974161  6.037547 10.744197
 O  5.774317 10.003651 10.687724
 O  9.756170  1.506365 10.786478
 O 11.451609  4.104393 10.937849
 O  9.601280  9.373743 10.674134
Pd  1.837642  3.965355 11.145689