109
E: -859.50185483 | E_rel_metal 0.6528742400000738: | E_rel_global 0.4777645599999687: 
Ce  1.884954  3.843916  1.372921
Ce  1.884954  7.726816  1.372921
Ce  1.884954 11.609716  1.372921
Ce  5.767854  3.843916  1.372921
Ce  5.767854  7.726816  1.372921
Ce  5.767854 11.609716  1.372921
Ce  9.650754  3.843916  1.372921
Ce  9.650754  7.726816  1.372921
Ce  9.650754 11.609716  1.372921
Ce  3.826404  1.902466  4.118502
Ce  3.826404  5.785366  4.118502
Ce  3.826404  9.668266  4.118502
Ce  7.709304  1.902466  4.118502
Ce  7.709304  5.785366  4.118502
Ce  7.709304  9.668266  4.118502
Ce 11.592204  1.902466  4.118502
Ce 11.592204  5.785366  4.118502
Ce 11.592204  9.668266  4.118502
Ce  1.887500  3.853811  6.917491
Ce  1.880506  7.721178  6.903894
Ce  1.894897 11.632876  6.904342
Ce  5.776629  3.829446  6.839931
Ce  5.773035  7.760424  6.854221
Ce  5.771244 11.615714  6.878141
Ce  9.648592  3.871482  6.841752
Ce  9.654271  7.738676  6.877042
Ce  9.651046 11.593527  6.856476
Ce  4.073070  1.942734  9.715969
Ce  3.930249  5.756172  9.545570
Ce  3.831939  9.691212  9.639445
Ce  7.800677  1.922731  9.627413
Ce  7.642666  5.790817  9.622397
Ce  7.715256  9.681276  9.660345
Ce 11.511768  1.962679  9.549545
Ce 11.367636  5.774963  9.711279
Ce 11.589604  9.673694  9.643078
 O  1.884954  1.902466  0.000000
 O  1.884954  5.785366  0.000000
 O  1.884954  9.668266  0.000000
 O  5.767854  1.902466  0.000000
 O  5.767854  5.785366  0.000000
 O  5.767854  9.668266  0.000000
 O  9.650754  1.902466  0.000000
 O  9.650754  5.785366  0.000000
 O  9.650754  9.668266  0.000000
 O  3.826404  3.843916  2.745841
 O  1.884954  1.902466  2.745841
 O  3.826404  7.726816  2.745841
 O  1.884954  5.785366  2.745841
 O  3.826404 11.609716  2.745841
 O  1.884954  9.668266  2.745841
 O  7.709304  3.843916  2.745841
 O  5.767854  1.902466  2.745841
 O  7.709304  7.726816  2.745841
 O  5.767854  5.785366  2.745841
 O  7.709304 11.609716  2.745841
 O  5.767854  9.668266  2.745841
 O 11.592204  3.843916  2.745841
 O  9.650754  1.902466  2.745841
 O 11.592204  7.726816  2.745841
 O  9.650754  5.785366  2.745841
 O 11.592204 11.609716  2.745841
 O  9.650754  9.668266  2.745841
 O  1.880759  1.898350  5.474519
 O  1.877526  5.787941  5.483196
 O  1.890498  9.677042  5.430064
 O  5.767533  1.905017  5.419962
 O  5.765844  5.786706  5.416366
 O  5.763238  9.677053  5.413792
 O  9.653261  1.904400  5.425072
 O  9.651815  5.798390  5.419513
 O  9.649151  9.664373  5.413888
 O  3.816868  3.842979  5.534747
 O  3.824300  7.728921  5.574097
 O  3.826013 11.624314  5.584955
 O  7.713019  3.846355  5.534493
 O  7.708460  7.735189  5.572141
 O  7.713094 11.610097  5.567513
 O 11.597939  3.849185  5.536989
 O 11.601430  7.729169  5.578407
 O 11.592168 11.607470  5.579391
 O  1.813561  1.937890  8.214256
 O  1.975865  5.781236  8.210088
 O  1.890750  9.677955  8.069129
 O  5.847975  1.892102  8.081197
 O  5.776931  5.805765  8.055902
 O  5.772002  9.689539  8.056700
 O  9.661879  1.901323  8.067247
 O  9.582325  5.813573  8.074666
 O  9.663134  9.670515  8.058026
 O  3.913677  3.836291  8.359581
 O  3.853191  7.750490  8.482106
 O  3.829778 11.620376  8.484870
 O  7.715109  3.853138  8.423445
 O  7.688354  7.768604  8.481884
 O  7.751479 11.593609  8.483510
 O 11.520797  3.875811  8.356659
 O 11.598818  7.744209  8.481337
 O 11.579864 11.611480  8.489452
 O  1.826597  2.123648 11.139817
 O  1.968176  5.690397 11.146577
 O  1.881553  9.698255 10.700114
 O  6.106694  1.934369 10.806158
 O  5.653057  5.750431 10.715647
 O  5.758498  9.696673 10.694454
 O  9.794617  1.995908 10.721311
 O  9.341731  5.796714 10.798494
 O  9.660293  9.685201 10.707573
Ir  1.903825  3.905962 11.432962