109
E: -858.50188204 | E_rel_metal 0.05165095999996083: | E_rel_global -0.1023726500001203: 
Ce  1.884954  3.843916  1.372921
Ce  1.884954  7.726816  1.372921
Ce  1.884954 11.609716  1.372921
Ce  5.767854  3.843916  1.372921
Ce  5.767854  7.726816  1.372921
Ce  5.767854 11.609716  1.372921
Ce  9.650754  3.843916  1.372921
Ce  9.650754  7.726816  1.372921
Ce  9.650754 11.609716  1.372921
Ce  3.826404  1.902466  4.118502
Ce  3.826404  5.785366  4.118502
Ce  3.826404  9.668266  4.118502
Ce  7.709304  1.902466  4.118502
Ce  7.709304  5.785366  4.118502
Ce  7.709304  9.668266  4.118502
Ce 11.592204  1.902466  4.118502
Ce 11.592204  5.785366  4.118502
Ce 11.592204  9.668266  4.118502
Ce  1.880359  3.850285  6.791339
Ce  1.904045  7.751959  6.907123
Ce  1.869030 11.590733  6.906263
Ce  5.770431  3.799880  6.843412
Ce  5.740502  7.766364  6.860270
Ce  5.752066 11.593099  6.928544
Ce  9.654312  3.861782  6.858832
Ce  9.669245  7.757984  6.898014
Ce  9.663810 11.612103  6.864285
Ce  3.676783  2.020905  9.487042
Ce  3.963901  5.653102  9.659287
Ce  3.803402  9.672010  9.733311
Ce  7.873750  1.844477  9.609242
Ce  7.579933  5.832169  9.474005
Ce  7.718550  9.694680  9.671529
Ce 11.497458  2.023525  9.687734
Ce  0.141344  5.690700  9.524961
Ce 11.551942  9.681231  9.670763
 O  1.884954  1.902466  0.000000
 O  1.884954  5.785366  0.000000
 O  1.884954  9.668266  0.000000
 O  5.767854  1.902466  0.000000
 O  5.767854  5.785366  0.000000
 O  5.767854  9.668266  0.000000
 O  9.650754  1.902466  0.000000
 O  9.650754  5.785366  0.000000
 O  9.650754  9.668266  0.000000
 O  3.826404  3.843916  2.745841
 O  1.884954  1.902466  2.745841
 O  3.826404  7.726816  2.745841
 O  1.884954  5.785366  2.745841
 O  3.826404 11.609716  2.745841
 O  1.884954  9.668266  2.745841
 O  7.709304  3.843916  2.745841
 O  5.767854  1.902466  2.745841
 O  7.709304  7.726816  2.745841
 O  5.767854  5.785366  2.745841
 O  7.709304 11.609716  2.745841
 O  5.767854  9.668266  2.745841
 O 11.592204  3.843916  2.745841
 O  9.650754  1.902466  2.745841
 O 11.592204  7.726816  2.745841
 O  9.650754  5.785366  2.745841
 O 11.592204 11.609716  2.745841
 O  9.650754  9.668266  2.745841
 O  1.873501  1.906608  5.439293
 O  1.890614  5.792091  5.444342
 O  1.888722  9.675599  5.421580
 O  5.783204  1.889899  5.510109
 O  5.763653  5.778749  5.444484
 O  5.759155  9.677732  5.431490
 O  9.649198  1.918795  5.447378
 O  9.647788  5.798830  5.531067
 O  9.650825  9.652979  5.432314
 O  3.840823  3.828393  5.468126
 O  3.824502  7.737205  5.559850
 O  3.825603 11.625220  5.580392
 O  7.711733  3.845184  5.533373
 O  7.709167  7.723609  5.558058
 O  7.709731 11.609575  5.544314
 O 11.576629  3.861039  5.463597
 O 11.594317  7.726554  5.574625
 O 11.585243 11.606334  5.552874
 O  1.875831  1.947700  8.129066
 O  1.905452  5.762259  8.143039
 O  1.868806  9.656124  8.064892
 O  5.713881  1.897076  8.332201
 O  5.812203  5.741216  8.096704
 O  5.753290  9.662270  8.073018
 O  9.647725  1.974255  8.110742
 O  9.638580  5.797529  8.413640
 O  9.679956  9.675140  8.061728
 O  3.837815  3.870469  8.166086
 O  3.856034  7.653897  8.487241
 O  3.758829 11.635253  8.444919
 O  7.697486  3.862946  8.418544
 O  7.678773  7.742353  8.389034
 O  7.757694 11.598299  8.361570
 O 11.587864  3.879171  8.175817
 O 11.619298  7.704117  8.444381
 O 11.576967  0.004664  8.453341
 O  1.836881  1.926407 10.894384
 O  2.041325  5.835926 10.893387
 O  1.644680  9.664889 10.772933
 O  4.038370  3.704304 10.908417
 O  5.965490  6.077783 10.730281
 O  5.995088 10.141273 10.743519
 O  9.776222  1.511938 10.775086
 O 11.587016  4.048098 10.943272
 O  9.592126  9.305716 10.711894
Rh  1.990682  3.874061 11.121120