109
E: -860.09642392 | E_rel_metal 0.05830515000002379: | E_rel_global -0.11680453000008129: 
Ce  1.884954  3.843916  1.372921
Ce  1.884954  7.726816  1.372921
Ce  1.884954 11.609716  1.372921
Ce  5.767854  3.843916  1.372921
Ce  5.767854  7.726816  1.372921
Ce  5.767854 11.609716  1.372921
Ce  9.650754  3.843916  1.372921
Ce  9.650754  7.726816  1.372921
Ce  9.650754 11.609716  1.372921
Ce  3.826404  1.902466  4.118502
Ce  3.826404  5.785366  4.118502
Ce  3.826404  9.668266  4.118502
Ce  7.709304  1.902466  4.118502
Ce  7.709304  5.785366  4.118502
Ce  7.709304  9.668266  4.118502
Ce 11.592204  1.902466  4.118502
Ce 11.592204  5.785366  4.118502
Ce 11.592204  9.668266  4.118502
Ce  1.885248  3.853499  6.878062
Ce  1.899859  7.731756  6.886742
Ce  1.870005 11.635215  6.885909
Ce  5.743064  3.838571  6.859931
Ce  5.749866  7.758579  6.850351
Ce  5.748924 11.603999  6.890510
Ce  9.670795  3.870077  6.857048
Ce  9.667108  7.760334  6.887654
Ce  9.665386 11.605723  6.852782
Ce  3.660206  1.966338  9.603538
Ce  3.982406  5.710965  9.749624
Ce  3.818694  9.688417  9.587960
Ce  7.789672  1.891492  9.497632
Ce  7.619396  5.840594  9.490026
Ce  7.707789  9.688640  9.654974
Ce 11.427953  2.020440  9.757543
Ce  0.103449  5.757142  9.588638
Ce 11.603965  9.695649  9.586357
 O  1.884954  1.902466  0.000000
 O  1.884954  5.785366  0.000000
 O  1.884954  9.668266  0.000000
 O  5.767854  1.902466  0.000000
 O  5.767854  5.785366  0.000000
 O  5.767854  9.668266  0.000000
 O  9.650754  1.902466  0.000000
 O  9.650754  5.785366  0.000000
 O  9.650754  9.668266  0.000000
 O  3.826404  3.843916  2.745841
 O  1.884954  1.902466  2.745841
 O  3.826404  7.726816  2.745841
 O  1.884954  5.785366  2.745841
 O  3.826404 11.609716  2.745841
 O  1.884954  9.668266  2.745841
 O  7.709304  3.843916  2.745841
 O  5.767854  1.902466  2.745841
 O  7.709304  7.726816  2.745841
 O  5.767854  5.785366  2.745841
 O  7.709304 11.609716  2.745841
 O  5.767854  9.668266  2.745841
 O 11.592204  3.843916  2.745841
 O  9.650754  1.902466  2.745841
 O 11.592204  7.726816  2.745841
 O  9.650754  5.785366  2.745841
 O 11.592204 11.609716  2.745841
 O  9.650754  9.668266  2.745841
 O  1.877167  1.908266  5.454525
 O  1.887715  5.788231  5.457139
 O  1.890215  9.679364  5.421531
 O  5.780632  1.896743  5.518910
 O  5.762012  5.787527  5.436796
 O  5.760675  9.684719  5.429045
 O  9.656995  1.915528  5.438268
 O  9.648584  5.799272  5.514408
 O  9.650838  9.659907  5.422225
 O  3.838041  3.837704  5.490999
 O  3.826843  7.733060  5.554184
 O  3.829135 11.630953  5.545148
 O  7.708904  3.850322  5.534217
 O  7.706237  7.733044  5.555889
 O  7.711598 11.613170  5.558475
 O 11.584448  3.857387  5.491642
 O 11.594503  7.724156  5.554085
 O 11.584927 11.610346  5.551481
 O  1.845520  1.923378  8.168488
 O  1.917367  5.800128  8.167078
 O  1.878944  9.686856  8.054765
 O  5.816018  1.882700  8.351576
 O  5.852248  5.794633  8.088835
 O  5.772824  9.684542  8.061222
 O  9.558625  1.925110  8.095573
 O  9.595140  5.847645  8.345102
 O  9.638068  9.686362  8.053038
 O  3.869415  3.847221  8.231799
 O  3.867771  7.775494  8.442486
 O  3.808216 11.575144  8.379218
 O  7.703849  3.862504  8.400751
 O  7.682062  7.799737  8.413456
 O  7.729568 11.577036  8.430400
 O 11.534449  3.870640  8.238235
 O 11.608690  7.802467  8.387607
 O 11.549064 11.605645  8.446379
 O  1.762839  1.966637 11.159083
 O  1.988655  5.813173 11.152491
 O  1.892482  9.706766 10.663049
 O  3.791336  3.747898 11.211584
 O  6.130608  5.953311 10.826116
 O  5.788196  9.949336 10.679707
 O  9.281020  1.818911 10.831508
 O 11.595812  4.013552 11.212523
 O  9.642588  9.462142 10.674187
Ir  1.870235  3.890574 11.372820