109
E: -859.25048522 | E_rel_metal 0.15053302000001167: | E_rel_global -1.2958658300000252: 
Ce  1.884954  3.843916  1.372921
Ce  1.884954  7.726816  1.372921
Ce  1.884954 11.609716  1.372921
Ce  5.767854  3.843916  1.372921
Ce  5.767854  7.726816  1.372921
Ce  5.767854 11.609716  1.372921
Ce  9.650754  3.843916  1.372921
Ce  9.650754  7.726816  1.372921
Ce  9.650754 11.609716  1.372921
Ce  3.826404  1.902466  4.118502
Ce  3.826404  5.785366  4.118502
Ce  3.826404  9.668266  4.118502
Ce  7.709304  1.902466  4.118502
Ce  7.709304  5.785366  4.118502
Ce  7.709304  9.668266  4.118502
Ce 11.592204  1.902466  4.118502
Ce 11.592204  5.785366  4.118502
Ce 11.592204  9.668266  4.118502
Ce  1.908437  3.835114  6.823174
Ce  1.910677  7.748387  6.903771
Ce  1.882649 11.598888  6.900938
Ce  5.744564  3.825771  6.880738
Ce  5.744953  7.739324  6.859345
Ce  5.747162 11.592859  6.901748
Ce  9.655697  3.869674  6.815499
Ce  9.669956  7.767611  6.909471
Ce  9.675592 11.571210  6.859925
Ce  3.610680  1.972571  9.631816
Ce  3.922539  5.677476  9.777111
Ce  3.861300  9.680267  9.614652
Ce  7.834008  1.860344  9.482150
Ce  7.600388  5.819601  9.509165
Ce  7.702235  9.653141  9.683562
Ce 11.447877  2.023494  9.630632
Ce  0.095823  5.707985  9.486939
Ce 11.623399  9.678068  9.737014
 O  1.884954  1.902466  0.000000
 O  1.884954  5.785366  0.000000
 O  1.884954  9.668266  0.000000
 O  5.767854  1.902466  0.000000
 O  5.767854  5.785366  0.000000
 O  5.767854  9.668266  0.000000
 O  9.650754  1.902466  0.000000
 O  9.650754  5.785366  0.000000
 O  9.650754  9.668266  0.000000
 O  3.826404  3.843916  2.745841
 O  1.884954  1.902466  2.745841
 O  3.826404  7.726816  2.745841
 O  1.884954  5.785366  2.745841
 O  3.826404 11.609716  2.745841
 O  1.884954  9.668266  2.745841
 O  7.709304  3.843916  2.745841
 O  5.767854  1.902466  2.745841
 O  7.709304  7.726816  2.745841
 O  5.767854  5.785366  2.745841
 O  7.709304 11.609716  2.745841
 O  5.767854  9.668266  2.745841
 O 11.592204  3.843916  2.745841
 O  9.650754  1.902466  2.745841
 O 11.592204  7.726816  2.745841
 O  9.650754  5.785366  2.745841
 O 11.592204 11.609716  2.745841
 O  9.650754  9.668266  2.745841
 O  1.888019  1.899059  5.449865
 O  1.892631  5.780809  5.450520
 O  1.890003  9.674118  5.423887
 O  5.776093  1.894492  5.543453
 O  5.761991  5.772702  5.448384
 O  5.762690  9.679891  5.429467
 O  9.652546  1.918464  5.436976
 O  9.650502  5.792869  5.521102
 O  9.654615  9.655075  5.424129
 O  3.847185  3.830863  5.486284
 O  3.827619  7.728919  5.545372
 O  3.833318 11.617585  5.534324
 O  7.707223  3.846120  5.532488
 O  7.712741  7.721117  5.554983
 O  7.717044 11.611143  5.553956
 O 11.584764  3.851636  5.467711
 O 11.593182  7.725237  5.570994
 O 11.588685 11.605099  5.559392
 O  1.810493  1.925856  8.162598
 O  1.878759  5.751174  8.149521
 O  1.870161  9.677129  8.062040
 O  5.840702  1.880260  8.410337
 O  5.844913  5.754770  8.113684
 O  5.791257  9.668983  8.058684
 O  9.604340  1.944699  8.083577
 O  9.643281  5.800308  8.383644
 O  9.663848  9.669770  8.055395
 O  3.855044  3.819841  8.226014
 O  3.854704  7.730639  8.415889
 O  3.816361 -0.056889  8.353906
 O  7.737279  3.841918  8.407102
 O  7.676354  7.740108  8.394804
 O  7.770486 11.596301  8.410488
 O 11.560948  3.855025  8.174456
 O 11.629635  7.704261  8.437799
 O 11.544817  0.027394  8.495119
 O  1.580488  2.041049 10.973272
 O  1.785194  5.701157 10.958600
 O  2.139686  9.719251 10.767593
 O  3.506281  3.749229 11.139969
 O  6.105812  5.824241 10.847255
 O  5.810375  9.957382 10.717110
 O  9.464450  1.665383 10.730240
 O 11.500498  3.982031 10.906303
 O  9.437423  9.262726 10.752229
Co  1.692740  3.870955 11.235647