109
E: -853.2221777 | E_rel_metal 0.7436734100000422: | E_rel_global 0.627501690000031: 
Ce  1.884954  3.843916  1.372921
Ce  1.884954  7.726816  1.372921
Ce  1.884954 11.609716  1.372921
Ce  5.767854  3.843916  1.372921
Ce  5.767854  7.726816  1.372921
Ce  5.767854 11.609716  1.372921
Ce  9.650754  3.843916  1.372921
Ce  9.650754  7.726816  1.372921
Ce  9.650754 11.609716  1.372921
Ce  3.826404  1.902466  4.118502
Ce  3.826404  5.785366  4.118502
Ce  3.826404  9.668266  4.118502
Ce  7.709304  1.902466  4.118502
Ce  7.709304  5.785366  4.118502
Ce  7.709304  9.668266  4.118502
Ce 11.592204  1.902466  4.118502
Ce 11.592204  5.785366  4.118502
Ce 11.592204  9.668266  4.118502
Ce  1.887231  3.847423  6.782472
Ce  1.904608  7.733469  6.906582
Ce  1.867297 11.610084  6.909519
Ce  5.752633  3.809279  6.847799
Ce  5.746523  7.760782  6.874975
Ce  5.747841 11.582213  6.919988
Ce  9.668186  3.887861  6.844927
Ce  9.671448  7.761659  6.916030
Ce  9.671997 11.584689  6.869404
Ce  3.608495  2.016829  9.562154
Ce  3.951671  5.633228  9.697512
Ce  3.811030  9.678775  9.687573
Ce  7.832570  1.862376  9.492515
Ce  7.585431  5.838214  9.493975
Ce  7.717722  9.672274  9.756329
Ce 11.468158  2.063752  9.693474
Ce  0.162472  5.680966  9.560665
Ce 11.621588  9.659773  9.676953
 O  1.884954  1.902466  0.000000
 O  1.884954  5.785366  0.000000
 O  1.884954  9.668266  0.000000
 O  5.767854  1.902466  0.000000
 O  5.767854  5.785366  0.000000
 O  5.767854  9.668266  0.000000
 O  9.650754  1.902466  0.000000
 O  9.650754  5.785366  0.000000
 O  9.650754  9.668266  0.000000
 O  3.826404  3.843916  2.745841
 O  1.884954  1.902466  2.745841
 O  3.826404  7.726816  2.745841
 O  1.884954  5.785366  2.745841
 O  3.826404 11.609716  2.745841
 O  1.884954  9.668266  2.745841
 O  7.709304  3.843916  2.745841
 O  5.767854  1.902466  2.745841
 O  7.709304  7.726816  2.745841
 O  5.767854  5.785366  2.745841
 O  7.709304 11.609716  2.745841
 O  5.767854  9.668266  2.745841
 O 11.592204  3.843916  2.745841
 O  9.650754  1.902466  2.745841
 O 11.592204  7.726816  2.745841
 O  9.650754  5.785366  2.745841
 O 11.592204 11.609716  2.745841
 O  9.650754  9.668266  2.745841
 O  1.879393  1.897694  5.436941
 O  1.892051  5.794059  5.437051
 O  1.889293  9.676182  5.425345
 O  5.778178  1.889214  5.531037
 O  5.764055  5.774215  5.451839
 O  5.759573  9.677637  5.431239
 O  9.649877  1.914726  5.449706
 O  9.648372  5.799342  5.520066
 O  9.651658  9.657987  5.426338
 O  3.850169  3.827987  5.454957
 O  3.829539  7.734464  5.571849
 O  3.824643 11.624320  5.580706
 O  7.710440  3.847878  5.536464
 O  7.706804  7.725713  5.561288
 O  7.709725 11.606787  5.557202
 O 11.570806  3.857867  5.451115
 O 11.598556  7.726378  5.571408
 O 11.586247 11.606607  5.562982
 O  1.833412  1.954534  8.132579
 O  1.940227  5.744210  8.131201
 O  1.888982  9.668474  8.066883
 O  5.789116  1.874967  8.382402
 O  5.799491  5.724081  8.112577
 O  5.724061  9.674717  8.071157
 O  9.626554  1.983456  8.111934
 O  9.622211  5.818712  8.375826
 O  9.696165  9.676111  8.060559
 O  3.806701  3.825522  8.153394
 O  3.874388  7.674425  8.505020
 O  3.756742 -0.001051  8.448004
 O  7.704506  3.847174  8.412148
 O  7.674976  7.735664  8.393289
 O  7.747357 11.616269  8.392037
 O 11.620097  3.881193  8.149409
 O  0.004227  7.695729  8.427851
 O 11.557791  0.019311  8.495142
 O  1.722973  1.791055 10.820623
 O  2.040017  5.900892 10.824285
 O  1.887305  9.665613 10.738312
 O  4.340618  3.645282 10.734955
 O  5.977909  6.211175 10.715990
 O  5.584847 10.057628 10.756627
 O  9.436244  1.477273 10.714690
 O 11.076013  4.048155 10.728761
 O  9.851729  9.248985 10.738263
Ag  1.883546  3.845887 11.645986