109
E: -854.65362254 | E_rel_metal 0.9813128499999948: | E_rel_global 0.20467684999994162: 
Ce  1.884954  3.843916  1.372921
Ce  1.884954  7.726816  1.372921
Ce  1.884954 11.609716  1.372921
Ce  5.767854  3.843916  1.372921
Ce  5.767854  7.726816  1.372921
Ce  5.767854 11.609716  1.372921
Ce  9.650754  3.843916  1.372921
Ce  9.650754  7.726816  1.372921
Ce  9.650754 11.609716  1.372921
Ce  3.826404  1.902466  4.118502
Ce  3.826404  5.785366  4.118502
Ce  3.826404  9.668266  4.118502
Ce  7.709304  1.902466  4.118502
Ce  7.709304  5.785366  4.118502
Ce  7.709304  9.668266  4.118502
Ce 11.592204  1.902466  4.118502
Ce 11.592204  5.785366  4.118502
Ce 11.592204  9.668266  4.118502
Ce  1.875345  3.843499  6.800656
Ce  1.901279  7.737718  6.882744
Ce  1.859368 11.611464  6.898638
Ce  5.761926  3.801280  6.852177
Ce  5.751114  7.757395  6.843940
Ce  5.752769 11.613963  6.921241
Ce  9.666922  3.839812  6.891973
Ce  9.671428  7.750445  6.898599
Ce  9.661493 11.623282  6.879390
Ce  3.643178  2.028843  9.524699
Ce  3.977230  5.683513  9.678147
Ce  3.806014  9.672865  9.643214
Ce  7.836958  1.865648  9.650814
Ce  7.598792  5.823917  9.477224
Ce  7.698912  9.677934  9.652399
Ce 11.472626  2.013851  9.839501
Ce  0.199829  5.698074  9.562074
Ce 11.589595  9.684171  9.615577
 O  1.884954  1.902466  0.000000
 O  1.884954  5.785366  0.000000
 O  1.884954  9.668266  0.000000
 O  5.767854  1.902466  0.000000
 O  5.767854  5.785366  0.000000
 O  5.767854  9.668266  0.000000
 O  9.650754  1.902466  0.000000
 O  9.650754  5.785366  0.000000
 O  9.650754  9.668266  0.000000
 O  3.826404  3.843916  2.745841
 O  1.884954  1.902466  2.745841
 O  3.826404  7.726816  2.745841
 O  1.884954  5.785366  2.745841
 O  3.826404 11.609716  2.745841
 O  1.884954  9.668266  2.745841
 O  7.709304  3.843916  2.745841
 O  5.767854  1.902466  2.745841
 O  7.709304  7.726816  2.745841
 O  5.767854  5.785366  2.745841
 O  7.709304 11.609716  2.745841
 O  5.767854  9.668266  2.745841
 O 11.592204  3.843916  2.745841
 O  9.650754  1.902466  2.745841
 O 11.592204  7.726816  2.745841
 O  9.650754  5.785366  2.745841
 O 11.592204 11.609716  2.745841
 O  9.650754  9.668266  2.745841
 O  1.873401  1.896268  5.430036
 O  1.887872  5.795916  5.437322
 O  1.887456  9.674700  5.423164
 O  5.783051  1.890346  5.497186
 O  5.763576  5.788831  5.438086
 O  5.761048  9.673936  5.430582
 O  9.653191  1.915700  5.446524
 O  9.650624  5.801201  5.549437
 O  9.651724  9.650820  5.432086
 O  3.839953  3.830639  5.469232
 O  3.823351  7.733712  5.564287
 O  3.826629 11.623801  5.586724
 O  7.712009  3.845505  5.533792
 O  7.712046  7.724182  5.559390
 O  7.707371 11.610891  5.559802
 O 11.578366  3.855201  5.467921
 O 11.596721  7.726839  5.573917
 O 11.583663 11.606752  5.556680
 O  1.917858  1.935208  8.101926
 O  1.933014  5.782754  8.129832
 O  1.910380  9.647993  8.066911
 O  5.670558  1.896879  8.287948
 O  5.805545  5.764815  8.091604
 O  5.717405  9.659970  8.071060
 O  9.611949  1.933095  8.103342
 O  9.646241  5.824294  8.455677
 O  9.674299  9.669766  8.063775
 O  3.822367  3.886895  8.187488
 O  3.861284  7.714228  8.504097
 O  3.768404 11.588294  8.488196
 O  7.687854  3.879019  8.397327
 O  7.677076  7.766595  8.393875
 O  7.697443 11.547027  8.416296
 O 11.608662  3.912358  8.196910
 O 11.639683  7.731584  8.448923
 O 11.599031 11.575148  8.436220
 O  1.984282  1.980511 10.926009
 O  2.108834  5.883127 10.851175
 O  1.857520  9.710260 10.690056
 O  3.982382  3.784077 10.893274
 O  5.998555  6.057121 10.738764
 O  5.782113  9.946207 10.690764
 O  9.539862  1.612830 10.910979
 O  0.070197  4.140280 11.006419
 O  9.607193  9.375965 10.672965
Cu  2.021819  3.925279 11.235661