109
E: -858.90148512 | E_rel_metal 1.2532439500000692: | E_rel_global 1.078134269999964: 
Ce  1.884954  3.843916  1.372921
Ce  1.884954  7.726816  1.372921
Ce  1.884954 11.609716  1.372921
Ce  5.767854  3.843916  1.372921
Ce  5.767854  7.726816  1.372921
Ce  5.767854 11.609716  1.372921
Ce  9.650754  3.843916  1.372921
Ce  9.650754  7.726816  1.372921
Ce  9.650754 11.609716  1.372921
Ce  3.826404  1.902466  4.118502
Ce  3.826404  5.785366  4.118502
Ce  3.826404  9.668266  4.118502
Ce  7.709304  1.902466  4.118502
Ce  7.709304  5.785366  4.118502
Ce  7.709304  9.668266  4.118502
Ce 11.592204  1.902466  4.118502
Ce 11.592204  5.785366  4.118502
Ce 11.592204  9.668266  4.118502
Ce  1.880956  3.843916  6.897411
Ce  1.883259  7.723690  6.903305
Ce  1.883259 11.612841  6.903305
Ce  5.768065  3.843916  6.820278
Ce  5.771596  7.758093  6.882553
Ce  5.771596 11.578438  6.882553
Ce  9.649254  3.843916  6.822667
Ce  9.646351  7.757887  6.884402
Ce  9.646351 11.578644  6.884402
Ce  3.942429  1.941112  9.598590
Ce  3.942429  5.746720  9.598590
Ce  3.805637  9.668266  9.709371
Ce  7.708093  1.904725  9.593318
Ce  7.708093  5.783106  9.593318
Ce  7.707832  9.668266  9.775904
Ce 11.471043  1.940213  9.600651
Ce 11.471043  5.747618  9.600651
Ce 11.608681  9.668266  9.710079
 O  1.884954  1.902466  0.000000
 O  1.884954  5.785366  0.000000
 O  1.884954  9.668266  0.000000
 O  5.767854  1.902466  0.000000
 O  5.767854  5.785366  0.000000
 O  5.767854  9.668266  0.000000
 O  9.650754  1.902466  0.000000
 O  9.650754  5.785366  0.000000
 O  9.650754  9.668266  0.000000
 O  3.826404  3.843916  2.745841
 O  1.884954  1.902466  2.745841
 O  3.826404  7.726816  2.745841
 O  1.884954  5.785366  2.745841
 O  3.826404 11.609716  2.745841
 O  1.884954  9.668266  2.745841
 O  7.709304  3.843916  2.745841
 O  5.767854  1.902466  2.745841
 O  7.709304  7.726816  2.745841
 O  5.767854  5.785366  2.745841
 O  7.709304 11.609716  2.745841
 O  5.767854  9.668266  2.745841
 O 11.592204  3.843916  2.745841
 O  9.650754  1.902466  2.745841
 O 11.592204  7.726816  2.745841
 O  9.650754  5.785366  2.745841
 O 11.592204 11.609716  2.745841
 O  9.650754  9.668266  2.745841
 O  1.883373  1.898031  5.472456
 O  1.883373  5.789801  5.472456
 O  1.888347  9.668266  5.429569
 O  5.766848  1.907786  5.417640
 O  5.766848  5.780045  5.417640
 O  5.770357  9.668266  5.414025
 O  9.655325  1.906681  5.420597
 O  9.655325  5.781151  5.420597
 O  9.647289  9.668266  5.412852
 O  3.812620  3.843916  5.535616
 O  3.826119  7.727257  5.582060
 O  3.826119 11.609274  5.582060
 O  7.711011  3.843916  5.537927
 O  7.709380  7.728376  5.574072
 O  7.709380 11.608156  5.574072
 O 11.605475  3.843916  5.534488
 O 11.594184  7.731132  5.586542
 O 11.594184 11.605399  5.586542
 O  1.865928  1.932134  8.195407
 O  1.865928  5.755697  8.195407
 O  1.882606  9.668266  8.070415
 O  5.780521  1.905050  8.068036
 O  5.780521  5.782782  8.068036
 O  5.728403  9.668266  8.060945
 O  9.637808  1.906733  8.069119
 O  9.637808  5.781099  8.069119
 O  9.684387  9.668266  8.056107
 O  3.898998  3.843916  8.356398
 O  3.819277  7.682137  8.500594
 O  3.819277  0.005694  8.500594
 O  7.710267  3.843916  8.438740
 O  7.709369  7.703503  8.476561
 O  7.709369 -0.015671  8.476561
 O 11.504564  3.843916  8.368756
 O 11.586846  7.683959  8.506492
 O 11.586846  0.003873  8.506492
 O  1.892540  1.988244 11.044866
 O  1.892540  5.699587 11.044866
 O  1.882441  9.668266 10.761894
 O  5.785528  1.933213 10.696789
 O  5.785528  5.754618 10.696789
 O  5.555137  9.668266 10.799027
 O  9.628414  1.932726 10.700826
 O  9.628414  5.755106 10.700826
 O  9.859331  9.668266 10.798383
Ir  1.886982  3.843916 11.215689