109
E: -859.23143234 | E_rel_metal 0.923296730000061: | E_rel_global 0.7481870499999559: 
Ce  1.884954  3.843916  1.372921
Ce  1.884954  7.726816  1.372921
Ce  1.884954 11.609716  1.372921
Ce  5.767854  3.843916  1.372921
Ce  5.767854  7.726816  1.372921
Ce  5.767854 11.609716  1.372921
Ce  9.650754  3.843916  1.372921
Ce  9.650754  7.726816  1.372921
Ce  9.650754 11.609716  1.372921
Ce  3.826404  1.902466  4.118502
Ce  3.826404  5.785366  4.118502
Ce  3.826404  9.668266  4.118502
Ce  7.709304  1.902466  4.118502
Ce  7.709304  5.785366  4.118502
Ce  7.709304  9.668266  4.118502
Ce 11.592204  1.902466  4.118502
Ce 11.592204  5.785366  4.118502
Ce 11.592204  9.668266  4.118502
Ce  1.886203  3.839451  6.905471
Ce  1.886883  7.739375  6.906810
Ce  1.898879 11.612560  6.926118
Ce  5.773636  3.825566  6.827205
Ce  5.767292  7.769992  6.864007
Ce  5.762692 11.597032  6.894763
Ce  9.643675  3.846107  6.819647
Ce  9.646783  7.755006  6.860832
Ce  9.648661 11.586202  6.865247
Ce  4.054793  1.939800  9.687636
Ce  3.966826  5.756951  9.538432
Ce  3.828616  9.688132  9.735190
Ce  7.779893  1.905889  9.626080
Ce  7.690352  5.789945  9.589069
Ce  7.721293  9.680914  9.695862
Ce 11.495348  1.933688  9.562195
Ce 11.416729  5.762700  9.581695
Ce 11.558198  9.676676  9.702873
 O  1.884954  1.902466  0.000000
 O  1.884954  5.785366  0.000000
 O  1.884954  9.668266  0.000000
 O  5.767854  1.902466  0.000000
 O  5.767854  5.785366  0.000000
 O  5.767854  9.668266  0.000000
 O  9.650754  1.902466  0.000000
 O  9.650754  5.785366  0.000000
 O  9.650754  9.668266  0.000000
 O  3.826404  3.843916  2.745841
 O  1.884954  1.902466  2.745841
 O  3.826404  7.726816  2.745841
 O  1.884954  5.785366  2.745841
 O  3.826404 11.609716  2.745841
 O  1.884954  9.668266  2.745841
 O  7.709304  3.843916  2.745841
 O  5.767854  1.902466  2.745841
 O  7.709304  7.726816  2.745841
 O  5.767854  5.785366  2.745841
 O  7.709304 11.609716  2.745841
 O  5.767854  9.668266  2.745841
 O 11.592204  3.843916  2.745841
 O  9.650754  1.902466  2.745841
 O 11.592204  7.726816  2.745841
 O  9.650754  5.785366  2.745841
 O 11.592204 11.609716  2.745841
 O  9.650754  9.668266  2.745841
 O  1.879258  1.913081  5.488533
 O  1.881168  5.785278  5.494271
 O  1.891241  9.672741  5.424919
 O  5.767929  1.913044  5.417968
 O  5.765883  5.780426  5.417101
 O  5.757772  9.668639  5.410223
 O  9.652856  1.909306  5.424392
 O  9.650502  5.792239  5.418209
 O  9.648146  9.662189  5.411879
 O  3.814446  3.842536  5.536426
 O  3.820551  7.727960  5.573943
 O  3.823376 11.623462  5.576074
 O  7.713038  3.845003  5.538913
 O  7.708126  7.731275  5.569273
 O  7.710202 11.607215  5.559203
 O 11.593893  3.850829  5.542026
 O 11.598256  7.729322  5.583168
 O 11.591956 11.611827  5.571333
 O  1.803247  1.946526  8.229935
 O  1.875602  5.761844  8.252292
 O  1.854473  9.653933  8.057655
 O  5.851695  1.910837  8.076655
 O  5.795779  5.786322  8.063670
 O  5.794689  9.666300  8.048773
 O  9.659842  1.912112  8.065991
 O  9.624533  5.793984  8.067175
 O  9.669735  9.654099  8.049285
 O  3.896877  3.865080  8.351805
 O  3.840437  7.684414  8.471048
 O  3.830941 11.645959  8.449465
 O  7.740112  3.868267  8.445699
 O  7.709407  7.708900  8.477894
 O  7.751899 11.611725  8.457607
 O 11.507097  3.877996  8.375327
 O 11.565658  7.680288  8.506881
 O 11.565554 11.623654  8.474665
 O  1.840411  2.122334 11.159876
 O  1.875193  5.687913 11.075197
 O  1.672806  9.738248 10.792114
 O  6.079059  1.974756 10.795673
 O  5.751062  5.777989 10.690513
 O  5.959986  9.719656 10.781133
 O  9.778216  1.953994 10.724831
 O  9.618591  5.784935 10.708297
 O  9.642999  9.682792 10.751223
Ir  1.843682  3.908842 11.405483