109
E: -854.96822309 | E_rel_metal 0.666712299999972: | E_rel_global -0.10992370000008123: 
Ce  1.884954  3.843916  1.372921
Ce  1.884954  7.726816  1.372921
Ce  1.884954 11.609716  1.372921
Ce  5.767854  3.843916  1.372921
Ce  5.767854  7.726816  1.372921
Ce  5.767854 11.609716  1.372921
Ce  9.650754  3.843916  1.372921
Ce  9.650754  7.726816  1.372921
Ce  9.650754 11.609716  1.372921
Ce  3.826404  1.902466  4.118502
Ce  3.826404  5.785366  4.118502
Ce  3.826404  9.668266  4.118502
Ce  7.709304  1.902466  4.118502
Ce  7.709304  5.785366  4.118502
Ce  7.709304  9.668266  4.118502
Ce 11.592204  1.902466  4.118502
Ce 11.592204  5.785366  4.118502
Ce 11.592204  9.668266  4.118502
Ce  1.901334  3.829868  6.809440
Ce  1.898063  7.748578  6.897149
Ce  1.881815 11.600959  6.910143
Ce  5.745879  3.810152  6.872506
Ce  5.747776  7.741595  6.852907
Ce  5.745707 11.592337  6.905129
Ce  9.659798  3.880035  6.832244
Ce  9.670636  7.768998  6.913260
Ce  9.681133 11.582164  6.865353
Ce  3.609933  1.969257  9.645752
Ce  3.882270  5.658485  9.702972
Ce  3.865581  9.697134  9.641162
Ce  7.843147  1.861068  9.489790
Ce  7.559953  5.843365  9.504535
Ce  7.701082  9.667975  9.686448
Ce 11.485860  2.061436  9.665347
Ce  0.115689  5.728806  9.507784
Ce 11.625824  9.694353  9.727547
 O  1.884954  1.902466  0.000000
 O  1.884954  5.785366  0.000000
 O  1.884954  9.668266  0.000000
 O  5.767854  1.902466  0.000000
 O  5.767854  5.785366  0.000000
 O  5.767854  9.668266  0.000000
 O  9.650754  1.902466  0.000000
 O  9.650754  5.785366  0.000000
 O  9.650754  9.668266  0.000000
 O  3.826404  3.843916  2.745841
 O  1.884954  1.902466  2.745841
 O  3.826404  7.726816  2.745841
 O  1.884954  5.785366  2.745841
 O  3.826404 11.609716  2.745841
 O  1.884954  9.668266  2.745841
 O  7.709304  3.843916  2.745841
 O  5.767854  1.902466  2.745841
 O  7.709304  7.726816  2.745841
 O  5.767854  5.785366  2.745841
 O  7.709304 11.609716  2.745841
 O  5.767854  9.668266  2.745841
 O 11.592204  3.843916  2.745841
 O  9.650754  1.902466  2.745841
 O 11.592204  7.726816  2.745841
 O  9.650754  5.785366  2.745841
 O 11.592204 11.609716  2.745841
 O  9.650754  9.668266  2.745841
 O  1.887645  1.898071  5.443043
 O  1.890825  5.785076  5.443005
 O  1.888657  9.670556  5.424987
 O  5.775995  1.890231  5.534411
 O  5.763519  5.777929  5.446286
 O  5.761752  9.673015  5.433315
 O  9.652557  1.919597  5.440830
 O  9.650899  5.794922  5.524565
 O  9.652520  9.655546  5.427030
 O  3.850553  3.828436  5.480616
 O  3.824250  7.728888  5.562068
 O  3.832440 11.613243  5.535535
 O  7.707023  3.848346  5.545004
 O  7.709651  7.720771  5.554846
 O  7.713465 11.609908  5.551600
 O 11.579266  3.854332  5.462595
 O 11.593103  7.726028  5.567296
 O 11.590290 11.604064  5.558961
 O  1.819283  1.934422  8.145456
 O  1.923792  5.746203  8.135632
 O  1.896568  9.661302  8.066567
 O  5.848033  1.886859  8.386692
 O  5.807545  5.741711  8.105185
 O  5.771482  9.655680  8.064154
 O  9.598143  1.968059  8.089642
 O  9.615491  5.822563  8.400276
 O  9.662764  9.671841  8.059054
 O  3.846991  3.845494  8.209759
 O  3.875108  7.678264  8.502424
 O  3.820219 11.591421  8.348412
 O  7.713640  3.863836  8.444853
 O  7.661397  7.740413  8.392432
 O  7.773026 11.597407  8.401394
 O 11.576709  3.877222  8.165887
 O 11.635788  7.707462  8.410107
 O 11.545960  0.033314  8.485841
 O  1.602757  1.992666 10.934304
 O  1.907323  5.915296 10.839984
 O  2.138825  9.839732 10.757868
 O  3.719530  3.884405 10.996100
 O  5.944914  6.013179 10.749033
 O  5.824423 10.071316 10.711240
 O  9.466048  1.666348 10.734706
 O 11.467635  4.066245 10.882208
 O  9.436117  9.263163 10.748191
Cu  1.777558  3.945598 11.223039