109
E: -854.99802949 | E_rel_metal 0.6369058999999879: | E_rel_global -0.13973010000006525: 
Ce  1.884954  3.843916  1.372921
Ce  1.884954  7.726816  1.372921
Ce  1.884954 11.609716  1.372921
Ce  5.767854  3.843916  1.372921
Ce  5.767854  7.726816  1.372921
Ce  5.767854 11.609716  1.372921
Ce  9.650754  3.843916  1.372921
Ce  9.650754  7.726816  1.372921
Ce  9.650754 11.609716  1.372921
Ce  3.826404  1.902466  4.118502
Ce  3.826404  5.785366  4.118502
Ce  3.826404  9.668266  4.118502
Ce  7.709304  1.902466  4.118502
Ce  7.709304  5.785366  4.118502
Ce  7.709304  9.668266  4.118502
Ce 11.592204  1.902466  4.118502
Ce 11.592204  5.785366  4.118502
Ce 11.592204  9.668266  4.118502
Ce  1.895302  3.856246  6.802523
Ce  1.914976  7.741087  6.904790
Ce  1.868548 11.610759  6.887320
Ce  5.750494  3.836873  6.864734
Ce  5.745379  7.761381  6.877357
Ce  5.752219 11.586547  6.916192
Ce  9.667357  3.874593  6.833819
Ce  9.672810  7.766003  6.915003
Ce  9.666332 11.577046  6.862387
Ce  3.594758  1.999422  9.561216
Ce  3.945681  5.674903  9.779154
Ce  3.801361  9.686158  9.650631
Ce  7.835151  1.866642  9.485187
Ce  7.618398  5.830885  9.490688
Ce  7.708965  9.675471  9.752361
Ce 11.469567  2.014198  9.663141
Ce  0.152009  5.687272  9.544702
Ce 11.620334  9.652949  9.678561
 O  1.884954  1.902466  0.000000
 O  1.884954  5.785366  0.000000
 O  1.884954  9.668266  0.000000
 O  5.767854  1.902466  0.000000
 O  5.767854  5.785366  0.000000
 O  5.767854  9.668266  0.000000
 O  9.650754  1.902466  0.000000
 O  9.650754  5.785366  0.000000
 O  9.650754  9.668266  0.000000
 O  3.826404  3.843916  2.745841
 O  1.884954  1.902466  2.745841
 O  3.826404  7.726816  2.745841
 O  1.884954  5.785366  2.745841
 O  3.826404 11.609716  2.745841
 O  1.884954  9.668266  2.745841
 O  7.709304  3.843916  2.745841
 O  5.767854  1.902466  2.745841
 O  7.709304  7.726816  2.745841
 O  5.767854  5.785366  2.745841
 O  7.709304 11.609716  2.745841
 O  5.767854  9.668266  2.745841
 O 11.592204  3.843916  2.745841
 O  9.650754  1.902466  2.745841
 O 11.592204  7.726816  2.745841
 O  9.650754  5.785366  2.745841
 O 11.592204 11.609716  2.745841
 O  9.650754  9.668266  2.745841
 O  1.881969  1.904126  5.440419
 O  1.892824  5.791688  5.441165
 O  1.891305  9.682065  5.422330
 O  5.776871  1.896745  5.552058
 O  5.761208  5.773887  5.447178
 O  5.760494  9.684237  5.429873
 O  9.652193  1.918566  5.440460
 O  9.652076  5.794264  5.524807
 O  9.650938  9.659652  5.424628
 O  3.845412  3.835332  5.476110
 O  3.828838  7.731948  5.549175
 O  3.828617 11.629873  5.568419
 O  7.709200  3.849177  5.531720
 O  7.712273  7.724659  5.558458
 O  7.709249 11.609763  5.552723
 O 11.582702  3.859547  5.462594
 O 11.597083  7.731347  5.568115
 O 11.585742 11.608945  5.559032
 O  1.835961  1.945607  8.141205
 O  1.894889  5.750014  8.132823
 O  1.865667  9.696620  8.057805
 O  5.788203  1.892892  8.457265
 O  5.842904  5.754063  8.103471
 O  5.748274  9.693791  8.066865
 O  9.615417  1.946307  8.092712
 O  9.660640  5.803924  8.389524
 O  9.707311  9.676576  8.058328
 O  3.837167  3.802006  8.198854
 O  3.847104  7.743896  8.425957
 O  3.764332  0.005942  8.421712
 O  7.731723  3.837294  8.392653
 O  7.686379  7.757104  8.396903
 O  7.747422 11.615173  8.391228
 O 11.583742  3.851419  8.179453
 O  0.006131  7.709278  8.431728
 O 11.557746  0.017006  8.495655
 O  1.701251  1.837245 10.852572
 O  1.848961  5.735411 10.920516
 O  1.893530  9.622718 10.730406
 O  3.754216  3.593103 10.990212
 O  6.134034  5.952770 10.832252
 O  5.567840  9.991913 10.753568
 O  9.445919  1.614477 10.731541
 O 11.487069  3.930309 10.884053
 O  9.852393  9.284339 10.747215
Cu  1.797422  3.788719 11.228164