109
E: -854.63083441 | E_rel_metal 0.0006345599999804108: | E_rel_global -0.2794750200000635: 
Ce  1.884954  3.843916  1.372921
Ce  1.884954  7.726816  1.372921
Ce  1.884954 11.609716  1.372921
Ce  5.767854  3.843916  1.372921
Ce  5.767854  7.726816  1.372921
Ce  5.767854 11.609716  1.372921
Ce  9.650754  3.843916  1.372921
Ce  9.650754  7.726816  1.372921
Ce  9.650754 11.609716  1.372921
Ce  3.826404  1.902466  4.118502
Ce  3.826404  5.785366  4.118502
Ce  3.826404  9.668266  4.118502
Ce  7.709304  1.902466  4.118502
Ce  7.709304  5.785366  4.118502
Ce  7.709304  9.668266  4.118502
Ce 11.592204  1.902466  4.118502
Ce 11.592204  5.785366  4.118502
Ce 11.592204  9.668266  4.118502
Ce  1.889003  3.859993  6.905799
Ce  1.893798  7.718795  6.898318
Ce  1.881642 11.616811  6.876957
Ce  5.767671  3.863136  6.867471
Ce  5.766779  7.728759  6.880534
Ce  5.771100 11.603621  6.856831
Ce  9.651706  3.848490  6.855299
Ce  9.651242  7.744098  6.865923
Ce  9.648260 11.599409  6.865256
Ce  3.894455  1.909142  9.604241
Ce  3.956768  5.793236  9.729237
Ce  3.812725  9.667432  9.639410
Ce  7.700867  1.910409  9.621889
Ce  7.771680  5.791404  9.652800
Ce  7.695144  9.668567  9.660017
Ce 11.505286  1.902536  9.616036
Ce 11.546696  5.795947  9.632773
Ce 11.580334  9.669701  9.673925
 O  1.884954  1.902466  0.000000
 O  1.884954  5.785366  0.000000
 O  1.884954  9.668266  0.000000
 O  5.767854  1.902466  0.000000
 O  5.767854  5.785366  0.000000
 O  5.767854  9.668266  0.000000
 O  9.650754  1.902466  0.000000
 O  9.650754  5.785366  0.000000
 O  9.650754  9.668266  0.000000
 O  3.826404  3.843916  2.745841
 O  1.884954  1.902466  2.745841
 O  3.826404  7.726816  2.745841
 O  1.884954  5.785366  2.745841
 O  3.826404 11.609716  2.745841
 O  1.884954  9.668266  2.745841
 O  7.709304  3.843916  2.745841
 O  5.767854  1.902466  2.745841
 O  7.709304  7.726816  2.745841
 O  5.767854  5.785366  2.745841
 O  7.709304 11.609716  2.745841
 O  5.767854  9.668266  2.745841
 O 11.592204  3.843916  2.745841
 O  9.650754  1.902466  2.745841
 O 11.592204  7.726816  2.745841
 O  9.650754  5.785366  2.745841
 O 11.592204 11.609716  2.745841
 O  9.650754  9.668266  2.745841
 O  1.875433  1.898474  5.452308
 O  1.892931  5.784728  5.449951
 O  1.889072  9.680924  5.425132
 O  5.775157  1.902393  5.415735
 O  5.758104  5.783805  5.414867
 O  5.763697  9.681819  5.413251
 O  9.653368  1.905589  5.426383
 O  9.650819  5.799547  5.415019
 O  9.649813  9.662771  5.413075
 O  3.819888  3.833062  5.567225
 O  3.825682  7.730582  5.572742
 O  3.823270 11.622742  5.581220
 O  7.714179  3.849873  5.560175
 O  7.703656  7.730686  5.572182
 O  7.714891 11.609781  5.572931
 O 11.591789  3.851174  5.564835
 O 11.603157  7.729090  5.577330
 O 11.585286 11.609637  5.577406
 O  1.865290  1.911171  8.148363
 O  1.834214  5.779101  8.137552
 O  1.885206  9.685878  8.069713
 O  5.785461  1.892423  8.069407
 O  5.819054  5.796949  8.058936
 O  5.774705  9.686105  8.056791
 O  9.646597  1.886201  8.071429
 O  9.662103  5.796997  8.055483
 O  9.660643  9.684832  8.056164
 O  3.877538  3.820580  8.430238
 O  3.834240  7.754727  8.468539
 O  3.825336 -0.023471  8.482470
 O  7.734648  3.824344  8.461357
 O  7.731451  7.763875  8.482915
 O  7.711478 11.611582  8.499890
 O 11.540602  3.824339  8.447576
 O 11.588820  7.758890  8.491179
 O 11.585400 11.614585  8.505750
 O  1.901519  1.813532 10.907363
 O  1.728691  5.798717 11.012236
 O  1.867574  9.637724 10.702057
 O  5.763019  1.900420 10.693385
 O  6.048329  5.760267 10.784995
 O  5.736705  9.641754 10.691040
 O  9.642423  1.915132 10.702145
 O  9.734438  5.794800 10.731877
 O  9.630470  9.684354 10.708055
Au  1.832710  3.808410 11.190701