109
E: -853.96585111 | E_rel_metal 0.0: | E_rel_global -0.11617172000001119: 
Ce  1.884954  3.843916  1.372921
Ce  1.884954  7.726816  1.372921
Ce  1.884954 11.609716  1.372921
Ce  5.767854  3.843916  1.372921
Ce  5.767854  7.726816  1.372921
Ce  5.767854 11.609716  1.372921
Ce  9.650754  3.843916  1.372921
Ce  9.650754  7.726816  1.372921
Ce  9.650754 11.609716  1.372921
Ce  3.826404  1.902466  4.118502
Ce  3.826404  5.785366  4.118502
Ce  3.826404  9.668266  4.118502
Ce  7.709304  1.902466  4.118502
Ce  7.709304  5.785366  4.118502
Ce  7.709304  9.668266  4.118502
Ce 11.592204  1.902466  4.118502
Ce 11.592204  5.785366  4.118502
Ce 11.592204  9.668266  4.118502
Ce  1.882488  3.832212  6.902668
Ce  1.892022  7.732534  6.870951
Ce  1.880546 11.623900  6.892486
Ce  5.772795  3.843955  6.862320
Ce  5.773769  7.744325  6.864090
Ce  5.773705 11.604076  6.870446
Ce  9.654793  3.828765  6.877508
Ce  9.651497  7.741592  6.855305
Ce  9.653201 11.621954  6.886747
Ce  3.865823  1.888888  9.641609
Ce  3.910615  5.803206  9.616536
Ce  3.839220  9.674772  9.671244
Ce  7.656057  1.906383  9.671905
Ce  7.732149  5.785744  9.630390
Ce  7.726226  9.677647  9.657154
Ce 11.486505  1.890201  9.740974
Ce 11.554182  5.793739  9.601834
Ce 11.602103  9.675823  9.639875
 O  1.884954  1.902466  0.000000
 O  1.884954  5.785366  0.000000
 O  1.884954  9.668266  0.000000
 O  5.767854  1.902466  0.000000
 O  5.767854  5.785366  0.000000
 O  5.767854  9.668266  0.000000
 O  9.650754  1.902466  0.000000
 O  9.650754  5.785366  0.000000
 O  9.650754  9.668266  0.000000
 O  3.826404  3.843916  2.745841
 O  1.884954  1.902466  2.745841
 O  3.826404  7.726816  2.745841
 O  1.884954  5.785366  2.745841
 O  3.826404 11.609716  2.745841
 O  1.884954  9.668266  2.745841
 O  7.709304  3.843916  2.745841
 O  5.767854  1.902466  2.745841
 O  7.709304  7.726816  2.745841
 O  5.767854  5.785366  2.745841
 O  7.709304 11.609716  2.745841
 O  5.767854  9.668266  2.745841
 O 11.592204  3.843916  2.745841
 O  9.650754  1.902466  2.745841
 O 11.592204  7.726816  2.745841
 O  9.650754  5.785366  2.745841
 O 11.592204 11.609716  2.745841
 O  9.650754  9.668266  2.745841
 O  1.870090  1.910499  5.439044
 O  1.892044  5.788344  5.443304
 O  1.891946  9.673957  5.421030
 O  5.774443  1.908504  5.415951
 O  5.765986  5.780168  5.417706
 O  5.762094  9.680349  5.414140
 O  9.658930  1.908391  5.425882
 O  9.649500  5.803559  5.415716
 O  9.649276  9.661363  5.414007
 O  3.822506  3.836550  5.581642
 O  3.833739  7.731968  5.574384
 O  3.824280 11.627757  5.581094
 O  7.716067  3.845416  5.568386
 O  7.702140  7.734343  5.573675
 O  7.715011 11.612642  5.571020
 O 11.589872  3.855291  5.574587
 O 11.603203  7.732794  5.572357
 O 11.588604 11.610992  5.574326
 O  1.950294  1.906856  8.119590
 O  1.901618  5.792658  8.130618
 O  1.890405  9.659988  8.060644
 O  5.772880  1.898300  8.069347
 O  5.771866  5.807987  8.065330
 O  5.784636  9.660392  8.056076
 O  9.613924  1.903962  8.078518
 O  9.652117  5.798986  8.062836
 O  9.646499  9.663494  8.058612
 O  3.869712  3.874238  8.481267
 O  3.839947  7.735878  8.496035
 O  3.845104 11.577608  8.487605
 O  7.696412  3.875849  8.476021
 O  7.719518  7.727372  8.501623
 O  7.701380 11.589234  8.487685
 O 11.578617  3.870316  8.468130
 O 11.598999  7.727682  8.478381
 O 11.590254 11.587030  8.474382
 O  2.045747  1.891112 10.959103
 O  1.905053  5.858442 10.857666
 O  1.894122  9.694140 10.694386
 O  5.681337  1.900743 10.741830
 O  5.789791  5.783971 10.703094
 O  5.782259  9.668410 10.706194
 O  9.382803  1.923542 10.802026
 O  9.685688  5.767375 10.694935
 O  9.675480  9.692573 10.701883
Ag  1.953572  3.881118 11.413551