109
E: -856.63276896 | E_rel_metal 0.14100897000002988: | E_rel_global -0.28643957000008413: 
Ce  1.884954  3.843916  1.372921
Ce  1.884954  7.726816  1.372921
Ce  1.884954 11.609716  1.372921
Ce  5.767854  3.843916  1.372921
Ce  5.767854  7.726816  1.372921
Ce  5.767854 11.609716  1.372921
Ce  9.650754  3.843916  1.372921
Ce  9.650754  7.726816  1.372921
Ce  9.650754 11.609716  1.372921
Ce  3.826404  1.902466  4.118502
Ce  3.826404  5.785366  4.118502
Ce  3.826404  9.668266  4.118502
Ce  7.709304  1.902466  4.118502
Ce  7.709304  5.785366  4.118502
Ce  7.709304  9.668266  4.118502
Ce 11.592204  1.902466  4.118502
Ce 11.592204  5.785366  4.118502
Ce 11.592204  9.668266  4.118502
Ce  1.902488  3.826886  6.826345
Ce  1.903849  7.739291  6.884914
Ce  1.885838 11.612647  6.898432
Ce  5.745604  3.807374  6.862082
Ce  5.753979  7.755525  6.864625
Ce  5.746925 11.577568  6.913824
Ce  9.667450  3.872635  6.832992
Ce  9.667725  7.766348  6.909734
Ce  9.674039 11.577367  6.862945
Ce  3.630866  1.966097  9.644172
Ce  3.900048  5.674248  9.692722
Ce  3.821310  9.713401  9.650772
Ce  7.844601  1.854088  9.476649
Ce  7.566781  5.839247  9.488114
Ce  7.712892  9.682788  9.745836
Ce 11.492015  2.051729  9.683054
Ce  0.120661  5.728867  9.511519
Ce 11.631771  9.679618  9.676219
 O  1.884954  1.902466  0.000000
 O  1.884954  5.785366  0.000000
 O  1.884954  9.668266  0.000000
 O  5.767854  1.902466  0.000000
 O  5.767854  5.785366  0.000000
 O  5.767854  9.668266  0.000000
 O  9.650754  1.902466  0.000000
 O  9.650754  5.785366  0.000000
 O  9.650754  9.668266  0.000000
 O  3.826404  3.843916  2.745841
 O  1.884954  1.902466  2.745841
 O  3.826404  7.726816  2.745841
 O  1.884954  5.785366  2.745841
 O  3.826404 11.609716  2.745841
 O  1.884954  9.668266  2.745841
 O  7.709304  3.843916  2.745841
 O  5.767854  1.902466  2.745841
 O  7.709304  7.726816  2.745841
 O  5.767854  5.785366  2.745841
 O  7.709304 11.609716  2.745841
 O  5.767854  9.668266  2.745841
 O 11.592204  3.843916  2.745841
 O  9.650754  1.902466  2.745841
 O 11.592204  7.726816  2.745841
 O  9.650754  5.785366  2.745841
 O 11.592204 11.609716  2.745841
 O  9.650754  9.668266  2.745841
 O  1.887213  1.896838  5.446551
 O  1.891851  5.786213  5.443355
 O  1.891193  9.669316  5.421735
 O  5.776244  1.889424  5.534598
 O  5.767514  5.773003  5.447234
 O  5.762776  9.672750  5.433696
 O  9.653141  1.917949  5.441329
 O  9.652118  5.793673  5.525034
 O  9.651206  9.654436  5.425370
 O  3.846132  3.828110  5.480837
 O  3.832535  7.727994  5.564734
 O  3.833100 11.614524  5.530793
 O  7.711899  3.845282  5.539309
 O  7.711927  7.721640  5.559013
 O  7.713795 11.606545  5.547452
 O 11.582410  3.852347  5.468309
 O 11.595854  7.723805  5.565775
 O 11.588590 11.604794  5.561312
 O  1.816600  1.929295  8.152250
 O  1.921041  5.751721  8.134606
 O  1.863475  9.663087  8.056210
 O  5.839925  1.876605  8.385264
 O  5.801394  5.741145  8.108556
 O  5.757986  9.649565  8.067322
 O  9.622291  1.953674  8.093080
 O  9.631520  5.810856  8.399249
 O  9.706925  9.665194  8.055864
 O  3.854146  3.845384  8.206301
 O  3.852384  7.689742  8.506531
 O  3.791698 11.588764  8.331576
 O  7.715059  3.855026  8.426464
 O  7.681531  7.735150  8.398750
 O  7.774491 11.597460  8.381898
 O 11.579120  3.872660  8.176494
 O -0.000152  7.709057  8.412698
 O 11.549731  0.016411  8.515301
 O  1.622927  1.919837 10.974827
 O  1.934549  5.979076 10.860004
 O  1.918626  9.803200 10.720668
 O  3.832121  3.889708 11.017000
 O  5.968404  6.109230 10.734979
 O  5.587008 10.181974 10.716284
 O  9.452829  1.663359 10.735471
 O 11.418269  4.055866 10.907231
 O  9.860561  9.314608 10.744220
Pd  1.801778  3.949037 11.127584