109
E: -857.10387108 | E_rel_metal 1.4496619200000396: | E_rel_global 1.2956383099999584: 
Ce  1.884954  3.843916  1.372921
Ce  1.884954  7.726816  1.372921
Ce  1.884954 11.609716  1.372921
Ce  5.767854  3.843916  1.372921
Ce  5.767854  7.726816  1.372921
Ce  5.767854 11.609716  1.372921
Ce  9.650754  3.843916  1.372921
Ce  9.650754  7.726816  1.372921
Ce  9.650754 11.609716  1.372921
Ce  3.826404  1.902466  4.118502
Ce  3.826404  5.785366  4.118502
Ce  3.826404  9.668266  4.118502
Ce  7.709304  1.902466  4.118502
Ce  7.709304  5.785366  4.118502
Ce  7.709304  9.668266  4.118502
Ce 11.592204  1.902466  4.118502
Ce 11.592204  5.785366  4.118502
Ce 11.592204  9.668266  4.118502
Ce  1.868241  3.881751  6.859939
Ce  1.888240  7.741314  6.961523
Ce  1.877931 11.591866  6.887799
Ce  5.783458  3.838715  6.845995
Ce  5.764362  7.748083  6.880712
Ce  5.754783 11.571862  6.906800
Ce  9.651066  3.869929  6.808011
Ce  9.649756  7.749797  6.875341
Ce  9.671446 11.577816  6.846272
Ce  3.696622  1.980454  9.489340
Ce  4.038946  5.693363  9.568100
Ce  3.837737  9.661549  9.729960
Ce  7.899842  1.891501  9.480543
Ce  7.718561  5.880442  9.695422
Ce  7.734650  9.723212  9.676941
Ce 11.527092  2.014339  9.651573
Ce 11.389424  5.721666  9.584815
Ce 11.564345  9.666214  9.685378
 O  1.884954  1.902466  0.000000
 O  1.884954  5.785366  0.000000
 O  1.884954  9.668266  0.000000
 O  5.767854  1.902466  0.000000
 O  5.767854  5.785366  0.000000
 O  5.767854  9.668266  0.000000
 O  9.650754  1.902466  0.000000
 O  9.650754  5.785366  0.000000
 O  9.650754  9.668266  0.000000
 O  3.826404  3.843916  2.745841
 O  1.884954  1.902466  2.745841
 O  3.826404  7.726816  2.745841
 O  1.884954  5.785366  2.745841
 O  3.826404 11.609716  2.745841
 O  1.884954  9.668266  2.745841
 O  7.709304  3.843916  2.745841
 O  5.767854  1.902466  2.745841
 O  7.709304  7.726816  2.745841
 O  5.767854  5.785366  2.745841
 O  7.709304 11.609716  2.745841
 O  5.767854  9.668266  2.745841
 O 11.592204  3.843916  2.745841
 O  9.650754  1.902466  2.745841
 O 11.592204  7.726816  2.745841
 O  9.650754  5.785366  2.745841
 O 11.592204 11.609716  2.745841
 O  9.650754  9.668266  2.745841
 O  1.874470  1.920745  5.459049
 O  1.887966  5.791956  5.545469
 O  1.891313  9.672252  5.436843
 O  5.773277  1.891958  5.547029
 O  5.771641  5.768667  5.445136
 O  5.761453  9.685626  5.431955
 O  9.652552  1.906078  5.428341
 O  9.645636  5.794326  5.415347
 O  9.649159  9.664779  5.413261
 O  3.832773  3.846758  5.484701
 O  3.825577  7.726906  5.559423
 O  3.824207 11.620125  5.554054
 O  7.702767  3.835204  5.525005
 O  7.697114  7.728350  5.547055
 O  7.708587 11.608937  5.548810
 O 11.593076  3.862836  5.489124
 O 11.604795  7.728525  5.564989
 O 11.592591 11.603408  5.557836
 O  1.871442  1.970216  8.152093
 O  1.878510  5.757113  8.427642
 O  1.858694  9.691286  8.073047
 O  5.800655  1.899115  8.442133
 O  5.767907  5.722674  8.093657
 O  5.761814  9.677688  8.067636
 O  9.643777  1.911879  8.083096
 O  9.653798  5.774688  8.066239
 O  9.685365  9.684063  8.052640
 O  3.854295  3.821274  8.188117
 O  3.839591  7.686105  8.414762
 O  3.787557  0.002624  8.406525
 O  7.749133  3.825392  8.436334
 O  7.700438  7.783215  8.402239
 O  7.762769 11.627951  8.366752
 O 11.524398  3.828416  8.245427
 O 11.577332  7.719573  8.433992
 O 11.592468  0.028552  8.506656
 O  1.851541  1.556977 10.858347
 O  0.216046  3.935356 11.064330
 O  1.679060  9.395728 10.767244
 O  3.925755  3.691905 11.005928
 O  5.608969  6.304033 10.730409
 O  5.984226 10.192578 10.722451
 O  9.555392  1.861129 10.732400
 O  9.772085  6.135858 10.764474
 O  9.622281  9.804216 10.734214
Rh  2.023280  3.439833 11.373214