109
E: -853.81585712 | E_rel_metal 0.14999398999998448: | E_rel_global 0.03382226999997329: 
Ce  1.884954  3.843916  1.372921
Ce  1.884954  7.726816  1.372921
Ce  1.884954 11.609716  1.372921
Ce  5.767854  3.843916  1.372921
Ce  5.767854  7.726816  1.372921
Ce  5.767854 11.609716  1.372921
Ce  9.650754  3.843916  1.372921
Ce  9.650754  7.726816  1.372921
Ce  9.650754 11.609716  1.372921
Ce  3.826404  1.902466  4.118502
Ce  3.826404  5.785366  4.118502
Ce  3.826404  9.668266  4.118502
Ce  7.709304  1.902466  4.118502
Ce  7.709304  5.785366  4.118502
Ce  7.709304  9.668266  4.118502
Ce 11.592204  1.902466  4.118502
Ce 11.592204  5.785366  4.118502
Ce 11.592204  9.668266  4.118502
Ce  1.883873  3.848333  6.891251
Ce  1.888053  7.735329  6.881616
Ce  1.884750 11.612514  6.881257
Ce  5.770257  3.848276  6.851798
Ce  5.773151  7.760818  6.882656
Ce  5.776176 11.589357  6.880451
Ce  9.651581  3.847977  6.852508
Ce  9.646008  7.756473  6.877362
Ce  9.646277 11.586549  6.880572
Ce  3.903498  1.889458  9.621052
Ce  3.897440  5.815610  9.617225
Ce  3.811010  9.677122  9.702840
Ce  7.718731  1.899627  9.612657
Ce  7.708503  5.795980  9.614277
Ce  7.717913  9.675428  9.761704
Ce 11.527214  1.884965  9.619968
Ce 11.523947  5.809622  9.619243
Ce 11.622310  9.673905  9.697729
 O  1.884954  1.902466  0.000000
 O  1.884954  5.785366  0.000000
 O  1.884954  9.668266  0.000000
 O  5.767854  1.902466  0.000000
 O  5.767854  5.785366  0.000000
 O  5.767854  9.668266  0.000000
 O  9.650754  1.902466  0.000000
 O  9.650754  5.785366  0.000000
 O  9.650754  9.668266  0.000000
 O  3.826404  3.843916  2.745841
 O  1.884954  1.902466  2.745841
 O  3.826404  7.726816  2.745841
 O  1.884954  5.785366  2.745841
 O  3.826404 11.609716  2.745841
 O  1.884954  9.668266  2.745841
 O  7.709304  3.843916  2.745841
 O  5.767854  1.902466  2.745841
 O  7.709304  7.726816  2.745841
 O  5.767854  5.785366  2.745841
 O  7.709304 11.609716  2.745841
 O  5.767854  9.668266  2.745841
 O 11.592204  3.843916  2.745841
 O  9.650754  1.902466  2.745841
 O 11.592204  7.726816  2.745841
 O  9.650754  5.785366  2.745841
 O 11.592204 11.609716  2.745841
 O  9.650754  9.668266  2.745841
 O  1.876228  1.911168  5.443932
 O  1.886049  5.781505  5.448254
 O  1.891946  9.677717  5.420359
 O  5.771936  1.912175  5.417576
 O  5.764259  5.772210  5.418420
 O  5.762994  9.677140  5.413489
 O  9.654291  1.910554  5.428564
 O  9.650150  5.791595  5.416923
 O  9.647238  9.662011  5.411524
 O  3.820443  3.837872  5.586145
 O  3.826005  7.728040  5.571120
 O  3.825247 11.624288  5.579101
 O  7.715434  3.846496  5.568445
 O  7.701984  7.731140  5.570697
 O  7.712633 11.608861  5.564422
 O 11.591411  3.853380  5.578179
 O 11.601855  7.732303  5.570925
 O 11.589232 11.609157  5.570394
 O  1.884200  1.926184  8.132878
 O  1.890207  5.772829  8.135596
 O  1.885040  9.673574  8.058014
 O  5.772246  1.916700  8.073779
 O  5.764528  5.785935  8.072109
 O  5.749251  9.676639  8.057218
 O  9.657235  1.914650  8.079395
 O  9.657263  5.782458  8.065900
 O  9.675974  9.670359  8.050929
 O  3.862673  3.850227  8.502466
 O  3.825880  7.713685  8.467808
 O  3.823011 -0.003124  8.477189
 O  7.716637  3.851210  8.475226
 O  7.709567  7.699125  8.474410
 O  7.718088 -0.001932  8.463284
 O 11.569020  3.849319  8.498343
 O 11.596012  7.704922  8.477603
 O 11.595418 11.637911  8.471478
 O  1.892070  1.868581 10.865909
 O  1.889716  5.840634 10.865402
 O  1.890031  9.681382 10.750336
 O  5.782357  1.892146 10.700061
 O  5.770287  5.796974 10.703503
 O  5.559171  9.670802 10.794665
 O  9.657380  1.884900 10.707137
 O  9.649335  5.781276 10.703309
 O  9.868552  9.677971 10.783813
Ag  1.890339  3.854676 11.372453