109
E: -859.26569065 | E_rel_metal 0.1353275899999744: | E_rel_global -1.3110712600000625: 
Ce  1.884954  3.843916  1.372921
Ce  1.884954  7.726816  1.372921
Ce  1.884954 11.609716  1.372921
Ce  5.767854  3.843916  1.372921
Ce  5.767854  7.726816  1.372921
Ce  5.767854 11.609716  1.372921
Ce  9.650754  3.843916  1.372921
Ce  9.650754  7.726816  1.372921
Ce  9.650754 11.609716  1.372921
Ce  3.826404  1.902466  4.118502
Ce  3.826404  5.785366  4.118502
Ce  3.826404  9.668266  4.118502
Ce  7.709304  1.902466  4.118502
Ce  7.709304  5.785366  4.118502
Ce  7.709304  9.668266  4.118502
Ce 11.592204  1.902466  4.118502
Ce 11.592204  5.785366  4.118502
Ce 11.592204  9.668266  4.118502
Ce  1.880667  3.840311  6.841469
Ce  1.895610  7.749856  6.890523
Ce  1.881344 11.606481  6.908132
Ce  5.763163  3.814787  6.829733
Ce  5.751947  7.769971  6.858130
Ce  5.746115 11.579034  6.908314
Ce  9.677279  3.869171  6.866627
Ce  9.672935  7.754658  6.899816
Ce  9.676654 11.601578  6.853975
Ce  3.686508  1.971265  9.565203
Ce  3.950573  5.690715  9.630208
Ce  3.817966  9.695957  9.709410
Ce  7.821131  1.875878  9.496363
Ce  7.579504  5.837054  9.479971
Ce  7.727539  9.708079  9.682477
Ce 11.480914  2.036065  9.752988
Ce  0.133580  5.758839  9.585879
Ce 11.572796  9.691114  9.620543
 O  1.884954  1.902466  0.000000
 O  1.884954  5.785366  0.000000
 O  1.884954  9.668266  0.000000
 O  5.767854  1.902466  0.000000
 O  5.767854  5.785366  0.000000
 O  5.767854  9.668266  0.000000
 O  9.650754  1.902466  0.000000
 O  9.650754  5.785366  0.000000
 O  9.650754  9.668266  0.000000
 O  3.826404  3.843916  2.745841
 O  1.884954  1.902466  2.745841
 O  3.826404  7.726816  2.745841
 O  1.884954  5.785366  2.745841
 O  3.826404 11.609716  2.745841
 O  1.884954  9.668266  2.745841
 O  7.709304  3.843916  2.745841
 O  5.767854  1.902466  2.745841
 O  7.709304  7.726816  2.745841
 O  5.767854  5.785366  2.745841
 O  7.709304 11.609716  2.745841
 O  5.767854  9.668266  2.745841
 O 11.592204  3.843916  2.745841
 O  9.650754  1.902466  2.745841
 O 11.592204  7.726816  2.745841
 O  9.650754  5.785366  2.745841
 O 11.592204 11.609716  2.745841
 O  9.650754  9.668266  2.745841
 O  1.878276  1.909998  5.454115
 O  1.887066  5.782174  5.455294
 O  1.891115  9.670640  5.421925
 O  5.781831  1.893123  5.517794
 O  5.763801  5.774443  5.440633
 O  5.759813  9.676619  5.426691
 O  9.658539  1.920850  5.446015
 O  9.652629  5.791433  5.526331
 O  9.655292  9.652844  5.427133
 O  3.843549  3.829197  5.484936
 O  3.830935  7.730383  5.562520
 O  3.830698 11.620739  5.537559
 O  7.715834  3.846959  5.536345
 O  7.708847  7.722467  5.561059
 O  7.712888 11.608634  5.544107
 O 11.583229  3.856734  5.494309
 O 11.596166  7.719026  5.550779
 O 11.590761 11.609054  5.546773
 O  1.863407  1.936499  8.169381
 O  1.952396  5.774228  8.166495
 O  1.882448  9.660885  8.057400
 O  5.828640  1.887843  8.355788
 O  5.823285  5.752065  8.088970
 O  5.788010  9.663028  8.056984
 O  9.589081  1.941834  8.107360
 O  9.591994  5.820617  8.396611
 O  9.647852  9.674423  8.055181
 O  3.873923  3.858565  8.209798
 O  3.886284  7.673509  8.501230
 O  3.810643 -0.042082  8.358456
 O  7.698378  3.864912  8.411555
 O  7.672428  7.753340  8.422757
 O  7.771335 11.599730  8.388641
 O 11.568417  3.881034  8.242592
 O 11.612072  7.753347  8.369935
 O 11.551032 11.633034  8.443724
 O  1.867378  2.109134 11.054697
 O  2.102007  5.731837 10.959893
 O  1.659108  9.750480 10.754288
 O  3.767335  3.837818 11.008118
 O  5.943768  6.011710 10.730051
 O  5.986928 10.168432 10.735051
 O  9.331749  1.904991 10.828234
 O  0.166909  4.025942 11.127837
 O  9.620069  9.434872 10.724920
Co  1.952123  3.902427 11.215645