0;1;2;3;4;5;6;7;8;9;10;11;12;13;14;15;16;17;18;19;20;21;22;23;24;25;26;27;28;29;30;31;32;33;34;35;36;37;38;39;40;41;42;43;44;45;46;47;48;49
11;11;10;10;10;10;10;10;10;10;9;9;9;9;9;9;9;9;9;9;9;9;9;9;8;8;8;8;8;8;8;8;7;6;6;5;5;5;5;5;5;5;5;5;5;5;4;3;3;3
10;10;10;10;10;10;10;10;9;9;9;9;9;9;9;9;9;9;9;9;9;9;9;8;8;8;8;8;8;8;6;6;5;5;5;5;5;5;5;5;5;5;5;5;4;3;3;3;3;3
10;10;10;10;10;10;9;9;9;9;9;9;9;9;9;9;9;9;9;9;9;8;8;8;8;8;8;8;6;6;5;5;5;5;5;5;5;5;5;5;5;5;4;3;3;3;3;3;1;1
10;10;10;10;9;9;9;9;9;9;9;9;9;9;9;9;9;9;9;8;8;8;8;8;8;7;6;6;5;5;5;5;5;5;5;5;5;5;5;5;4;3;3;3;3;3;1;1;0;0
10;10;9;9;9;9;9;9;9;9;9;9;9;9;9;9;9;9;8;8;8;8;8;7;6;6;5;5;5;5;5;5;5;5;5;5;5;5;4;4;3;3;3;3;1;1;0;0;0;0
9;9;9;9;9;9;9;9;9;9;9;9;9;9;9;9;9;8;8;8;7;7;6;6;5;5;5;5;5;5;5;5;5;5;5;5;4;4;3;3;3;3;1;1;0;0;0;0;0;0
9;9;9;9;9;9;9;9;9;9;9;9;9;9;9;8;8;7;7;7;6;6;5;5;5;5;5;5;5;5;5;5;5;5;4;4;3;3;3;3;3;1;1;0;0;0;0;0;0;0
8;8;9;9;9;9;9;9;9;9;9;9;9;9;7;7;7;7;7;6;5;5;5;5;5;5;5;5;5;5;5;5;4;4;4;3;3;3;3;1;1;0;0;0;0;0;0;0;0;0
8;8;8;8;8;8;8;8;8;8;8;8;8;7;7;7;7;6;5;5;5;5;5;5;5;5;5;5;5;5;4;4;4;3;3;3;3;2;1;0;0;0;0;0;0;0;0;0;0;0
8;8;8;8;8;8;8;8;8;8;8;7;7;7;7;7;5;5;5;5;5;5;5;5;5;5;5;5;4;4;4;4;3;3;3;3;1;1;0;0;0;0;0;0;0;0;0;0;0;0
8;8;8;8;8;8;8;8;8;8;7;7;7;7;5;5;5;5;5;5;5;5;5;5;5;5;5;4;4;4;3;3;3;3;2;1;0;0;0;0;0;0;0;0;0;0;0;0;0;0
8;8;8;8;8;8;8;8;8;7;7;7;6;5;5;5;5;5;5;5;5;5;5;5;5;4;4;4;4;3;3;3;3;1;1;0;0;0;0;0;0;0;0;0;0;0;0;0;0;0
8;8;8;8;8;8;8;8;7;7;7;5;5;5;5;5;5;5;5;5;5;5;5;4;4;4;4;4;3;3;3;3;1;1;0;0;0;0;0;0;0;0;0;0;0;0;0;0;0;0
8;8;8;8;8;8;8;7;7;6;5;5;5;5;5;5;5;5;5;5;5;5;4;4;4;4;4;3;3;3;1;1;0;0;0;0;0;0;0;0;0;0;0;0;0;0;0;0;0;0
8;8;8;8;8;8;7;6;5;5;5;5;5;5;5;5;5;5;5;5;4;4;4;4;4;3;3;3;3;1;1;0;0;0;0;0;0;0;0;0;0;0;0;0;0;0;0;0;0;0
8;8;8;8;8;6;6;5;5;5;5;5;5;5;5;5;5;5;4;4;4;4;4;4;3;3;3;3;1;1;0;0;0;0;0;0;0;0;0;0;0;0;0;0;0;0;0;0;0;0
8;8;8;7;6;5;5;5;5;5;5;5;5;5;5;5;5;4;4;4;4;4;4;3;3;3;3;1;1;0;0;0;0;0;0;0;0;0;0;0;0;0;0;0;0;0;0;0;0;0
8;7;7;6;5;5;5;5;5;5;5;5;5;5;5;4;4;4;4;4;4;4;3;3;3;1;1;1;0;0;0;0;0;0;0;0;0;0;0;0;0;0;0;0;0;0;0;0;0;0
7;7;6;5;5;5;5;5;5;5;5;5;5;4;4;4;4;4;4;4;4;3;3;3;1;1;0;0;0;0;0;0;0;0;0;0;0;0;0;0;0;0;0;0;0;0;0;0;0;0
7;6;5;5;5;5;5;5;5;5;5;5;4;4;4;4;4;4;4;4;3;3;3;1;1;0;0;0;0;0;0;0;0;0;0;0;0;0;0;0;0;0;0;0;0;0;0;0;0;0
5;5;5;5;5;5;5;5;5;5;4;4;4;4;4;4;4;4;4;3;3;3;1;1;0;0;0;0;0;0;0;0;0;0;0;0;0;0;0;0;0;0;0;0;0;0;0;0;0;0
5;5;5;5;5;5;5;5;4;4;4;4;4;4;4;4;4;4;3;3;3;1;1;0;0;0;0;0;0;0;0;0;0;0;0;0;0;0;0;0;0;0;0;0;0;0;0;0;0;0
5;5;5;5;5;5;4;4;4;4;4;4;4;4;4;4;4;3;3;3;1;1;0;0;0;0;0;0;0;0;0;0;0;0;0;0;0;0;0;0;0;0;0;0;0;0;0;0;0;0
5;5;5;5;5;4;4;4;4;4;4;4;4;4;4;4;3;3;3;1;1;0;0;0;0;0;0;0;0;0;0;0;0;0;0;0;0;0;0;0;0;0;0;0;0;0;0;0;0;0
5;5;5;4;4;4;4;4;4;4;4;4;4;4;4;3;3;3;1;1;0;0;0;0;0;0;0;0;0;0;0;0;0;0;0;0;0;0;0;0;0;0;0;0;0;0;0;0;0;0
5;4;4;4;4;4;4;4;4;4;4;4;4;4;3;3;3;1;1;0;0;0;0;0;0;0;0;0;0;0;0;0;0;0;0;0;0;0;0;0;0;0;0;0;0;0;0;0;0;0
4;4;4;4;4;4;4;4;4;4;4;4;4;3;3;3;1;1;1;0;0;0;0;0;0;0;0;0;0;0;0;0;0;0;0;0;0;0;0;0;0;0;0;0;0;0;0;0;0;0
4;4;4;4;4;4;4;4;4;4;4;4;3;3;3;1;1;1;0;0;0;0;0;0;0;0;0;0;0;0;0;0;0;0;0;0;0;0;0;0;0;0;0;0;0;0;0;0;0;0
4;4;4;4;4;4;4;4;4;4;4;3;3;3;1;1;1;0;0;0;0;0;0;0;0;0;0;0;0;0;0;0;0;0;0;0;0;0;0;0;0;0;0;0;0;0;0;0;0;0
4;4;4;4;4;4;4;4;4;4;4;3;3;1;1;1;0;0;0;0;0;0;0;0;0;0;0;0;0;0;0;0;0;0;0;0;0;0;0;0;0;0;0;0;0;0;0;0;0;0
4;4;4;4;4;4;4;4;4;4;3;3;1;1;1;0;0;0;0;0;0;0;0;0;0;0;0;0;0;0;0;0;0;0;0;0;0;0;0;0;0;0;0;0;0;0;0;0;0;0
4;4;4;4;4;4;4;4;4;3;3;2;1;1;0;0;0;0;0;0;0;0;0;0;0;0;0;0;0;0;0;0;0;0;0;0;0;0;0;0;0;0;0;0;0;0;0;0;0;0
4;4;4;4;4;4;4;4;3;3;2;1;1;1;0;0;0;0;0;0;0;0;0;0;0;0;0;0;0;0;0;0;0;0;0;0;0;0;0;0;0;0;0;0;0;0;0;0;0;0
4;4;4;4;4;4;4;4;3;2;1;1;1;0;0;0;0;0;0;0;0;0;0;0;0;0;0;0;0;0;0;0;0;0;0;0;0;0;0;0;0;0;0;0;0;0;0;0;0;0
4;4;4;4;4;4;4;3;2;1;1;1;0;0;0;0;0;0;0;0;0;0;0;0;0;0;0;0;0;0;0;0;0;0;0;0;0;0;0;0;0;0;0;0;0;0;0;0;0;0
4;4;4;4;4;4;3;2;1;1;1;0;0;0;0;0;0;0;0;0;0;0;0;0;0;0;0;0;0;0;0;0;0;0;0;0;0;0;0;0;0;0;0;0;0;0;0;0;0;0
4;4;4;4;4;3;2;1;1;1;1;0;0;0;0;0;0;0;0;0;0;0;0;0;0;0;0;0;0;0;0;0;0;0;0;0;0;0;0;0;0;0;0;0;0;0;0;0;0;0
4;4;4;4;3;2;2;1;1;1;0;0;0;0;0;0;0;0;0;0;0;0;0;0;0;0;0;0;0;0;0;0;0;0;0;0;0;0;0;0;0;0;0;0;0;0;0;0;0;0
4;4;3;3;2;2;1;1;1;0;0;0;0;0;0;0;0;0;0;0;0;0;0;0;0;0;0;0;0;0;0;0;0;0;0;0;0;0;0;0;0;0;0;0;0;0;0;0;0;0
3;3;3;3;2;1;1;1;1;0;0;0;0;0;0;0;0;0;0;0;0;0;0;0;0;0;0;0;0;0;0;0;0;0;0;0;0;0;0;0;0;0;0;0;0;0;0;0;0;0
3;3;3;2;1;1;1;1;0;0;0;0;0;0;0;0;0;0;0;0;0;0;0;0;0;0;0;0;0;0;0;0;0;0;0;0;0;0;0;0;0;0;0;0;0;0;0;0;0;0
3;3;2;2;1;1;1;1;0;0;0;0;0;0;0;0;0;0;0;0;0;0;0;0;0;0;0;0;0;0;0;0;0;0;0;0;0;0;0;0;0;0;0;0;0;0;0;0;0;0
3;3;2;1;1;1;1;0;0;0;0;0;0;0;0;0;0;0;0;0;0;0;0;0;0;0;0;0;0;0;0;0;0;0;0;0;0;0;0;0;0;0;0;0;0;0;0;0;0;0
3;2;1;1;1;1;0;0;0;0;0;0;0;0;0;0;0;0;0;0;0;0;0;0;0;0;0;0;0;0;0;0;0;0;0;0;0;0;0;0;0;0;0;0;0;0;0;0;0;0
3;1;1;1;1;1;0;0;0;0;0;0;0;0;0;0;0;0;0;0;0;0;0;0;0;0;0;0;0;0;0;0;0;0;0;0;0;0;0;0;0;0;0;0;0;0;0;0;0;0
1;1;1;1;1;0;0;0;0;0;0;0;0;0;0;0;0;0;0;0;0;0;0;0;0;0;0;0;0;0;0;0;0;0;0;0;0;0;0;0;0;0;0;0;0;0;0;0;0;0
1;1;1;1;1;0;0;0;0;0;0;0;0;0;0;0;0;0;0;0;0;0;0;0;0;0;0;0;0;0;0;0;0;0;0;0;0;0;0;0;0;0;0;0;0;0;0;0;0;0
1;1;1;1;0;0;0;0;0;0;0;0;0;0;0;0;0;0;0;0;0;0;0;0;0;0;0;0;0;0;0;0;0;0;0;0;0;0;0;0;0;0;0;0;0;0;0;0;0;0
1;1;1;1;0;0;0;0;0;0;0;0;0;0;0;0;0;0;0;0;0;0;0;0;0;0;0;0;0;0;0;0;0;0;0;0;0;0;0;0;0;0;0;0;0;0;0;0;0;0
1;1;1;0;0;0;0;0;0;0;0;0;0;0;0;0;0;0;0;0;0;0;0;0;0;0;0;0;0;0;0;0;0;0;0;0;0;0;0;0;0;0;0;0;0;0;0;0;0;0
