109
E: -858.79958801 | E_rel_metal 0.6014302300000054: | E_rel_global -0.8449686200000315: 
Ce  1.884954  3.843916  1.372921
Ce  1.884954  7.726816  1.372921
Ce  1.884954 11.609716  1.372921
Ce  5.767854  3.843916  1.372921
Ce  5.767854  7.726816  1.372921
Ce  5.767854 11.609716  1.372921
Ce  9.650754  3.843916  1.372921
Ce  9.650754  7.726816  1.372921
Ce  9.650754 11.609716  1.372921
Ce  3.826404  1.902466  4.118502
Ce  3.826404  5.785366  4.118502
Ce  3.826404  9.668266  4.118502
Ce  7.709304  1.902466  4.118502
Ce  7.709304  5.785366  4.118502
Ce  7.709304  9.668266  4.118502
Ce 11.592204  1.902466  4.118502
Ce 11.592204  5.785366  4.118502
Ce 11.592204  9.668266  4.118502
Ce  1.880228  3.868731  6.814000
Ce  1.885522  7.753107  6.905999
Ce  1.871237 11.582783  6.897849
Ce  5.767292  3.824178  6.837952
Ce  5.748165  7.767745  6.857641
Ce  5.759560 11.566127  6.917222
Ce  9.669010  3.892263  6.846894
Ce  9.680484  7.781650  6.918762
Ce  9.668112 11.578099  6.860909
Ce  3.677819  1.966991  9.501047
Ce  3.941538  5.665197  9.651105
Ce  3.831093  9.677552  9.730477
Ce  7.874933  1.857052  9.485726
Ce  7.591758  5.876868  9.482538
Ce  7.727398  9.629729  9.775479
Ce 11.518247  2.011292  9.635989
Ce  0.103187  5.754507  9.597657
Ce 11.580434  9.610503  9.743448
 O  1.884954  1.902466  0.000000
 O  1.884954  5.785366  0.000000
 O  1.884954  9.668266  0.000000
 O  5.767854  1.902466  0.000000
 O  5.767854  5.785366  0.000000
 O  5.767854  9.668266  0.000000
 O  9.650754  1.902466  0.000000
 O  9.650754  5.785366  0.000000
 O  9.650754  9.668266  0.000000
 O  3.826404  3.843916  2.745841
 O  1.884954  1.902466  2.745841
 O  3.826404  7.726816  2.745841
 O  1.884954  5.785366  2.745841
 O  3.826404 11.609716  2.745841
 O  1.884954  9.668266  2.745841
 O  7.709304  3.843916  2.745841
 O  5.767854  1.902466  2.745841
 O  7.709304  7.726816  2.745841
 O  5.767854  5.785366  2.745841
 O  7.709304 11.609716  2.745841
 O  5.767854  9.668266  2.745841
 O 11.592204  3.843916  2.745841
 O  9.650754  1.902466  2.745841
 O 11.592204  7.726816  2.745841
 O  9.650754  5.785366  2.745841
 O 11.592204 11.609716  2.745841
 O  9.650754  9.668266  2.745841
 O  1.879131  1.916145  5.452842
 O  1.887616  5.779386  5.454942
 O  1.887805  9.682133  5.420087
 O  5.777077  1.894496  5.547923
 O  5.766271  5.767754  5.446423
 O  5.761981  9.683987  5.427754
 O  9.647936  1.924264  5.442202
 O  9.650322  5.795018  5.519797
 O  9.652862  9.658902  5.422013
 O  3.847994  3.837337  5.483852
 O  3.825446  7.731859  5.558643
 O  3.830784 11.621529  5.562200
 O  7.709326  3.847917  5.546941
 O  7.697272  7.725430  5.538599
 O  7.707391 11.608456  5.549677
 O 11.580192  3.858874  5.484905
 O 11.603422  7.724995  5.521222
 O 11.589242 11.610009  5.558271
 O  1.877257  1.959421  8.161868
 O  1.964512  5.755034  8.175607
 O  1.942419  9.681412  8.054057
 O  5.793697  1.903450  8.448484
 O  5.805190  5.731801  8.099273
 O  5.709923  9.677285  8.053218
 O  9.621223  1.960446  8.098237
 O  9.583094  5.808962  8.370052
 O  9.652796  9.712229  8.049404
 O  3.861607  3.822094  8.202330
 O  3.886014  7.649037  8.539947
 O  3.783922  0.019191  8.416220
 O  7.719129  3.850090  8.454935
 O  7.634314  7.732435  8.336442
 O  7.746083 11.636822  8.395930
 O 11.564989  3.854575  8.217639
 O -0.008929  7.728166  8.283241
 O 11.585307  0.057437  8.491471
 O  1.834939  1.939589 10.887283
 O  2.078735  5.586240 10.966944
 O  2.050671  9.571966 10.806108
 O  3.787672  3.674516 10.934332
 O  5.935240  5.982213 10.728957
 O  5.616402 10.087336 10.786739
 O  9.527726  1.631952 10.728033
 O  0.116565  3.853720 11.018761
 O  9.631539  8.816412 10.679217
Co  1.938754  3.765999 11.178188