109
E: -855.23855781 | E_rel_metal 1.5352201200000763: | E_rel_global 1.1077715799999623: 
Ce  1.884954  3.843916  1.372921
Ce  1.884954  7.726816  1.372921
Ce  1.884954 11.609716  1.372921
Ce  5.767854  3.843916  1.372921
Ce  5.767854  7.726816  1.372921
Ce  5.767854 11.609716  1.372921
Ce  9.650754  3.843916  1.372921
Ce  9.650754  7.726816  1.372921
Ce  9.650754 11.609716  1.372921
Ce  3.826404  1.902466  4.118502
Ce  3.826404  5.785366  4.118502
Ce  3.826404  9.668266  4.118502
Ce  7.709304  1.902466  4.118502
Ce  7.709304  5.785366  4.118502
Ce  7.709304  9.668266  4.118502
Ce 11.592204  1.902466  4.118502
Ce 11.592204  5.785366  4.118502
Ce 11.592204  9.668266  4.118502
Ce  1.857048  3.874142  6.884270
Ce  1.892460  7.717389  6.949642
Ce  1.866531 11.616340  6.892450
Ce  5.784344  3.842386  6.830839
Ce  5.769146  7.736116  6.869580
Ce  5.761807 11.584676  6.888613
Ce  9.654421  3.855728  6.829831
Ce  9.653685  7.738276  6.860788
Ce  9.674889 11.592195  6.862671
Ce  3.726679  2.010861  9.495497
Ce  4.091238  5.672652  9.599884
Ce  3.858200  9.658664  9.643466
Ce  7.842642  1.921849  9.486821
Ce  7.745974  5.878634  9.701508
Ce  7.740365  9.697676  9.644196
Ce 11.485839  2.068538  9.800488
Ce 11.401310  5.735652  9.598373
Ce 11.595202  9.698379  9.611196
 O  1.884954  1.902466  0.000000
 O  1.884954  5.785366  0.000000
 O  1.884954  9.668266  0.000000
 O  5.767854  1.902466  0.000000
 O  5.767854  5.785366  0.000000
 O  5.767854  9.668266  0.000000
 O  9.650754  1.902466  0.000000
 O  9.650754  5.785366  0.000000
 O  9.650754  9.668266  0.000000
 O  3.826404  3.843916  2.745841
 O  1.884954  1.902466  2.745841
 O  3.826404  7.726816  2.745841
 O  1.884954  5.785366  2.745841
 O  3.826404 11.609716  2.745841
 O  1.884954  9.668266  2.745841
 O  7.709304  3.843916  2.745841
 O  5.767854  1.902466  2.745841
 O  7.709304  7.726816  2.745841
 O  5.767854  5.785366  2.745841
 O  7.709304 11.609716  2.745841
 O  5.767854  9.668266  2.745841
 O 11.592204  3.843916  2.745841
 O  9.650754  1.902466  2.745841
 O 11.592204  7.726816  2.745841
 O  9.650754  5.785366  2.745841
 O 11.592204 11.609716  2.745841
 O  9.650754  9.668266  2.745841
 O  1.872822  1.905742  5.458736
 O  1.886981  5.787896  5.543333
 O  1.891518  9.673568  5.437221
 O  5.781375  1.886885  5.517325
 O  5.767434  5.778451  5.437899
 O  5.761817  9.681672  5.432613
 O  9.652878  1.902579  5.432126
 O  9.646711  5.798520  5.413993
 O  9.650132  9.662859  5.414286
 O  3.832922  3.840212  5.475427
 O  3.825570  7.724017  5.567968
 O  3.827944 11.626710  5.580028
 O  7.705288  3.838247  5.516819
 O  7.697035  7.726541  5.548084
 O  7.708418 11.606722  5.559060
 O 11.591786  3.856755  5.491223
 O 11.606870  7.723571  5.566071
 O 11.589920 11.605309  5.559419
 O  1.912539  1.958403  8.149398
 O  1.895941  5.782839  8.416590
 O  1.895634  9.673464  8.074352
 O  5.780873  1.887927  8.351883
 O  5.775846  5.743720  8.086066
 O  5.742141  9.668654  8.069349
 O  9.599979  1.886407  8.101227
 O  9.650149  5.781340  8.060889
 O  9.681257  9.667692  8.054445
 O  3.858149  3.846464  8.174084
 O  3.851609  7.723554  8.454151
 O  3.799745 11.602928  8.460939
 O  7.715676  3.843727  8.393271
 O  7.703040  7.801469  8.398247
 O  7.721415 11.580030  8.403292
 O 11.522672  3.855890  8.248905
 O 11.605164  7.762648  8.433703
 O 11.608716 11.611751  8.468801
 O  1.992414  1.856352 10.935939
 O  0.211968  4.126079 11.160261
 O  1.946100  9.580057 10.690129
 O  4.147621  3.665551 10.916053
 O  5.662381  6.342787 10.726306
 O  5.824354 10.018636 10.669678
 O  9.326007  2.101120 10.826131
 O  9.775297  6.326997 10.717597
 O  9.668282  9.924362 10.671544
Pd  2.118722  3.785901 11.313451