109
E: -860.04868595 | E_rel_metal 0.10604311999998117: | E_rel_global -0.0690665600001239: 
Ce  1.884954  3.843916  1.372921
Ce  1.884954  7.726816  1.372921
Ce  1.884954 11.609716  1.372921
Ce  5.767854  3.843916  1.372921
Ce  5.767854  7.726816  1.372921
Ce  5.767854 11.609716  1.372921
Ce  9.650754  3.843916  1.372921
Ce  9.650754  7.726816  1.372921
Ce  9.650754 11.609716  1.372921
Ce  3.826404  1.902466  4.118502
Ce  3.826404  5.785366  4.118502
Ce  3.826404  9.668266  4.118502
Ce  7.709304  1.902466  4.118502
Ce  7.709304  5.785366  4.118502
Ce  7.709304  9.668266  4.118502
Ce 11.592204  1.902466  4.118502
Ce 11.592204  5.785366  4.118502
Ce 11.592204  9.668266  4.118502
Ce  1.871399  3.872295  6.844484
Ce  1.902143  7.731406  6.895046
Ce  1.864245 11.608988  6.871544
Ce  5.756402  3.847822  6.834062
Ce  5.750171  7.760503  6.855986
Ce  5.757719 11.599400  6.917604
Ce  9.671637  3.862975  6.857212
Ce  9.671557  7.752204  6.887377
Ce  9.658451 11.592835  6.847883
Ce  3.655836  1.992517  9.504871
Ce  4.006015  5.697067  9.735667
Ce  3.824528  9.648600  9.634010
Ce  7.815076  1.892613  9.524683
Ce  7.631354  5.819553  9.488325
Ce  7.683162  9.656834  9.671594
Ce 11.442193  1.995649  9.725399
Ce  0.118391  5.737431  9.598932
Ce 11.594738  9.665334  9.598622
 O  1.884954  1.902466  0.000000
 O  1.884954  5.785366  0.000000
 O  1.884954  9.668266  0.000000
 O  5.767854  1.902466  0.000000
 O  5.767854  5.785366  0.000000
 O  5.767854  9.668266  0.000000
 O  9.650754  1.902466  0.000000
 O  9.650754  5.785366  0.000000
 O  9.650754  9.668266  0.000000
 O  3.826404  3.843916  2.745841
 O  1.884954  1.902466  2.745841
 O  3.826404  7.726816  2.745841
 O  1.884954  5.785366  2.745841
 O  3.826404 11.609716  2.745841
 O  1.884954  9.668266  2.745841
 O  7.709304  3.843916  2.745841
 O  5.767854  1.902466  2.745841
 O  7.709304  7.726816  2.745841
 O  5.767854  5.785366  2.745841
 O  7.709304 11.609716  2.745841
 O  5.767854  9.668266  2.745841
 O 11.592204  3.843916  2.745841
 O  9.650754  1.902466  2.745841
 O 11.592204  7.726816  2.745841
 O  9.650754  5.785366  2.745841
 O 11.592204 11.609716  2.745841
 O  9.650754  9.668266  2.745841
 O  1.862850  1.927285  5.464965
 O  1.879577  5.791175  5.464382
 O  1.877703  9.663080  5.432164
 O  5.778621  1.975887  5.503318
 O  5.760503  5.774811  5.442448
 O  5.762566  9.618457  5.412520
 O  9.668011  1.931312  5.446865
 O  9.661724  5.793382  5.522359
 O  9.661224  9.646495  5.426802
 O  3.814524  3.853197  5.490825
 O  3.815119  7.720096  5.561818
 O  3.760765 11.629142  5.531190
 O  7.721700  3.865411  5.541958
 O  7.723248  7.710698  5.565982
 O  7.769690 11.616994  5.516389
 O 11.585512  3.863903  5.494719
 O 11.595500  7.717415  5.555945
 O 11.586692 11.608977  5.557976
 O  1.876948  1.936620  8.172013
 O  1.916549  5.786416  8.192289
 O  1.897193  9.685418  8.062598
 O  5.755560  1.953548  8.524643
 O  5.850106  5.765666  8.098408
 O  5.748449  9.588456  8.143937
 O  9.580561  1.909818  8.104350
 O  9.621845  5.823010  8.376103
 O  9.653232  9.678571  8.054946
 O  3.843710  3.827210  8.219576
 O  3.836559  7.739246  8.466850
 O  3.750002 11.618863  8.536494
 O  7.726854  3.845517  8.384244
 O  7.703422  7.767507  8.423359
 O  7.760785 11.577064  8.496313
 O 11.551242  3.855750  8.259781
 O 11.618475  7.779713  8.398992
 O 11.571362 11.596588  8.466975
 O  1.874953  1.865380 11.047803
 O  2.043127  5.711482 11.178048
 O  1.868458  9.576246 10.683757
 O  3.867585  3.623584 11.098722
 O  6.129211  5.945229 10.822021
 O  5.786067  9.902572 10.739084
 O  9.338404  1.865924 10.842163
 O  0.021567  3.927227 11.236515
 O  9.630422  9.394672 10.680963
Ir  1.929162  3.796965 11.323690