109
E: -858.88894909 | E_rel_metal 1.2657799800000475: | E_rel_global 1.0906702999999425: 
Ce  1.884954  3.843916  1.372921
Ce  1.884954  7.726816  1.372921
Ce  1.884954 11.609716  1.372921
Ce  5.767854  3.843916  1.372921
Ce  5.767854  7.726816  1.372921
Ce  5.767854 11.609716  1.372921
Ce  9.650754  3.843916  1.372921
Ce  9.650754  7.726816  1.372921
Ce  9.650754 11.609716  1.372921
Ce  3.826404  1.902466  4.118502
Ce  3.826404  5.785366  4.118502
Ce  3.826404  9.668266  4.118502
Ce  7.709304  1.902466  4.118502
Ce  7.709304  5.785366  4.118502
Ce  7.709304  9.668266  4.118502
Ce 11.592204  1.902466  4.118502
Ce 11.592204  5.785366  4.118502
Ce 11.592204  9.668266  4.118502
Ce  1.887434  3.843916  6.888723
Ce  1.884046  7.738356  6.914602
Ce  1.884046 11.598175  6.914602
Ce  5.773466  3.843916  6.826583
Ce  5.768953  7.745122  6.871767
Ce  5.768953 11.591409  6.871767
Ce  9.649162  3.843916  6.821947
Ce  9.653407  7.756965  6.882389
Ce  9.653407 11.579566  6.882389
Ce  3.942866  1.940790  9.595904
Ce  3.942866  5.747041  9.595904
Ce  3.849343  9.668266  9.711347
Ce  7.717390  1.902761  9.609023
Ce  7.717390  5.785071  9.609023
Ce  7.685778  9.668266  9.704366
Ce 11.484341  1.942135  9.584172
Ce 11.484341  5.745697  9.584172
Ce 11.579883  9.668266  9.775607
 O  1.884954  1.902466  0.000000
 O  1.884954  5.785366  0.000000
 O  1.884954  9.668266  0.000000
 O  5.767854  1.902466  0.000000
 O  5.767854  5.785366  0.000000
 O  5.767854  9.668266  0.000000
 O  9.650754  1.902466  0.000000
 O  9.650754  5.785366  0.000000
 O  9.650754  9.668266  0.000000
 O  3.826404  3.843916  2.745841
 O  1.884954  1.902466  2.745841
 O  3.826404  7.726816  2.745841
 O  1.884954  5.785366  2.745841
 O  3.826404 11.609716  2.745841
 O  1.884954  9.668266  2.745841
 O  7.709304  3.843916  2.745841
 O  5.767854  1.902466  2.745841
 O  7.709304  7.726816  2.745841
 O  5.767854  5.785366  2.745841
 O  7.709304 11.609716  2.745841
 O  5.767854  9.668266  2.745841
 O 11.592204  3.843916  2.745841
 O  9.650754  1.902466  2.745841
 O 11.592204  7.726816  2.745841
 O  9.650754  5.785366  2.745841
 O 11.592204 11.609716  2.745841
 O  9.650754  9.668266  2.745841
 O  1.881390  1.900192  5.471706
 O  1.881390  5.787639  5.471706
 O  1.889902  9.668266  5.425739
 O  5.767798  1.907288  5.417895
 O  5.767798  5.780543  5.417895
 O  5.761193  9.668266  5.414658
 O  9.654423  1.904282  5.420741
 O  9.654423  5.783550  5.420741
 O  9.648542  9.668266  5.412578
 O  3.817751  3.843916  5.534036
 O  3.825679  7.723293  5.583446
 O  3.825679 11.613239  5.583446
 O  7.711869  3.843916  5.539265
 O  7.708331  7.729006  5.573600
 O  7.708331 11.607525  5.573600
 O 11.602580  3.843916  5.532405
 O 11.594723  7.734580  5.586665
 O 11.594723 11.601951  5.586665
 O  1.892515  1.928229  8.195611
 O  1.892515  5.759602  8.195611
 O  1.918818  9.668266  8.070032
 O  5.790029  1.908284  8.066411
 O  5.790029  5.779547  8.066411
 O  5.764939  9.668266  8.056850
 O  9.631616  1.908847  8.068303
 O  9.631616  5.778984  8.068303
 O  9.631284  9.668266  8.055479
 O  3.908403  3.843916  8.357948
 O  3.846150  7.686221  8.499451
 O  3.846150  0.001610  8.499451
 O  7.716086  3.843916  8.454805
 O  7.705322  7.705726  8.483168
 O  7.705322 -0.017895  8.483168
 O 11.523444  3.843916  8.345125
 O 11.583458  7.679186  8.497599
 O 11.583458  0.008645  8.497599
 O  1.886689  1.986998 11.040517
 O  1.886689  5.700833 11.040517
 O  2.090421  9.668266 10.798453
 O  5.785166  1.933873 10.695970
 O  5.785166  5.753958 10.695970
 O  5.767946  9.668266 10.757298
 O  9.646209  1.926865 10.698215
 O  9.646209  5.760966 10.698215
 O  9.441927  9.668266 10.794810
Ir  1.885594  3.843916 11.211624