109
E: -853.88585059 | E_rel_metal 0.7456183799999963: | E_rel_global 0.4655087999999523: 
Ce  1.884954  3.843916  1.372921
Ce  1.884954  7.726816  1.372921
Ce  1.884954 11.609716  1.372921
Ce  5.767854  3.843916  1.372921
Ce  5.767854  7.726816  1.372921
Ce  5.767854 11.609716  1.372921
Ce  9.650754  3.843916  1.372921
Ce  9.650754  7.726816  1.372921
Ce  9.650754 11.609716  1.372921
Ce  3.826404  1.902466  4.118502
Ce  3.826404  5.785366  4.118502
Ce  3.826404  9.668266  4.118502
Ce  7.709304  1.902466  4.118502
Ce  7.709304  5.785366  4.118502
Ce  7.709304  9.668266  4.118502
Ce 11.592204  1.902466  4.118502
Ce 11.592204  5.785366  4.118502
Ce 11.592204  9.668266  4.118502
Ce  1.880939  3.905654  6.852509
Ce  1.885357  7.731312  6.972505
Ce  1.870710 11.597936  6.880764
Ce  5.773703  3.812109  6.857851
Ce  5.764252  7.750107  6.855822
Ce  5.755044 11.594447  6.917318
Ce  9.662227  3.852535  6.794772
Ce  9.666605  7.776595  6.870794
Ce  9.681725 11.572304  6.865323
Ce  3.613212  1.957618  9.555532
Ce  4.094213  5.668472  9.592591
Ce  3.843819  9.663240  9.682959
Ce  7.921180  1.881850  9.502888
Ce  7.739489  5.869917  9.580269
Ce  7.691396  9.700709  9.695988
Ce 11.589183  1.995393  9.670301
Ce 11.381290  5.707668  9.567564
Ce 11.607560  9.702460  9.737425
 O  1.884954  1.902466  0.000000
 O  1.884954  5.785366  0.000000
 O  1.884954  9.668266  0.000000
 O  5.767854  1.902466  0.000000
 O  5.767854  5.785366  0.000000
 O  5.767854  9.668266  0.000000
 O  9.650754  1.902466  0.000000
 O  9.650754  5.785366  0.000000
 O  9.650754  9.668266  0.000000
 O  3.826404  3.843916  2.745841
 O  1.884954  1.902466  2.745841
 O  3.826404  7.726816  2.745841
 O  1.884954  5.785366  2.745841
 O  3.826404 11.609716  2.745841
 O  1.884954  9.668266  2.745841
 O  7.709304  3.843916  2.745841
 O  5.767854  1.902466  2.745841
 O  7.709304  7.726816  2.745841
 O  5.767854  5.785366  2.745841
 O  7.709304 11.609716  2.745841
 O  5.767854  9.668266  2.745841
 O 11.592204  3.843916  2.745841
 O  9.650754  1.902466  2.745841
 O 11.592204  7.726816  2.745841
 O  9.650754  5.785366  2.745841
 O 11.592204 11.609716  2.745841
 O  9.650754  9.668266  2.745841
 O  1.881536  1.912261  5.447907
 O  1.889805  5.803607  5.517387
 O  1.889801  9.673235  5.439576
 O  5.773338  1.893428  5.548974
 O  5.769155  5.771922  5.446049
 O  5.762876  9.678422  5.436295
 O  9.658858  1.908059  5.426670
 O  9.648002  5.795115  5.415061
 O  9.652445  9.663661  5.410529
 O  3.840854  3.848130  5.487351
 O  3.824965  7.728549  5.573874
 O  3.832929 11.618292  5.552885
 O  7.702667  3.830534  5.532821
 O  7.699589  7.735328  5.550414
 O  7.705428 11.612833  5.556819
 O 11.596876  3.864916  5.484269
 O 11.607394  7.728131  5.578915
 O 11.594308 11.600916  5.541202
 O  1.876494  2.018527  8.112011
 O  1.894279  5.780338  8.356993
 O  1.912179  9.681169  8.085132
 O  5.797185  1.903456  8.452047
 O  5.823653  5.721521  8.089134
 O  5.751367  9.674579  8.070959
 O  9.632536  1.919447  8.083214
 O  9.621949  5.776618  8.058849
 O  9.662342  9.679557  8.050503
 O  3.859703  3.844495  8.203802
 O  3.905706  7.672978  8.470298
 O  3.795530  0.001523  8.400796
 O  7.755010  3.839946  8.456531
 O  7.690296  7.760105  8.406356
 O  7.736282 11.619709  8.396411
 O 11.523828  3.856508  8.235817
 O 11.571715  7.702185  8.453412
 O 11.594998  0.039545  8.412760
 O  1.823263  1.274001 10.622477
 O  0.019306  3.999618 11.006109
 O  2.123622  9.282315 10.760417
 O  3.999433  3.764361 10.945147
 O  5.881744  6.141260 10.690291
 O  5.770692 10.053868 10.717585
 O  9.585830  1.780950 10.723413
 O  9.552503  6.109462 10.679922
 O  9.434019  9.803703 10.762555
Au  2.000960  3.994782 11.197992