109
E: -857.75805377 | E_rel_metal 0.795479230000069: | E_rel_global 0.6414556199999879: 
Ce  1.884954  3.843916  1.372921
Ce  1.884954  7.726816  1.372921
Ce  1.884954 11.609716  1.372921
Ce  5.767854  3.843916  1.372921
Ce  5.767854  7.726816  1.372921
Ce  5.767854 11.609716  1.372921
Ce  9.650754  3.843916  1.372921
Ce  9.650754  7.726816  1.372921
Ce  9.650754 11.609716  1.372921
Ce  3.826404  1.902466  4.118502
Ce  3.826404  5.785366  4.118502
Ce  3.826404  9.668266  4.118502
Ce  7.709304  1.902466  4.118502
Ce  7.709304  5.785366  4.118502
Ce  7.709304  9.668266  4.118502
Ce 11.592204  1.902466  4.118502
Ce 11.592204  5.785366  4.118502
Ce 11.592204  9.668266  4.118502
Ce  1.878351  3.861203  6.904070
Ce  1.880111  7.715185  6.911089
Ce  1.887355 11.610378  6.889018
Ce  5.783665  3.826830  6.842574
Ce  5.768465  7.755633  6.853105
Ce  5.779959 11.607025  6.877242
Ce  9.642062  3.847202  6.861186
Ce  9.654403  7.733392  6.867504
Ce  9.645661 11.609559  6.872227
Ce  3.956659  1.925861  9.604923
Ce  3.923367  5.759574  9.571131
Ce  3.855751  9.674181  9.670115
Ce  7.737799  1.912987  9.721251
Ce  7.640034  5.784027  9.596765
Ce  7.731000  9.674655  9.638475
Ce 11.511532  1.938359  9.578843
Ce 11.369926  5.758468  9.712926
Ce 11.602054  9.661986  9.635500
 O  1.884954  1.902466  0.000000
 O  1.884954  5.785366  0.000000
 O  1.884954  9.668266  0.000000
 O  5.767854  1.902466  0.000000
 O  5.767854  5.785366  0.000000
 O  5.767854  9.668266  0.000000
 O  9.650754  1.902466  0.000000
 O  9.650754  5.785366  0.000000
 O  9.650754  9.668266  0.000000
 O  3.826404  3.843916  2.745841
 O  1.884954  1.902466  2.745841
 O  3.826404  7.726816  2.745841
 O  1.884954  5.785366  2.745841
 O  3.826404 11.609716  2.745841
 O  1.884954  9.668266  2.745841
 O  7.709304  3.843916  2.745841
 O  5.767854  1.902466  2.745841
 O  7.709304  7.726816  2.745841
 O  5.767854  5.785366  2.745841
 O  7.709304 11.609716  2.745841
 O  5.767854  9.668266  2.745841
 O 11.592204  3.843916  2.745841
 O  9.650754  1.902466  2.745841
 O 11.592204  7.726816  2.745841
 O  9.650754  5.785366  2.745841
 O 11.592204 11.609716  2.745841
 O  9.650754  9.668266  2.745841
 O  1.873140  1.900033  5.477550
 O  1.877623  5.785103  5.479069
 O  1.890182  9.677670  5.430451
 O  5.776290  1.903935  5.416414
 O  5.763637  5.785601  5.417636
 O  5.761062  9.678025  5.415516
 O  9.648805  1.905970  5.428720
 O  9.651379  5.799871  5.420223
 O  9.649034  9.661992  5.413783
 O  3.815943  3.839903  5.542412
 O  3.819936  7.729250  5.575478
 O  3.824625 11.625468  5.583832
 O  7.712307  3.846727  5.534971
 O  7.700627  7.734087  5.564519
 O  7.712794 11.609611  5.565460
 O 11.593991  3.851071  5.541793
 O 11.603947  7.728820  5.578091
 O 11.589425 11.611242  5.575279
 O  1.894943  1.926455  8.217018
 O  1.976427  5.777946  8.205003
 O  1.893022  9.664310  8.071592
 O  5.741565  1.880640  8.075915
 O  5.755330  5.803492  8.058691
 O  5.755147  9.677448  8.063267
 O  9.684389  1.896446  8.079121
 O  9.590525  5.800968  8.078036
 O  9.671891  9.669076  8.056680
 O  3.893477  3.840370  8.387621
 O  3.847956  7.745243  8.504462
 O  3.819673 11.596823  8.499010
 O  7.678664  3.847206  8.404043
 O  7.690670  7.761890  8.453082
 O  7.721487 11.582376  8.468082
 O 11.548293  3.858618  8.374236
 O 11.597981  7.730593  8.481218
 O 11.606835 11.597305  8.476167
 O  1.897420  2.082131 11.056913
 O  1.968526  5.579003 11.103160
 O  1.910685  9.658218 10.709768
 O  5.599307  1.915877 10.793373
 O  5.660914  5.768028 10.716856
 O  5.801601  9.685768 10.707617
 O  9.883630  1.956875 10.786774
 O  9.327995  5.744221 10.791623
 O  9.682001  9.670570 10.700454
Rh  1.928858  3.827783 11.518192