109
E: -856.7535254 | E_rel_metal 0.020252530000107072: | E_rel_global -0.40719601000000694: 
Ce  1.884954  3.843916  1.372921
Ce  1.884954  7.726816  1.372921
Ce  1.884954 11.609716  1.372921
Ce  5.767854  3.843916  1.372921
Ce  5.767854  7.726816  1.372921
Ce  5.767854 11.609716  1.372921
Ce  9.650754  3.843916  1.372921
Ce  9.650754  7.726816  1.372921
Ce  9.650754 11.609716  1.372921
Ce  3.826404  1.902466  4.118502
Ce  3.826404  5.785366  4.118502
Ce  3.826404  9.668266  4.118502
Ce  7.709304  1.902466  4.118502
Ce  7.709304  5.785366  4.118502
Ce  7.709304  9.668266  4.118502
Ce 11.592204  1.902466  4.118502
Ce 11.592204  5.785366  4.118502
Ce 11.592204  9.668266  4.118502
Ce  1.888285  3.851729  6.786162
Ce  1.898035  7.758203  6.902205
Ce  1.862173 11.587412  6.900535
Ce  5.768246  3.800461  6.860454
Ce  5.747661  7.758030  6.845993
Ce  5.758572 11.608920  6.921624
Ce  9.659022  3.868734  6.861267
Ce  9.674898  7.776869  6.913445
Ce  9.668733 11.604659  6.874351
Ce  3.658303  1.996596  9.504454
Ce  3.942000  5.672554  9.665787
Ce  3.831252  9.676029  9.689118
Ce  7.902154  1.850970  9.614494
Ce  7.576877  5.842821  9.480558
Ce  7.674003  9.676945  9.670732
Ce 11.533128  2.007276  9.675549
Ce  0.163971  5.710155  9.516955
Ce 11.588893  9.700920  9.732908
 O  1.884954  1.902466  0.000000
 O  1.884954  5.785366  0.000000
 O  1.884954  9.668266  0.000000
 O  5.767854  1.902466  0.000000
 O  5.767854  5.785366  0.000000
 O  5.767854  9.668266  0.000000
 O  9.650754  1.902466  0.000000
 O  9.650754  5.785366  0.000000
 O  9.650754  9.668266  0.000000
 O  3.826404  3.843916  2.745841
 O  1.884954  1.902466  2.745841
 O  3.826404  7.726816  2.745841
 O  1.884954  5.785366  2.745841
 O  3.826404 11.609716  2.745841
 O  1.884954  9.668266  2.745841
 O  7.709304  3.843916  2.745841
 O  5.767854  1.902466  2.745841
 O  7.709304  7.726816  2.745841
 O  5.767854  5.785366  2.745841
 O  7.709304 11.609716  2.745841
 O  5.767854  9.668266  2.745841
 O 11.592204  3.843916  2.745841
 O  9.650754  1.902466  2.745841
 O 11.592204  7.726816  2.745841
 O  9.650754  5.785366  2.745841
 O 11.592204 11.609716  2.745841
 O  9.650754  9.668266  2.745841
 O  1.875073  1.903878  5.437409
 O  1.891902  5.791506  5.439932
 O  1.887751  9.678365  5.425182
 O  5.787120  1.893334  5.515208
 O  5.762040  5.780994  5.443831
 O  5.759644  9.678313  5.431669
 O  9.648151  1.919920  5.446943
 O  9.649129  5.808820  5.547063
 O  9.652712  9.653178  5.430171
 O  3.846913  3.826699  5.474224
 O  3.822564  7.737955  5.564122
 O  3.830317 11.626397  5.575603
 O  7.712337  3.851277  5.537638
 O  7.705505  7.726609  5.552631
 O  7.710352 11.609596  5.550526
 O 11.576277  3.862350  5.461137
 O 11.600409  7.732400  5.569236
 O 11.584028 11.605949  5.546959
 O  1.887176  1.952953  8.123943
 O  1.939354  5.765728  8.132431
 O  1.917334  9.653811  8.073026
 O  5.707384  1.896551  8.343227
 O  5.801610  5.748091  8.095247
 O  5.733465  9.669796  8.073498
 O  9.653028  1.982412  8.108817
 O  9.643137  5.819301  8.455794
 O  9.659221  9.684039  8.059336
 O  3.835860  3.861472  8.186767
 O  3.881546  7.673620  8.510219
 O  3.766058 11.623050  8.449617
 O  7.702414  3.872319  8.428042
 O  7.659613  7.745134  8.368859
 O  7.728334 11.606616  8.383183
 O 11.603444  3.895585  8.166792
 O 11.644800  7.701391  8.431660
 O 11.609358  0.014531  8.413934
 O  1.856742  1.839161 10.886681
 O  2.029400  5.897073 10.873553
 O  2.084028  9.690685 10.784527
 O  3.964402  3.719443 10.913478
 O  5.952121  6.033853 10.734172
 O  5.793648 10.033963 10.725364
 O  9.810564  1.422709 10.744386
 O 11.558288  4.028737 10.919420
 O  9.396081  9.247894 10.736019
Pd  1.935412  3.866226 11.093750