109
E: -855.10680485 | E_rel_metal 0.5281305400000065: | E_rel_global -0.2485054600000467: 
Ce  1.884954  3.843916  1.372921
Ce  1.884954  7.726816  1.372921
Ce  1.884954 11.609716  1.372921
Ce  5.767854  3.843916  1.372921
Ce  5.767854  7.726816  1.372921
Ce  5.767854 11.609716  1.372921
Ce  9.650754  3.843916  1.372921
Ce  9.650754  7.726816  1.372921
Ce  9.650754 11.609716  1.372921
Ce  3.826404  1.902466  4.118502
Ce  3.826404  5.785366  4.118502
Ce  3.826404  9.668266  4.118502
Ce  7.709304  1.902466  4.118502
Ce  7.709304  5.785366  4.118502
Ce  7.709304  9.668266  4.118502
Ce 11.592204  1.902466  4.118502
Ce 11.592204  5.785366  4.118502
Ce 11.592204  9.668266  4.118502
Ce  1.884601  3.852818  6.777042
Ce  1.895757  7.758304  6.904921
Ce  1.860573 11.588024  6.902443
Ce  5.763739  3.801307  6.861663
Ce  5.744769  7.758686  6.846028
Ce  5.754973 11.612446  6.925172
Ce  9.655248  3.869150  6.858001
Ce  9.673238  7.774480  6.913521
Ce  9.666736 11.604233  6.874402
Ce  3.641394  2.009373  9.511366
Ce  3.928005  5.675189  9.671554
Ce  3.830249  9.680066  9.687126
Ce  7.894286  1.856017  9.615073
Ce  7.569106  5.839051  9.475564
Ce  7.673121  9.676936  9.668662
Ce 11.523186  2.008877  9.673872
Ce  0.157273  5.703136  9.520356
Ce 11.586689  9.699852  9.733183
 O  1.884954  1.902466  0.000000
 O  1.884954  5.785366  0.000000
 O  1.884954  9.668266  0.000000
 O  5.767854  1.902466  0.000000
 O  5.767854  5.785366  0.000000
 O  5.767854  9.668266  0.000000
 O  9.650754  1.902466  0.000000
 O  9.650754  5.785366  0.000000
 O  9.650754  9.668266  0.000000
 O  3.826404  3.843916  2.745841
 O  1.884954  1.902466  2.745841
 O  3.826404  7.726816  2.745841
 O  1.884954  5.785366  2.745841
 O  3.826404 11.609716  2.745841
 O  1.884954  9.668266  2.745841
 O  7.709304  3.843916  2.745841
 O  5.767854  1.902466  2.745841
 O  7.709304  7.726816  2.745841
 O  5.767854  5.785366  2.745841
 O  7.709304 11.609716  2.745841
 O  5.767854  9.668266  2.745841
 O 11.592204  3.843916  2.745841
 O  9.650754  1.902466  2.745841
 O 11.592204  7.726816  2.745841
 O  9.650754  5.785366  2.745841
 O 11.592204 11.609716  2.745841
 O  9.650754  9.668266  2.745841
 O  1.875919  1.905821  5.436036
 O  1.892257  5.792481  5.439706
 O  1.887339  9.677908  5.426374
 O  5.785690  1.894307  5.517952
 O  5.761452  5.781140  5.443977
 O  5.759303  9.678468  5.431348
 O  9.647579  1.921223  5.445806
 O  9.652072  5.805813  5.538245
 O  9.653213  9.653691  5.428895
 O  3.845376  3.827241  5.473342
 O  3.822187  7.737600  5.564734
 O  3.828148 11.627521  5.579439
 O  7.708758  3.851144  5.536775
 O  7.705676  7.725636  5.553164
 O  7.709122 11.610975  5.550330
 O 11.576370  3.861250  5.459864
 O 11.601155  7.731914  5.573163
 O 11.584676 11.606712  5.547372
 O  1.880795  1.957565  8.120808
 O  1.932438  5.764395  8.133442
 O  1.915738  9.653257  8.074616
 O  5.697457  1.901814  8.346053
 O  5.796104  5.749014  8.095489
 O  5.726660  9.671855  8.072871
 O  9.646527  1.979749  8.106152
 O  9.630311  5.811804  8.428490
 O  9.652667  9.684367  8.059283
 O  3.823477  3.866541  8.191569
 O  3.878339  7.676618  8.511216
 O  3.761779 11.627525  8.454718
 O  7.695778  3.871893  8.419157
 O  7.653168  7.745422  8.371985
 O  7.723479 11.606786  8.385986
 O 11.602415  3.894092  8.166554
 O 11.633047  7.702438  8.437900
 O 11.606845  0.012628  8.413952
 O  1.841013  1.917977 10.852911
 O  2.009406  5.825868 10.846833
 O  2.084037  9.690969 10.788103
 O  3.861922  3.744316 10.896017
 O  5.946443  6.008764 10.736069
 O  5.793947 10.031464 10.726030
 O  9.800868  1.437011 10.749601
 O 11.608230  4.018521 10.895245
 O  9.396308  9.250182 10.737174
Cu  1.910047  3.867876 11.188682