109
E: -856.39619697 | E_rel_metal 0.3775809600000457: | E_rel_global -0.0498675800000683: 
Ce  1.884954  3.843916  1.372921
Ce  1.884954  7.726816  1.372921
Ce  1.884954 11.609716  1.372921
Ce  5.767854  3.843916  1.372921
Ce  5.767854  7.726816  1.372921
Ce  5.767854 11.609716  1.372921
Ce  9.650754  3.843916  1.372921
Ce  9.650754  7.726816  1.372921
Ce  9.650754 11.609716  1.372921
Ce  3.826404  1.902466  4.118502
Ce  3.826404  5.785366  4.118502
Ce  3.826404  9.668266  4.118502
Ce  7.709304  1.902466  4.118502
Ce  7.709304  5.785366  4.118502
Ce  7.709304  9.668266  4.118502
Ce 11.592204  1.902466  4.118502
Ce 11.592204  5.785366  4.118502
Ce 11.592204  9.668266  4.118502
Ce  1.883953  3.873480  6.844185
Ce  1.899442  7.715574  6.907067
Ce  1.871450 11.611823  6.871624
Ce  5.750094  3.835212  6.866196
Ce  5.744665  7.742694  6.863903
Ce  5.753874 11.595849  6.900482
Ce  9.679615  3.880312  6.860290
Ce  9.675890  7.746043  6.900283
Ce  9.666423 11.596226  6.850424
Ce  3.619078  1.964110  9.543029
Ce  3.951482  5.626891  9.828584
Ce  3.809655  9.646612  9.610129
Ce  7.841781  1.862885  9.507195
Ce  7.623076  5.828064  9.496335
Ce  7.707649  9.666978  9.667893
Ce 11.499735  2.017264  9.698921
Ce  0.162350  5.709721  9.670380
Ce 11.600897  9.659793  9.607610
 O  1.884954  1.902466  0.000000
 O  1.884954  5.785366  0.000000
 O  1.884954  9.668266  0.000000
 O  5.767854  1.902466  0.000000
 O  5.767854  5.785366  0.000000
 O  5.767854  9.668266  0.000000
 O  9.650754  1.902466  0.000000
 O  9.650754  5.785366  0.000000
 O  9.650754  9.668266  0.000000
 O  3.826404  3.843916  2.745841
 O  1.884954  1.902466  2.745841
 O  3.826404  7.726816  2.745841
 O  1.884954  5.785366  2.745841
 O  3.826404 11.609716  2.745841
 O  1.884954  9.668266  2.745841
 O  7.709304  3.843916  2.745841
 O  5.767854  1.902466  2.745841
 O  7.709304  7.726816  2.745841
 O  5.767854  5.785366  2.745841
 O  7.709304 11.609716  2.745841
 O  5.767854  9.668266  2.745841
 O 11.592204  3.843916  2.745841
 O  9.650754  1.902466  2.745841
 O 11.592204  7.726816  2.745841
 O  9.650754  5.785366  2.745841
 O 11.592204 11.609716  2.745841
 O  9.650754  9.668266  2.745841
 O  1.881905  1.901485  5.437286
 O  1.889731  5.795862  5.442679
 O  1.890436  9.682735  5.421965
 O  5.777692  1.893342  5.539207
 O  5.761661  5.782026  5.444364
 O  5.760798  9.683593  5.430270
 O  9.651604  1.909218  5.443502
 O  9.654901  5.799831  5.509209
 O  9.649944  9.662321  5.423577
 O  3.846950  3.840153  5.478914
 O  3.826939  7.733755  5.557589
 O  3.830184 11.628315  5.569472
 O  7.710654  3.849678  5.537788
 O  7.707050  7.725264  5.561518
 O  7.707759 11.611169  5.561416
 O 11.581035  3.859022  5.471086
 O 11.596945  7.726679  5.559824
 O 11.585259 11.606886  5.559477
 O  1.850075  1.921765  8.123192
 O  1.929061  5.781984  8.134469
 O  1.883756  9.689912  8.060971
 O  5.802022  1.857380  8.410671
 O  5.856065  5.762499  8.095867
 O  5.756509  9.689410  8.068034
 O  9.607175  1.926422  8.102511
 O  9.583830  5.826157  8.325162
 O  9.664707  9.689412  8.058155
 O  3.849872  3.791166  8.197936
 O  3.873307  7.756058  8.462664
 O  3.788784 11.593180  8.428816
 O  7.726194  3.821934  8.421529
 O  7.673817  7.798161  8.411601
 O  7.743423 11.578845  8.427536
 O 11.567911  3.833753  8.202603
 O 11.610505  7.786728  8.399259
 O 11.562678 11.625373  8.489112
 O  1.764054  1.630986 10.849901
 O  2.000160  5.701833 11.086072
 O  1.876806  9.535269 10.666861
 O  3.931003  3.498517 11.012924
 O  6.164599  5.927549 10.851171
 O  5.788535  9.890200 10.689869
 O  9.434678  1.607945 10.746228
 O 11.515610  3.778584 11.016562
 O  9.618794  9.354223 10.674518
Pd  1.888515  3.673813 11.180505