109
E: -853.96524978 | E_rel_metal 0.0006013299999949595: | E_rel_global -0.11557039000001623: 
Ce  1.884954  3.843916  1.372921
Ce  1.884954  7.726816  1.372921
Ce  1.884954 11.609716  1.372921
Ce  5.767854  3.843916  1.372921
Ce  5.767854  7.726816  1.372921
Ce  5.767854 11.609716  1.372921
Ce  9.650754  3.843916  1.372921
Ce  9.650754  7.726816  1.372921
Ce  9.650754 11.609716  1.372921
Ce  3.826404  1.902466  4.118502
Ce  3.826404  5.785366  4.118502
Ce  3.826404  9.668266  4.118502
Ce  7.709304  1.902466  4.118502
Ce  7.709304  5.785366  4.118502
Ce  7.709304  9.668266  4.118502
Ce 11.592204  1.902466  4.118502
Ce 11.592204  5.785366  4.118502
Ce 11.592204  9.668266  4.118502
Ce  1.891095  3.831546  6.905718
Ce  1.886051  7.728987  6.870409
Ce  1.891679 11.625014  6.892422
Ce  5.769540  3.828421  6.876975
Ce  5.771081  7.739578  6.857130
Ce  5.769533 11.619556  6.881087
Ce  9.650907  3.843218  6.862517
Ce  9.648671  7.741526  6.863561
Ce  9.649594 11.604451  6.870903
Ce  3.927885  1.886375  9.731775
Ce  3.884080  5.798447  9.605371
Ce  3.824352  9.674751  9.635800
Ce  7.758596  1.908988  9.672566
Ce  7.705098  5.785532  9.631898
Ce  7.703693  9.680484  9.652708
Ce 11.545625  1.894676  9.647029
Ce 11.524048  5.802269  9.619192
Ce 11.589050  9.677244  9.664468
 O  1.884954  1.902466  0.000000
 O  1.884954  5.785366  0.000000
 O  1.884954  9.668266  0.000000
 O  5.767854  1.902466  0.000000
 O  5.767854  5.785366  0.000000
 O  5.767854  9.668266  0.000000
 O  9.650754  1.902466  0.000000
 O  9.650754  5.785366  0.000000
 O  9.650754  9.668266  0.000000
 O  3.826404  3.843916  2.745841
 O  1.884954  1.902466  2.745841
 O  3.826404  7.726816  2.745841
 O  1.884954  5.785366  2.745841
 O  3.826404 11.609716  2.745841
 O  1.884954  9.668266  2.745841
 O  7.709304  3.843916  2.745841
 O  5.767854  1.902466  2.745841
 O  7.709304  7.726816  2.745841
 O  5.767854  5.785366  2.745841
 O  7.709304 11.609716  2.745841
 O  5.767854  9.668266  2.745841
 O 11.592204  3.843916  2.745841
 O  9.650754  1.902466  2.745841
 O 11.592204  7.726816  2.745841
 O  9.650754  5.785366  2.745841
 O 11.592204 11.609716  2.745841
 O  9.650754  9.668266  2.745841
 O  1.883555  1.905738  5.439092
 O  1.886395  5.783036  5.447854
 O  1.890865  9.670624  5.420690
 O  5.772412  1.907653  5.414601
 O  5.765593  5.781882  5.416519
 O  5.762439  9.676052  5.413031
 O  9.653370  1.907283  5.426280
 O  9.649681  5.797792  5.419098
 O  9.649586  9.662256  5.414176
 O  3.822649  3.836743  5.582930
 O  3.825552  7.726578  5.570554
 O  3.825619 11.623391  5.577068
 O  7.716186  3.845714  5.568244
 O  7.705818  7.731406  5.574970
 O  7.715157 11.611162  5.569983
 O 11.589453  3.848804  5.573196
 O 11.596948  7.727273  5.577560
 O 11.588691 11.610782  5.574366
 O  1.846480  1.911024  8.124329
 O  1.884174  5.792477  8.137168
 O  1.878164  9.655858  8.059096
 O  5.805849  1.899690  8.069675
 O  5.784823  5.800208  8.063888
 O  5.786780  9.660835  8.054024
 O  9.660669  1.899677  8.070344
 O  9.654706  5.801661  8.067648
 O  9.650072  9.661888  8.057970
 O  3.858880  3.879134  8.474842
 O  3.838217  7.731486  8.468442
 O  3.833709 11.577859  8.460437
 O  7.726965  3.871482  8.477915
 O  7.712994  7.726644  8.503106
 O  7.727978 11.592605  8.484961
 O 11.565321  3.870978  8.481300
 O 11.582893  7.731350  8.495943
 O 11.587785 11.587962  8.485722
 O  1.707188  1.879742 10.965831
 O  1.894063  5.850123 10.861630
 O  1.883446  9.690319 10.692404
 O  6.026225  1.921551 10.796999
 O  5.757260  5.787303 10.696884
 O  5.751399  9.693987 10.691072
 O  9.716829  1.961038 10.743429
 O  9.653023  5.793092 10.710173
 O  9.646934  9.700930 10.703311
Ag  1.825077  3.872199 11.411277