109
E: -853.73793421 | E_rel_metal 0.8935347599999659: | E_rel_global 0.613425179999922: 
Ce  1.884954  3.843916  1.372921
Ce  1.884954  7.726816  1.372921
Ce  1.884954 11.609716  1.372921
Ce  5.767854  3.843916  1.372921
Ce  5.767854  7.726816  1.372921
Ce  5.767854 11.609716  1.372921
Ce  9.650754  3.843916  1.372921
Ce  9.650754  7.726816  1.372921
Ce  9.650754 11.609716  1.372921
Ce  3.826404  1.902466  4.118502
Ce  3.826404  5.785366  4.118502
Ce  3.826404  9.668266  4.118502
Ce  7.709304  1.902466  4.118502
Ce  7.709304  5.785366  4.118502
Ce  7.709304  9.668266  4.118502
Ce 11.592204  1.902466  4.118502
Ce 11.592204  5.785366  4.118502
Ce 11.592204  9.668266  4.118502
Ce  1.880029  3.856707  6.803798
Ce  1.915694  7.756586  6.906384
Ce  1.858737 11.589073  6.888232
Ce  5.758151  3.821013  6.864977
Ce  5.733758  7.766505  6.864069
Ce  5.756681 11.596138  6.921595
Ce  9.650866  3.857377  6.855135
Ce  9.661986  7.763594  6.889718
Ce  9.653495 11.606913  6.860699
Ce  3.655855  1.980997  9.476222
Ce  3.967419  5.710240  9.735619
Ce  3.798353  9.664748  9.709094
Ce  7.856522  1.853488  9.606143
Ce  7.602157  5.827788  9.481627
Ce  7.718956  9.688655  9.664550
Ce 11.464130  1.961544  9.664983
Ce  0.113479  5.719888  9.512291
Ce 11.548028  9.672348  9.678241
 O  1.884954  1.902466  0.000000
 O  1.884954  5.785366  0.000000
 O  1.884954  9.668266  0.000000
 O  5.767854  1.902466  0.000000
 O  5.767854  5.785366  0.000000
 O  5.767854  9.668266  0.000000
 O  9.650754  1.902466  0.000000
 O  9.650754  5.785366  0.000000
 O  9.650754  9.668266  0.000000
 O  3.826404  3.843916  2.745841
 O  1.884954  1.902466  2.745841
 O  3.826404  7.726816  2.745841
 O  1.884954  5.785366  2.745841
 O  3.826404 11.609716  2.745841
 O  1.884954  9.668266  2.745841
 O  7.709304  3.843916  2.745841
 O  5.767854  1.902466  2.745841
 O  7.709304  7.726816  2.745841
 O  5.767854  5.785366  2.745841
 O  7.709304 11.609716  2.745841
 O  5.767854  9.668266  2.745841
 O 11.592204  3.843916  2.745841
 O  9.650754  1.902466  2.745841
 O 11.592204  7.726816  2.745841
 O  9.650754  5.785366  2.745841
 O 11.592204 11.609716  2.745841
 O  9.650754  9.668266  2.745841
 O  1.870444  1.907590  5.447228
 O  1.888479  5.786788  5.455151
 O  1.890089  9.679262  5.420114
 O  5.784045  1.898987  5.530409
 O  5.759917  5.776866  5.443743
 O  5.755982  9.682792  5.425098
 O  9.646583  1.920587  5.445439
 O  9.647036  5.794887  5.528691
 O  9.650181  9.654759  5.430732
 O  3.838306  3.829589  5.480487
 O  3.820493  7.735650  5.539947
 O  3.822786 11.634222  5.574203
 O  7.709119  3.849625  5.533231
 O  7.710497  7.724786  5.552419
 O  7.709976 11.610195  5.543585
 O 11.576032  3.857838  5.475440
 O 11.592747  7.727225  5.569991
 O 11.581374 11.607541  5.547519
 O  1.851590  1.942575  8.151292
 O  1.864580  5.764249  8.163131
 O  1.839760  9.678353  8.052506
 O  5.688610  1.889895  8.380269
 O  5.836383  5.756833  8.095783
 O  5.771504  9.686340  8.061368
 O  9.645159  1.954389  8.104001
 O  9.663457  5.796709  8.404124
 O  9.673558  9.680759  8.059035
 O  3.811849  3.841886  8.208555
 O  3.847343  7.722854  8.394431
 O  3.750128 -0.012654  8.438327
 O  7.709806  3.848741  8.394515
 O  7.686105  7.756264  8.383226
 O  7.745834 11.608077  8.365660
 O 11.587040  3.866125  8.214751
 O 11.607177  7.709491  8.444361
 O 11.566232 -0.003872  8.446474
 O  1.795257  1.790445 10.932490
 O  1.869937  5.826389 11.006501
 O  1.650407  9.597194 10.761453
 O  3.853056  3.597921 11.046012
 O  6.104980  5.978020 10.817877
 O  5.981321 10.041093 10.746944
 O  9.755580  1.462707 10.764197
 O 11.479069  3.996763 10.980364
 O  9.602753  9.296121 10.710053
Au  1.841794  3.805935 11.200156