109
E: -858.65321749 | E_rel_metal 0.7478007500000103: | E_rel_global -0.6985981000000265: 
Ce  1.884954  3.843916  1.372921
Ce  1.884954  7.726816  1.372921
Ce  1.884954 11.609716  1.372921
Ce  5.767854  3.843916  1.372921
Ce  5.767854  7.726816  1.372921
Ce  5.767854 11.609716  1.372921
Ce  9.650754  3.843916  1.372921
Ce  9.650754  7.726816  1.372921
Ce  9.650754 11.609716  1.372921
Ce  3.826404  1.902466  4.118502
Ce  3.826404  5.785366  4.118502
Ce  3.826404  9.668266  4.118502
Ce  7.709304  1.902466  4.118502
Ce  7.709304  5.785366  4.118502
Ce  7.709304  9.668266  4.118502
Ce 11.592204  1.902466  4.118502
Ce 11.592204  5.785366  4.118502
Ce 11.592204  9.668266  4.118502
Ce  1.890770  3.838097  6.905912
Ce  1.882903  7.731558  6.881946
Ce  1.892976 11.624184  6.899937
Ce  5.772042  3.824175  6.848661
Ce  5.773380  7.767595  6.866555
Ce  5.771519 11.599565  6.891566
Ce  9.647448  3.846526  6.830448
Ce  9.642692  7.767367  6.872101
Ce  9.644570 11.581952  6.879987
Ce  4.035560  1.902103  9.720411
Ce  3.943259  5.785084  9.564088
Ce  3.783966  9.694192  9.660316
Ce  7.791475  1.902242  9.624577
Ce  7.698173  5.790486  9.587144
Ce  7.682422  9.684523  9.758255
Ce 11.527116  1.910799  9.585221
Ce 11.449583  5.793688  9.587309
Ce 11.581530  9.677129  9.698729
 O  1.884954  1.902466  0.000000
 O  1.884954  5.785366  0.000000
 O  1.884954  9.668266  0.000000
 O  5.767854  1.902466  0.000000
 O  5.767854  5.785366  0.000000
 O  5.767854  9.668266  0.000000
 O  9.650754  1.902466  0.000000
 O  9.650754  5.785366  0.000000
 O  9.650754  9.668266  0.000000
 O  3.826404  3.843916  2.745841
 O  1.884954  1.902466  2.745841
 O  3.826404  7.726816  2.745841
 O  1.884954  5.785366  2.745841
 O  3.826404 11.609716  2.745841
 O  1.884954  9.668266  2.745841
 O  7.709304  3.843916  2.745841
 O  5.767854  1.902466  2.745841
 O  7.709304  7.726816  2.745841
 O  5.767854  5.785366  2.745841
 O  7.709304 11.609716  2.745841
 O  5.767854  9.668266  2.745841
 O 11.592204  3.843916  2.745841
 O  9.650754  1.902466  2.745841
 O 11.592204  7.726816  2.745841
 O  9.650754  5.785366  2.745841
 O 11.592204 11.609716  2.745841
 O  9.650754  9.668266  2.745841
 O  1.885407  1.918645  5.462116
 O  1.886456  5.780375  5.466464
 O  1.888663  9.670132  5.423587
 O  5.768518  1.910097  5.418891
 O  5.765934  5.779290  5.416744
 O  5.764621  9.673996  5.412935
 O  9.652872  1.912652  5.426212
 O  9.648979  5.785789  5.418890
 O  9.648308  9.663053  5.411856
 O  3.821467  3.836022  5.574757
 O  3.822954  7.726913  5.571604
 O  3.823015 11.616768  5.557635
 O  7.711582  3.843772  5.554527
 O  7.707248  7.734205  5.571339
 O  7.711338 11.608069  5.558823
 O 11.594542  3.850672  5.565945
 O 11.595224  7.726840  5.574239
 O 11.592337 11.613992  5.566361
 O  1.809084  1.935090  8.179740
 O  1.878374  5.778982  8.191569
 O  1.877810  9.659095  8.056591
 O  5.828152  1.912846  8.082102
 O  5.779447  5.788850  8.066626
 O  5.749438  9.665438  8.054681
 O  9.674633  1.917708  8.073507
 O  9.642186  5.797054  8.068520
 O  9.681376  9.661084  8.052374
 O  3.874193  3.869162  8.444144
 O  3.829167  7.701445  8.468985
 O  3.819998 11.634037  8.434151
 O  7.736877  3.867889  8.450678
 O  7.704230  7.704291  8.479647
 O  7.742004 11.622529  8.451594
 O 11.541280  3.880790  8.448640
 O 11.584459  7.698436  8.487146
 O 11.582769 11.619467  8.470478
 O  1.821742  2.257626 11.034696
 O  1.872683  5.586234 10.957883
 O  1.854090  9.734150 10.745178
 O  6.090539  1.924411 10.800821
 O  5.753579  5.782803 10.694419
 O  5.513927  9.754893 10.783053
 O  9.791035  1.899237 10.733744
 O  9.634399  5.767156 10.705929
 O  9.827050  9.649575 10.794787
Co  1.841114  3.926975 11.458246