109
E: -856.31516286 | E_rel_metal 1.253333350000048: | E_rel_global 0.9103565299999445: 
Ce  1.884954  3.843916  1.372921
Ce  1.884954  7.726816  1.372921
Ce  1.884954 11.609716  1.372921
Ce  5.767854  3.843916  1.372921
Ce  5.767854  7.726816  1.372921
Ce  5.767854 11.609716  1.372921
Ce  9.650754  3.843916  1.372921
Ce  9.650754  7.726816  1.372921
Ce  9.650754 11.609716  1.372921
Ce  3.826404  1.902466  4.118502
Ce  3.826404  5.785366  4.118502
Ce  3.826404  9.668266  4.118502
Ce  7.709304  1.902466  4.118502
Ce  7.709304  5.785366  4.118502
Ce  7.709304  9.668266  4.118502
Ce 11.592204  1.902466  4.118502
Ce 11.592204  5.785366  4.118502
Ce 11.592204  9.668266  4.118502
Ce  1.859510  3.883958  6.874716
Ce  1.890378  7.698122  6.945776
Ce  1.871900 11.591328  6.869503
Ce  5.785538  3.813091  6.840467
Ce  5.759706  7.745798  6.859913
Ce  5.770129 11.608499  6.920331
Ce  9.653684  3.828616  6.850616
Ce  9.653529  7.751515  6.844483
Ce  9.656675 11.605847  6.872934
Ce  3.706224  1.996370  9.476793
Ce  4.066039  5.654389  9.609775
Ce  3.824457  9.673186  9.661031
Ce  7.932000  1.914179  9.665481
Ce  7.729284  5.811804  9.559374
Ce  7.703993  9.696757  9.640428
Ce 11.564569  1.940009  9.749841
Ce 11.414365  5.739760  9.618117
Ce 11.581170  9.685049  9.632344
 O  1.884954  1.902466  0.000000
 O  1.884954  5.785366  0.000000
 O  1.884954  9.668266  0.000000
 O  5.767854  1.902466  0.000000
 O  5.767854  5.785366  0.000000
 O  5.767854  9.668266  0.000000
 O  9.650754  1.902466  0.000000
 O  9.650754  5.785366  0.000000
 O  9.650754  9.668266  0.000000
 O  3.826404  3.843916  2.745841
 O  1.884954  1.902466  2.745841
 O  3.826404  7.726816  2.745841
 O  1.884954  5.785366  2.745841
 O  3.826404 11.609716  2.745841
 O  1.884954  9.668266  2.745841
 O  7.709304  3.843916  2.745841
 O  5.767854  1.902466  2.745841
 O  7.709304  7.726816  2.745841
 O  5.767854  5.785366  2.745841
 O  7.709304 11.609716  2.745841
 O  5.767854  9.668266  2.745841
 O 11.592204  3.843916  2.745841
 O  9.650754  1.902466  2.745841
 O 11.592204  7.726816  2.745841
 O  9.650754  5.785366  2.745841
 O 11.592204 11.609716  2.745841
 O  9.650754  9.668266  2.745841
 O  1.866244  1.903701  5.446382
 O  1.885196  5.792764  5.501977
 O  1.891920  9.676610  5.429244
 O  5.784517  1.889891  5.503025
 O  5.763521  5.782573  5.433207
 O  5.759976  9.678516  5.433327
 O  9.653277  1.903822  5.424200
 O  9.648663  5.802794  5.412413
 O  9.647420  9.651662  5.409074
 O  3.825504  3.839663  5.484864
 O  3.821835  7.727151  5.592962
 O  3.829128 11.628432  5.582255
 O  7.707800  3.837597  5.522295
 O  7.690244  7.732403  5.562144
 O  7.706548 11.607483  5.564977
 O 11.590606  3.856653  5.517669
 O 11.610041  7.725178  5.588504
 O 11.587353 11.599892  5.556971
 O  1.940137  1.937705  8.114002
 O  1.896726  5.796822  8.296806
 O  1.901220  9.631233  8.073335
 O  5.692263  1.897146  8.306622
 O  5.783171  5.758942  8.078806
 O  5.737586  9.656253  8.076182
 O  9.645526  1.881962  8.075774
 O  9.621700  5.807071  8.048377
 O  9.674920  9.666780  8.048862
 O  3.851630  3.878585  8.188241
 O  3.866790  7.696575  8.550292
 O  3.784299 11.579813  8.467297
 O  7.713653  3.863140  8.384344
 O  7.696724  7.768969  8.437835
 O  7.707235 11.568634  8.431750
 O 11.530875  3.877068  8.336861
 O 11.573631  7.726566  8.505356
 O 11.630917 11.573536  8.449418
 O  2.080417  2.000507 10.989490
 O  0.856903  5.430541 11.573079
 O  1.882277  9.691147 10.702207
 O  3.980514  3.721532 10.935464
 O  5.880564  5.993039 10.707998
 O  5.764448  9.973940 10.692638
 O  9.689561  1.991268 10.897991
 O  9.537228  5.809579 10.696517
 O  9.622260  9.747221 10.678452
Pt  2.015744  4.013191 11.246770