109
E: -853.0434764 | E_rel_metal 0.9223747099999855: | E_rel_global 0.8062029899999743: 
Ce  1.884954  3.843916  1.372921
Ce  1.884954  7.726816  1.372921
Ce  1.884954 11.609716  1.372921
Ce  5.767854  3.843916  1.372921
Ce  5.767854  7.726816  1.372921
Ce  5.767854 11.609716  1.372921
Ce  9.650754  3.843916  1.372921
Ce  9.650754  7.726816  1.372921
Ce  9.650754 11.609716  1.372921
Ce  3.826404  1.902466  4.118502
Ce  3.826404  5.785366  4.118502
Ce  3.826404  9.668266  4.118502
Ce  7.709304  1.902466  4.118502
Ce  7.709304  5.785366  4.118502
Ce  7.709304  9.668266  4.118502
Ce 11.592204  1.902466  4.118502
Ce 11.592204  5.785366  4.118502
Ce 11.592204  9.668266  4.118502
Ce  1.886218  3.852906  6.779876
Ce  1.896572  7.756815  6.907720
Ce  1.861182 11.588364  6.900653
Ce  5.764506  3.797967  6.864225
Ce  5.745426  7.756104  6.846160
Ce  5.756742 11.607394  6.921673
Ce  9.659289  3.870770  6.859996
Ce  9.673726  7.775602  6.912745
Ce  9.666692 11.602643  6.873515
Ce  3.652285  1.993648  9.509637
Ce  3.942384  5.674387  9.671529
Ce  3.828253  9.675795  9.690714
Ce  7.898434  1.845260  9.617428
Ce  7.579045  5.839181  9.477741
Ce  7.674010  9.674546  9.670110
Ce 11.519483  1.994223  9.671746
Ce  0.152853  5.708142  9.521600
Ce 11.585003  9.706988  9.739022
 O  1.884954  1.902466  0.000000
 O  1.884954  5.785366  0.000000
 O  1.884954  9.668266  0.000000
 O  5.767854  1.902466  0.000000
 O  5.767854  5.785366  0.000000
 O  5.767854  9.668266  0.000000
 O  9.650754  1.902466  0.000000
 O  9.650754  5.785366  0.000000
 O  9.650754  9.668266  0.000000
 O  3.826404  3.843916  2.745841
 O  1.884954  1.902466  2.745841
 O  3.826404  7.726816  2.745841
 O  1.884954  5.785366  2.745841
 O  3.826404 11.609716  2.745841
 O  1.884954  9.668266  2.745841
 O  7.709304  3.843916  2.745841
 O  5.767854  1.902466  2.745841
 O  7.709304  7.726816  2.745841
 O  5.767854  5.785366  2.745841
 O  7.709304 11.609716  2.745841
 O  5.767854  9.668266  2.745841
 O 11.592204  3.843916  2.745841
 O  9.650754  1.902466  2.745841
 O 11.592204  7.726816  2.745841
 O  9.650754  5.785366  2.745841
 O 11.592204 11.609716  2.745841
 O  9.650754  9.668266  2.745841
 O  1.877860  1.903492  5.436596
 O  1.891874  5.793650  5.440604
 O  1.887231  9.678333  5.426883
 O  5.786479  1.893747  5.515899
 O  5.761505  5.782138  5.445584
 O  5.759335  9.676625  5.431663
 O  9.647478  1.920816  5.446209
 O  9.652375  5.804099  5.535082
 O  9.652567  9.653418  5.430003
 O  3.851328  3.828574  5.476662
 O  3.822151  7.737315  5.565179
 O  3.830207 11.625554  5.574275
 O  7.708899  3.852408  5.543817
 O  7.706207  7.725165  5.552599
 O  7.708719 11.609321  5.548916
 O 11.576567  3.861113  5.460183
 O 11.601521  7.732279  5.574315
 O 11.583769 11.607143  5.545266
 O  1.882353  1.963328  8.124574
 O  1.933376  5.759738  8.138901
 O  1.916365  9.653121  8.074671
 O  5.704903  1.895966  8.342007
 O  5.796434  5.741263  8.101006
 O  5.727237  9.666497  8.072555
 O  9.649169  1.981888  8.108959
 O  9.635856  5.813618  8.419187
 O  9.652429  9.685810  8.063931
 O  3.816599  3.864137  8.195235
 O  3.881473  7.671053  8.508861
 O  3.765764 11.625013  8.447906
 O  7.702124  3.869670  8.432389
 O  7.658054  7.742083  8.368820
 O  7.722354 11.604273  8.379162
 O 11.610344  3.893008  8.170181
 O 11.630020  7.703563  8.440968
 O 11.606881  0.013096  8.404018
 O  1.841974  1.743163 10.845919
 O  2.023490  5.955974 10.841829
 O  2.085124  9.686488 10.787588
 O  4.034687  3.702456 10.886873
 O  5.954168  6.057933 10.727834
 O  5.794475 10.040746 10.725359
 O  9.816874  1.340670 10.724716
 O 11.423440  4.042910 10.886589
 O  9.395442  9.242513 10.739446
Ag  1.905353  3.848247 11.408099