109
E: -857.21142865 | E_rel_metal 0.3570675600000186: | E_rel_global 0.014090739999915058: 
Ce  1.884954  3.843916  1.372921
Ce  1.884954  7.726816  1.372921
Ce  1.884954 11.609716  1.372921
Ce  5.767854  3.843916  1.372921
Ce  5.767854  7.726816  1.372921
Ce  5.767854 11.609716  1.372921
Ce  9.650754  3.843916  1.372921
Ce  9.650754  7.726816  1.372921
Ce  9.650754 11.609716  1.372921
Ce  3.826404  1.902466  4.118502
Ce  3.826404  5.785366  4.118502
Ce  3.826404  9.668266  4.118502
Ce  7.709304  1.902466  4.118502
Ce  7.709304  5.785366  4.118502
Ce  7.709304  9.668266  4.118502
Ce 11.592204  1.902466  4.118502
Ce 11.592204  5.785366  4.118502
Ce 11.592204  9.668266  4.118502
Ce  1.897155  3.828517  6.820861
Ce  1.903384  7.748875  6.892243
Ce  1.892348 11.600838  6.908378
Ce  5.751192  3.806258  6.859513
Ce  5.744923  7.754581  6.865104
Ce  5.735392 11.573375  6.920183
Ce  9.663322  3.872523  6.839613
Ce  9.666320  7.754767  6.903513
Ce  9.675037 11.590849  6.848344
Ce  3.638988  1.965980  9.617025
Ce  3.901244  5.665765  9.679227
Ce  3.810607  9.675229  9.708017
Ce  7.850057  1.846916  9.491776
Ce  7.565382  5.834996  9.502496
Ce  7.730348  9.693442  9.693436
Ce 11.501811  2.054585  9.679335
Ce  0.124240  5.726564  9.511760
Ce 11.576774  9.690870  9.666961
 O  1.884954  1.902466  0.000000
 O  1.884954  5.785366  0.000000
 O  1.884954  9.668266  0.000000
 O  5.767854  1.902466  0.000000
 O  5.767854  5.785366  0.000000
 O  5.767854  9.668266  0.000000
 O  9.650754  1.902466  0.000000
 O  9.650754  5.785366  0.000000
 O  9.650754  9.668266  0.000000
 O  3.826404  3.843916  2.745841
 O  1.884954  1.902466  2.745841
 O  3.826404  7.726816  2.745841
 O  1.884954  5.785366  2.745841
 O  3.826404 11.609716  2.745841
 O  1.884954  9.668266  2.745841
 O  7.709304  3.843916  2.745841
 O  5.767854  1.902466  2.745841
 O  7.709304  7.726816  2.745841
 O  5.767854  5.785366  2.745841
 O  7.709304 11.609716  2.745841
 O  5.767854  9.668266  2.745841
 O 11.592204  3.843916  2.745841
 O  9.650754  1.902466  2.745841
 O 11.592204  7.726816  2.745841
 O  9.650754  5.785366  2.745841
 O 11.592204 11.609716  2.745841
 O  9.650754  9.668266  2.745841
 O  1.887487  1.901314  5.443474
 O  1.891429  5.785119  5.442857
 O  1.890969  9.668276  5.420176
 O  5.776227  1.889205  5.535158
 O  5.767461  5.773478  5.446796
 O  5.761498  9.672437  5.434157
 O  9.652613  1.918188  5.441205
 O  9.650526  5.794011  5.525341
 O  9.652495  9.654173  5.429345
 O  3.849152  3.829995  5.479899
 O  3.829795  7.730900  5.559863
 O  3.832100 11.612514  5.530997
 O  7.712138  3.845845  5.540960
 O  7.712507  7.723376  5.565636
 O  7.715924 11.607805  5.545671
 O 11.578469  3.853926  5.467685
 O 11.589587  7.723037  5.567465
 O 11.589068 11.605193  5.559318
 O  1.810540  1.929066  8.147860
 O  1.900209  5.756837  8.129946
 O  1.842225  9.662079  8.059387
 O  5.851568  1.872631  8.389586
 O  5.820419  5.741767  8.102494
 O  5.784074  9.643961  8.070278
 O  9.616047  1.951945  8.092739
 O  9.624415  5.806912  8.398221
 O  9.683420  9.668436  8.059785
 O  3.856124  3.846995  8.198091
 O  3.839900  7.655851  8.476604
 O  3.799505 11.590726  8.333451
 O  7.719695  3.849955  8.444737
 O  7.685619  7.745366  8.422758
 O  7.785035 11.589999  8.380496
 O 11.569157  3.873956  8.172588
 O 11.616013  7.714766  8.426240
 O 11.541107  0.020370  8.508007
 O  1.644102  1.906515 10.991547
 O  1.947967  5.979686 10.884604
 O  1.677410  9.753220 10.761176
 O  3.844478  3.879246 11.037538
 O  5.954892  6.057461 10.741152
 O  5.986777 10.170968 10.726619
 O  9.471840  1.679931 10.734752
 O 11.421436  4.050192 10.932030
 O  9.615262  9.375878 10.729995
Pt  1.815371  3.939101 11.061453