109
E: -854.63036252 | E_rel_metal 0.0011064500000657063: | E_rel_global -0.2790031299999782: 
Ce  1.884954  3.843916  1.372921
Ce  1.884954  7.726816  1.372921
Ce  1.884954 11.609716  1.372921
Ce  5.767854  3.843916  1.372921
Ce  5.767854  7.726816  1.372921
Ce  5.767854 11.609716  1.372921
Ce  9.650754  3.843916  1.372921
Ce  9.650754  7.726816  1.372921
Ce  9.650754 11.609716  1.372921
Ce  3.826404  1.902466  4.118502
Ce  3.826404  5.785366  4.118502
Ce  3.826404  9.668266  4.118502
Ce  7.709304  1.902466  4.118502
Ce  7.709304  5.785366  4.118502
Ce  7.709304  9.668266  4.118502
Ce 11.592204  1.902466  4.118502
Ce 11.592204  5.785366  4.118502
Ce 11.592204  9.668266  4.118502
Ce  1.890221  3.830445  6.906905
Ce  1.886204  7.725682  6.878107
Ce  1.892025 11.624339  6.895813
Ce  5.767830  3.827967  6.870783
Ce  5.771130  7.742527  6.858007
Ce  5.770299 11.617763  6.880920
Ce  9.650888  3.844710  6.856593
Ce  9.649264  7.743571  6.863196
Ce  9.650694 11.602052  6.869782
Ce  3.953120  1.895321  9.731731
Ce  3.889410  5.783607  9.605643
Ce  3.822441  9.677179  9.643403
Ce  7.764691  1.910894  9.663693
Ce  7.697409  5.786818  9.621968
Ce  7.703591  9.682068  9.655943
Ce 11.537215  1.903052  9.634920
Ce 11.501015  5.789646  9.620462
Ce 11.587474  9.675900  9.668324
 O  1.884954  1.902466  0.000000
 O  1.884954  5.785366  0.000000
 O  1.884954  9.668266  0.000000
 O  5.767854  1.902466  0.000000
 O  5.767854  5.785366  0.000000
 O  5.767854  9.668266  0.000000
 O  9.650754  1.902466  0.000000
 O  9.650754  5.785366  0.000000
 O  9.650754  9.668266  0.000000
 O  3.826404  3.843916  2.745841
 O  1.884954  1.902466  2.745841
 O  3.826404  7.726816  2.745841
 O  1.884954  5.785366  2.745841
 O  3.826404 11.609716  2.745841
 O  1.884954  9.668266  2.745841
 O  7.709304  3.843916  2.745841
 O  5.767854  1.902466  2.745841
 O  7.709304  7.726816  2.745841
 O  5.767854  5.785366  2.745841
 O  7.709304 11.609716  2.745841
 O  5.767854  9.668266  2.745841
 O 11.592204  3.843916  2.745841
 O  9.650754  1.902466  2.745841
 O 11.592204  7.726816  2.745841
 O  9.650754  5.785366  2.745841
 O 11.592204 11.609716  2.745841
 O  9.650754  9.668266  2.745841
 O  1.880261  1.901989  5.445177
 O  1.887475  5.784489  5.455040
 O  1.891116  9.670634  5.421866
 O  5.774388  1.903385  5.415508
 O  5.760649  5.786690  5.417128
 O  5.762538  9.676300  5.413142
 O  9.654114  1.907483  5.424945
 O  9.650376  5.799305  5.418683
 O  9.649157  9.660798  5.413728
 O  3.821966  3.830278  5.570456
 O  3.824960  7.729295  5.574773
 O  3.825029 11.623979  5.579385
 O  7.713409  3.847538  5.561621
 O  7.705619  7.731823  5.574758
 O  7.716867 11.610547  5.568983
 O 11.590650  3.849679  5.565147
 O 11.600063  7.728850  5.582264
 O 11.588780 11.608553  5.575777
 O  1.837436  1.911463  8.134492
 O  1.883013  5.784742  8.153877
 O  1.880172  9.654472  8.061811
 O  5.813789  1.896409  8.071752
 O  5.788268  5.802368  8.061853
 O  5.786205  9.662050  8.054550
 O  9.657992  1.896752  8.069478
 O  9.645471  5.807277  8.068725
 O  9.660707  9.659152  8.057713
 O  3.876521  3.874055  8.438892
 O  3.838189  7.728062  8.490814
 O  3.836133 11.579218  8.467737
 O  7.727729  3.871058  8.464974
 O  7.712714  7.733884  8.500903
 O  7.735036 11.590884  8.483243
 O 11.539161  3.871490  8.441877
 O 11.588753  7.722543  8.507492
 O 11.585212 11.590497  8.490244
 O  1.720557  1.871090 11.008067
 O  1.888999  5.858789 10.913890
 O  1.875821  9.701450 10.696499
 O  6.039053  1.921865 10.796024
 O  5.754847  5.782672 10.694280
 O  5.751304  9.696134 10.691027
 O  9.725811  1.964806 10.738172
 O  9.635874  5.790743 10.707988
 O  9.645114  9.699091 10.704051
Au  1.823573  3.864019 11.197313