109
E: -856.83351276 | E_rel_metal 0.7925028199999815: | E_rel_global -0.2925533699999505: 
Ce  1.884954  3.843916  1.372921
Ce  1.884954  7.726816  1.372921
Ce  1.884954 11.609716  1.372921
Ce  5.767854  3.843916  1.372921
Ce  5.767854  7.726816  1.372921
Ce  5.767854 11.609716  1.372921
Ce  9.650754  3.843916  1.372921
Ce  9.650754  7.726816  1.372921
Ce  9.650754 11.609716  1.372921
Ce  3.826404  1.902466  4.118502
Ce  3.826404  5.785366  4.118502
Ce  3.826404  9.668266  4.118502
Ce  7.709304  1.902466  4.118502
Ce  7.709304  5.785366  4.118502
Ce  7.709304  9.668266  4.118502
Ce 11.592204  1.902466  4.118502
Ce 11.592204  5.785366  4.118502
Ce 11.592204  9.668266  4.118502
Ce  1.890792  3.844747  6.778744
Ce  1.902147  7.763714  6.911004
Ce  1.874103 11.572298  6.910909
Ce  5.765523  3.816269  6.843052
Ce  5.746415  7.761279  6.870800
Ce  5.747216 11.568338  6.925731
Ce  9.659884  3.874787  6.834898
Ce  9.672271  7.769151  6.921723
Ce  9.674727 11.575928  6.864537
Ce  3.621032  1.983083  9.522223
Ce  3.921767  5.647537  9.650791
Ce  3.815735  9.667330  9.792810
Ce  7.854154  1.858786  9.499123
Ce  7.578880  5.823614  9.498910
Ce  7.712931  9.669292  9.720716
Ce 11.511230  2.035101  9.634619
Ce  0.161244  5.700616  9.514560
Ce 11.607751  9.662037  9.787014
 O  1.884954  1.902466  0.000000
 O  1.884954  5.785366  0.000000
 O  1.884954  9.668266  0.000000
 O  5.767854  1.902466  0.000000
 O  5.767854  5.785366  0.000000
 O  5.767854  9.668266  0.000000
 O  9.650754  1.902466  0.000000
 O  9.650754  5.785366  0.000000
 O  9.650754  9.668266  0.000000
 O  3.826404  3.843916  2.745841
 O  1.884954  1.902466  2.745841
 O  3.826404  7.726816  2.745841
 O  1.884954  5.785366  2.745841
 O  3.826404 11.609716  2.745841
 O  1.884954  9.668266  2.745841
 O  7.709304  3.843916  2.745841
 O  5.767854  1.902466  2.745841
 O  7.709304  7.726816  2.745841
 O  5.767854  5.785366  2.745841
 O  7.709304 11.609716  2.745841
 O  5.767854  9.668266  2.745841
 O 11.592204  3.843916  2.745841
 O  9.650754  1.902466  2.745841
 O 11.592204  7.726816  2.745841
 O  9.650754  5.785366  2.745841
 O 11.592204 11.609716  2.745841
 O  9.650754  9.668266  2.745841
 O  1.885565  1.906820  5.437121
 O  1.888991  5.784678  5.442194
 O  1.888244  9.671597  5.420490
 O  5.774210  1.893518  5.549057
 O  5.767486  5.767873  5.446786
 O  5.758370  9.678491  5.426087
 O  9.650882  1.923977  5.443269
 O  9.648207  5.791639  5.529712
 O  9.655267  9.654959  5.422825
 O  3.844909  3.835409  5.472832
 O  3.825761  7.730839  5.565947
 O  3.827470 11.609252  5.559101
 O  7.708881  3.844092  5.531511
 O  7.710511  7.722876  5.559257
 O  7.710072 11.608749  5.551244
 O 11.581214  3.858191  5.464416
 O 11.593322  7.726477  5.568991
 O 11.589370 11.605438  5.557968
 O  1.852194  1.946409  8.133877
 O  1.935453  5.739040  8.133540
 O  1.892995  9.666745  8.061421
 O  5.796792  1.902646  8.452889
 O  5.810844  5.729234  8.100952
 O  5.785368  9.666069  8.053160
 O  9.618091  1.962597  8.095133
 O  9.634937  5.782876  8.428443
 O  9.636387  9.671639  8.047226
 O  3.853864  3.817500  8.185327
 O  3.884164  7.630659  8.508431
 O  3.785731  0.022358  8.412246
 O  7.714124  3.842072  8.412025
 O  7.656397  7.710522  8.401820
 O  7.766900 11.628113  8.393285
 O 11.581625  3.871232  8.168605
 O 11.642448  7.667122  8.409973
 O 11.557860  0.052113  8.485089
 O  1.762900  1.959258 10.863960
 O  2.002156  5.716366 10.861569
 O  1.901069  9.655231 10.861539
 O  3.749389  3.701668 10.910043
 O  5.953566  5.883982 10.751167
 O  5.973094 10.136397 10.773886
 O  9.496138  1.726932 10.733144
 O  0.015734  3.973168 10.898295
 O  9.439318  9.188699 10.780550
Ni  1.882519  3.838119 11.025096