109
E: -856.32517563 | E_rel_metal 1.243320580000045: | E_rel_global 0.9003437599999415: 
Ce  1.884954  3.843916  1.372921
Ce  1.884954  7.726816  1.372921
Ce  1.884954 11.609716  1.372921
Ce  5.767854  3.843916  1.372921
Ce  5.767854  7.726816  1.372921
Ce  5.767854 11.609716  1.372921
Ce  9.650754  3.843916  1.372921
Ce  9.650754  7.726816  1.372921
Ce  9.650754 11.609716  1.372921
Ce  3.826404  1.902466  4.118502
Ce  3.826404  5.785366  4.118502
Ce  3.826404  9.668266  4.118502
Ce  7.709304  1.902466  4.118502
Ce  7.709304  5.785366  4.118502
Ce  7.709304  9.668266  4.118502
Ce 11.592204  1.902466  4.118502
Ce 11.592204  5.785366  4.118502
Ce 11.592204  9.668266  4.118502
Ce  1.885785  3.887484  6.880066
Ce  1.877158  7.732830  6.954643
Ce  1.870707 11.597418  6.887608
Ce  5.768188  3.837264  6.875754
Ce  5.767092  7.760985  6.855611
Ce  5.755274 11.609768  6.902482
Ce  9.655380  3.860560  6.775865
Ce  9.662352  7.777753  6.878897
Ce  9.671999 11.576058  6.862322
Ce  3.609890  1.941078  9.610490
Ce  4.032245  5.746458  9.610575
Ce  3.841474  9.736300  9.663080
Ce  7.871798  1.895611  9.478176
Ce  7.748031  5.820741  9.569197
Ce  7.690760  9.725550  9.683732
Ce 11.503673  2.028351  9.648468
Ce 11.397763  5.710092  9.561602
Ce 11.572064  9.719229  9.746737
 O  1.884954  1.902466  0.000000
 O  1.884954  5.785366  0.000000
 O  1.884954  9.668266  0.000000
 O  5.767854  1.902466  0.000000
 O  5.767854  5.785366  0.000000
 O  5.767854  9.668266  0.000000
 O  9.650754  1.902466  0.000000
 O  9.650754  5.785366  0.000000
 O  9.650754  9.668266  0.000000
 O  3.826404  3.843916  2.745841
 O  1.884954  1.902466  2.745841
 O  3.826404  7.726816  2.745841
 O  1.884954  5.785366  2.745841
 O  3.826404 11.609716  2.745841
 O  1.884954  9.668266  2.745841
 O  7.709304  3.843916  2.745841
 O  5.767854  1.902466  2.745841
 O  7.709304  7.726816  2.745841
 O  5.767854  5.785366  2.745841
 O  7.709304 11.609716  2.745841
 O  5.767854  9.668266  2.745841
 O 11.592204  3.843916  2.745841
 O  9.650754  1.902466  2.745841
 O 11.592204  7.726816  2.745841
 O  9.650754  5.785366  2.745841
 O 11.592204 11.609716  2.745841
 O  9.650754  9.668266  2.745841
 O  1.883779  1.921041  5.464086
 O  1.888422  5.790725  5.506383
 O  1.884939  9.680174  5.430829
 O  5.772917  1.899793  5.542049
 O  5.768315  5.779191  5.424276
 O  5.760942  9.685643  5.429403
 O  9.658956  1.908907  5.422470
 O  9.648200  5.801510  5.412938
 O  9.652127  9.667033  5.411396
 O  3.837734  3.848411  5.521983
 O  3.821557  7.730556  5.577575
 O  3.828037 11.625423  5.541597
 O  7.697678  3.836763  5.522401
 O  7.705321  7.744020  5.562067
 O  7.708841 11.613019  5.548290
 O 11.601933  3.862575  5.487421
 O 11.602879  7.734521  5.587339
 O 11.590663 11.606224  5.556072
 O  1.830387  1.961044  8.177611
 O  1.888259  5.788562  8.294798
 O  1.891413  9.663561  8.072504
 O  5.841708  1.907404  8.404791
 O  5.808305  5.789063  8.051954
 O  5.757614  9.687198  8.065441
 O  9.624748  1.927478  8.074940
 O  9.633130  5.784784  8.052397
 O  9.651841  9.679396  8.052092
 O  3.883620  3.855523  8.320420
 O  3.876145  7.720009  8.522458
 O  3.788049 -0.006032  8.371744
 O  7.756301  3.853684  8.390288
 O  7.683160  7.757697  8.453054
 O  7.745378 11.620903  8.376329
 O 11.514785  3.862296  8.224834
 O 11.571874  7.703776  8.486924
 O 11.577856  0.037931  8.470486
 O  1.694442  2.045283 11.003773
 O 11.618998  3.906670 10.978793
 O  2.106069  9.839875 10.780173
 O  3.044869  5.509024 11.611200
 O  5.932396  5.594154 10.694561
 O  5.768089 10.130853 10.701638
 O  9.500624  1.844454 10.724273
 O  9.583072  6.047593 10.683821
 O  9.414389  9.851690 10.779575
Pt  1.910675  4.071420 11.263258