109
E: -854.96740848 | E_rel_metal 0.6675269099999923: | E_rel_global -0.10910909000006086: 
Ce  1.884954  3.843916  1.372921
Ce  1.884954  7.726816  1.372921
Ce  1.884954 11.609716  1.372921
Ce  5.767854  3.843916  1.372921
Ce  5.767854  7.726816  1.372921
Ce  5.767854 11.609716  1.372921
Ce  9.650754  3.843916  1.372921
Ce  9.650754  7.726816  1.372921
Ce  9.650754 11.609716  1.372921
Ce  3.826404  1.902466  4.118502
Ce  3.826404  5.785366  4.118502
Ce  3.826404  9.668266  4.118502
Ce  7.709304  1.902466  4.118502
Ce  7.709304  5.785366  4.118502
Ce  7.709304  9.668266  4.118502
Ce 11.592204  1.902466  4.118502
Ce 11.592204  5.785366  4.118502
Ce 11.592204  9.668266  4.118502
Ce  1.878646  3.864195  6.810937
Ce  1.893698  7.741211  6.913308
Ce  1.878271 11.594915  6.894669
Ce  5.765753  3.817143  6.838493
Ce  5.740402  7.763162  6.868298
Ce  5.751862 11.574287  6.915338
Ce  9.680390  3.884947  6.867151
Ce  9.678321  7.751338  6.904692
Ce  9.672178 11.601771  6.849786
Ce  3.670488  1.966501  9.511849
Ce  3.945400  5.635568  9.676331
Ce  3.799665  9.652721  9.731725
Ce  7.872703  1.857017  9.505998
Ce  7.587632  5.844532  9.486902
Ce  7.726478  9.681004  9.689531
Ce 11.551870  2.035272  9.695224
Ce  0.171131  5.728275  9.644793
Ce 11.560855  9.651783  9.637884
 O  1.884954  1.902466  0.000000
 O  1.884954  5.785366  0.000000
 O  1.884954  9.668266  0.000000
 O  5.767854  1.902466  0.000000
 O  5.767854  5.785366  0.000000
 O  5.767854  9.668266  0.000000
 O  9.650754  1.902466  0.000000
 O  9.650754  5.785366  0.000000
 O  9.650754  9.668266  0.000000
 O  3.826404  3.843916  2.745841
 O  1.884954  1.902466  2.745841
 O  3.826404  7.726816  2.745841
 O  1.884954  5.785366  2.745841
 O  3.826404 11.609716  2.745841
 O  1.884954  9.668266  2.745841
 O  7.709304  3.843916  2.745841
 O  5.767854  1.902466  2.745841
 O  7.709304  7.726816  2.745841
 O  5.767854  5.785366  2.745841
 O  7.709304 11.609716  2.745841
 O  5.767854  9.668266  2.745841
 O 11.592204  3.843916  2.745841
 O  9.650754  1.902466  2.745841
 O 11.592204  7.726816  2.745841
 O  9.650754  5.785366  2.745841
 O 11.592204 11.609716  2.745841
 O  9.650754  9.668266  2.745841
 O  1.883273  1.903041  5.439028
 O  1.887436  5.786553  5.446969
 O  1.889165  9.680603  5.424888
 O  5.778920  1.893004  5.536807
 O  5.764822  5.771343  5.446027
 O  5.759253  9.678451  5.431255
 O  9.652341  1.918367  5.442429
 O  9.653917  5.795367  5.522849
 O  9.652311  9.655946  5.428307
 O  3.846590  3.836553  5.474544
 O  3.823164  7.733233  5.564435
 O  3.832780 11.617777  5.558931
 O  7.714836  3.848509  5.546734
 O  7.702637  7.721659  5.553129
 O  7.709938 11.609642  5.550826
 O 11.579507  3.858808  5.471472
 O 11.599100  7.722686  5.546130
 O 11.587150 11.608662  5.558219
 O  1.867964  1.951330  8.130523
 O  1.963141  5.755627  8.149366
 O  1.881575  9.681654  8.067531
 O  5.814144  1.876032  8.409580
 O  5.826061  5.734845  8.094967
 O  5.770160  9.676780  8.066769
 O  9.614963  1.947087  8.098089
 O  9.581842  5.815851  8.375747
 O  9.655837  9.697879  8.062392
 O  3.858159  3.818961  8.184100
 O  3.886660  7.665861  8.498910
 O  3.791628 11.633202  8.405030
 O  7.717383  3.839550  8.448877
 O  7.666312  7.756826  8.395536
 O  7.764269 11.610076  8.397281
 O 11.576044  3.851009  8.205158
 O 11.604951  7.754283  8.346955
 O 11.565033  0.023879  8.490023
 O  1.877777  1.776570 10.836917
 O  2.177741  5.703556 10.941535
 O  1.632546  9.508264 10.760308
 O  3.964676  3.626456 10.894242
 O  5.969225  6.033766 10.736742
 O  5.990222 10.067367 10.755616
 O  9.494883  1.668626 10.743000
 O  0.067650  3.807276 10.985382
 O  9.606701  9.269859 10.710761
Cu  2.007155  3.747506 11.224414