109
E: -853.9189982 | E_rel_metal 0.04685290999998415: | E_rel_global -0.06931881000002704: 
Ce  1.884954  3.843916  1.372921
Ce  1.884954  7.726816  1.372921
Ce  1.884954 11.609716  1.372921
Ce  5.767854  3.843916  1.372921
Ce  5.767854  7.726816  1.372921
Ce  5.767854 11.609716  1.372921
Ce  9.650754  3.843916  1.372921
Ce  9.650754  7.726816  1.372921
Ce  9.650754 11.609716  1.372921
Ce  3.826404  1.902466  4.118502
Ce  3.826404  5.785366  4.118502
Ce  3.826404  9.668266  4.118502
Ce  7.709304  1.902466  4.118502
Ce  7.709304  5.785366  4.118502
Ce  7.709304  9.668266  4.118502
Ce 11.592204  1.902466  4.118502
Ce 11.592204  5.785366  4.118502
Ce 11.592204  9.668266  4.118502
Ce  1.884748  3.846601  6.893503
Ce  1.887421  7.729542  6.879775
Ce  1.883774 11.607475  6.879485
Ce  5.773780  3.827444  6.877280
Ce  5.768039  7.740468  6.858247
Ce  5.774308 11.618457  6.882986
Ce  9.647614  3.827731  6.876741
Ce  9.651488  7.740215  6.855400
Ce  9.644909 11.618899  6.884275
Ce  3.851470  1.887369  9.649973
Ce  3.896222  5.797769  9.621529
Ce  3.831741  9.675878  9.663559
Ce  7.705578  1.903709  9.752787
Ce  7.712945  5.785804  9.612949
Ce  7.709847  9.678072  9.636172
Ce 11.556027  1.888418  9.652511
Ce 11.532068  5.796741  9.620521
Ce 11.586238  9.675958  9.662260
 O  1.884954  1.902466  0.000000
 O  1.884954  5.785366  0.000000
 O  1.884954  9.668266  0.000000
 O  5.767854  1.902466  0.000000
 O  5.767854  5.785366  0.000000
 O  5.767854  9.668266  0.000000
 O  9.650754  1.902466  0.000000
 O  9.650754  5.785366  0.000000
 O  9.650754  9.668266  0.000000
 O  3.826404  3.843916  2.745841
 O  1.884954  1.902466  2.745841
 O  3.826404  7.726816  2.745841
 O  1.884954  5.785366  2.745841
 O  3.826404 11.609716  2.745841
 O  1.884954  9.668266  2.745841
 O  7.709304  3.843916  2.745841
 O  5.767854  1.902466  2.745841
 O  7.709304  7.726816  2.745841
 O  5.767854  5.785366  2.745841
 O  7.709304 11.609716  2.745841
 O  5.767854  9.668266  2.745841
 O 11.592204  3.843916  2.745841
 O  9.650754  1.902466  2.745841
 O 11.592204  7.726816  2.745841
 O  9.650754  5.785366  2.745841
 O 11.592204 11.609716  2.745841
 O  9.650754  9.668266  2.745841
 O  1.877094  1.906508  5.443018
 O  1.885940  5.782142  5.448683
 O  1.890809  9.675342  5.420264
 O  5.776864  1.906410  5.415473
 O  5.763186  5.783183  5.418926
 O  5.762409  9.675859  5.414419
 O  9.651686  1.905354  5.425969
 O  9.650160  5.801870  5.416356
 O  9.649215  9.660391  5.413673
 O  3.822263  3.836302  5.581186
 O  3.824242  7.728286  5.573713
 O  3.825414 11.624167  5.578797
 O  7.715902  3.845552  5.568438
 O  7.702821  7.730850  5.572110
 O  7.713806 11.610780  5.571581
 O 11.589129  3.848801  5.572828
 O 11.603449  7.729167  5.577164
 O 11.588320 11.609524  5.572713
 O  1.885593  1.907414  8.130692
 O  1.890930  5.796927  8.138759
 O  1.880837  9.651906  8.058240
 O  5.726115  1.900204  8.073005
 O  5.763922  5.798497  8.069635
 O  5.767952  9.660441  8.056876
 O  9.687658  1.902172  8.074930
 O  9.667491  5.797643  8.064403
 O  9.653187  9.661868  8.058036
 O  3.836684  3.874937  8.480119
 O  3.836886  7.732778  8.497977
 O  3.808843 11.579182  8.477081
 O  7.709318  3.876978  8.471174
 O  7.708968  7.726310  8.483035
 O  7.705697 11.587982  8.475408
 O 11.589525  3.872656  8.478739
 O 11.588046  7.729621  8.499142
 O 11.599166 11.581538  8.475744
 O  1.872349  1.871973 10.917446
 O  1.892648  5.841995 10.869819
 O  1.884919  9.686058 10.694992
 O  5.541978  1.901335 10.799083
 O  5.774279  5.773817 10.701384
 O  5.768559  9.680216 10.697162
 O  9.858898  1.916742 10.796928
 O  9.653807  5.775326 10.700508
 O  9.647584  9.692366 10.701508
Ag  1.885364  3.861277 11.418363