109
E: -858.8801397 | E_rel_metal 1.274589370000058: | E_rel_global 1.0994796899999528: 
Ce  1.884954  3.843916  1.372921
Ce  1.884954  7.726816  1.372921
Ce  1.884954 11.609716  1.372921
Ce  5.767854  3.843916  1.372921
Ce  5.767854  7.726816  1.372921
Ce  5.767854 11.609716  1.372921
Ce  9.650754  3.843916  1.372921
Ce  9.650754  7.726816  1.372921
Ce  9.650754 11.609716  1.372921
Ce  3.826404  1.902466  4.118502
Ce  3.826404  5.785366  4.118502
Ce  3.826404  9.668266  4.118502
Ce  7.709304  1.902466  4.118502
Ce  7.709304  5.785366  4.118502
Ce  7.709304  9.668266  4.118502
Ce 11.592204  1.902466  4.118502
Ce 11.592204  5.785366  4.118502
Ce 11.592204  9.668266  4.118502
Ce  1.886735  3.859654  6.911959
Ce  1.891746  7.723731  6.908930
Ce  1.879697 11.628541  6.898896
Ce  5.774710  3.886520  6.852607
Ce  5.768458  7.723431  6.892598
Ce  5.769325 11.595269  6.845717
Ce  9.638816  3.870466  6.838239
Ce  9.643505  7.740347  6.876078
Ce  9.648488 11.594015  6.855873
Ce  3.973451  1.953885  9.567507
Ce  4.018854  5.762731  9.754351
Ce  3.821946  9.663342  9.637347
Ce  7.700074  1.928019  9.577971
Ce  7.743035  5.794640  9.753819
Ce  7.697428  9.667575  9.640239
Ce 11.423322  1.946070  9.591490
Ce 11.513847  5.764917  9.582546
Ce 11.570995  9.673302  9.670321
 O  1.884954  1.902466  0.000000
 O  1.884954  5.785366  0.000000
 O  1.884954  9.668266  0.000000
 O  5.767854  1.902466  0.000000
 O  5.767854  5.785366  0.000000
 O  5.767854  9.668266  0.000000
 O  9.650754  1.902466  0.000000
 O  9.650754  5.785366  0.000000
 O  9.650754  9.668266  0.000000
 O  3.826404  3.843916  2.745841
 O  1.884954  1.902466  2.745841
 O  3.826404  7.726816  2.745841
 O  1.884954  5.785366  2.745841
 O  3.826404 11.609716  2.745841
 O  1.884954  9.668266  2.745841
 O  7.709304  3.843916  2.745841
 O  5.767854  1.902466  2.745841
 O  7.709304  7.726816  2.745841
 O  5.767854  5.785366  2.745841
 O  7.709304 11.609716  2.745841
 O  5.767854  9.668266  2.745841
 O 11.592204  3.843916  2.745841
 O  9.650754  1.902466  2.745841
 O 11.592204  7.726816  2.745841
 O  9.650754  5.785366  2.745841
 O 11.592204 11.609716  2.745841
 O  9.650754  9.668266  2.745841
 O  1.865377  1.902577  5.490412
 O  1.894154  5.786482  5.480009
 O  1.889312  9.684153  5.428067
 O  5.773200  1.901132  5.417381
 O  5.758933  5.786148  5.414139
 O  5.762578  9.688697  5.415718
 O  9.652752  1.906409  5.428280
 O  9.644953  5.801167  5.411142
 O  9.648323  9.667531  5.413871
 O  3.815138  3.839403  5.540027
 O  3.822223  7.731472  5.573534
 O  3.818679 11.629953  5.586671
 O  7.710163  3.852936  5.535314
 O  7.698405  7.733673  5.564734
 O  7.715303 11.610125  5.567717
 O 11.595665  3.855324  5.541563
 O 11.604333  7.730250  5.576734
 O 11.589501 11.609830  5.585497
 O  1.870905  1.926534  8.246915
 O  1.790573  5.768730  8.198275
 O  1.874826  9.705960  8.069566
 O  5.784750  1.893689  8.072047
 O  5.790569  5.800848  8.060821
 O  5.757263  9.691739  8.060114
 O  9.632221  1.888945  8.080173
 O  9.724202  5.802082  8.045939
 O  9.671232  9.696906  8.061124
 O  3.883562  3.816003  8.368111
 O  3.808563  7.759784  8.469844
 O  3.827363 11.643142  8.501118
 O  7.729589  3.810625  8.412275
 O  7.732563  7.789813  8.451486
 O  7.711318 11.615117  8.482052
 O 11.515856  3.801622  8.374400
 O 11.592210  7.772540  8.489438
 O 11.574463 11.640091  8.520725
 O  1.876677  1.955880 11.073172
 O  1.836442  5.528163 11.189317
 O  1.867158  9.618330 10.707608
 O  5.772877  1.941150 10.695938
 O  5.843726  5.755527 10.885195
 O  5.743784  9.654153 10.687297
 O  9.619754  1.963393 10.712507
 O  9.917441  5.796375 10.797680
 O  9.630631  9.684409 10.709698
Ir  1.845184  3.737911 11.414814