109
E: -856.35568992 | E_rel_metal 1.2128062900000032: | E_rel_global 0.8698294699998996: 
Ce  1.884954  3.843916  1.372921
Ce  1.884954  7.726816  1.372921
Ce  1.884954 11.609716  1.372921
Ce  5.767854  3.843916  1.372921
Ce  5.767854  7.726816  1.372921
Ce  5.767854 11.609716  1.372921
Ce  9.650754  3.843916  1.372921
Ce  9.650754  7.726816  1.372921
Ce  9.650754 11.609716  1.372921
Ce  3.826404  1.902466  4.118502
Ce  3.826404  5.785366  4.118502
Ce  3.826404  9.668266  4.118502
Ce  7.709304  1.902466  4.118502
Ce  7.709304  5.785366  4.118502
Ce  7.709304  9.668266  4.118502
Ce 11.592204  1.902466  4.118502
Ce 11.592204  5.785366  4.118502
Ce 11.592204  9.668266  4.118502
Ce  1.862238  3.891828  6.880452
Ce  1.894282  7.712318  6.945278
Ce  1.875090 11.599500  6.866992
Ce  5.773175  3.832347  6.830961
Ce  5.765838  7.761596  6.878902
Ce  5.767489 11.581039  6.920402
Ce  9.662132  3.855376  6.822278
Ce  9.647824  7.769055  6.862313
Ce  9.664419 11.570478  6.865492
Ce  3.672777  1.998473  9.513503
Ce  4.047832  5.670488  9.601892
Ce  3.831272  9.707692  9.680723
Ce  7.884621  1.913842  9.497256
Ce  7.715175  5.848207  9.560994
Ce  7.735383  9.705626  9.766028
Ce 11.536730  1.948328  9.701154
Ce 11.400618  5.775887  9.612111
Ce 11.628962  9.708608  9.659395
 O  1.884954  1.902466  0.000000
 O  1.884954  5.785366  0.000000
 O  1.884954  9.668266  0.000000
 O  5.767854  1.902466  0.000000
 O  5.767854  5.785366  0.000000
 O  5.767854  9.668266  0.000000
 O  9.650754  1.902466  0.000000
 O  9.650754  5.785366  0.000000
 O  9.650754  9.668266  0.000000
 O  3.826404  3.843916  2.745841
 O  1.884954  1.902466  2.745841
 O  3.826404  7.726816  2.745841
 O  1.884954  5.785366  2.745841
 O  3.826404 11.609716  2.745841
 O  1.884954  9.668266  2.745841
 O  7.709304  3.843916  2.745841
 O  5.767854  1.902466  2.745841
 O  7.709304  7.726816  2.745841
 O  5.767854  5.785366  2.745841
 O  7.709304 11.609716  2.745841
 O  5.767854  9.668266  2.745841
 O 11.592204  3.843916  2.745841
 O  9.650754  1.902466  2.745841
 O 11.592204  7.726816  2.745841
 O  9.650754  5.785366  2.745841
 O 11.592204 11.609716  2.745841
 O  9.650754  9.668266  2.745841
 O  1.875152  1.911071  5.455818
 O  1.886940  5.792888  5.504144
 O  1.890209  9.676252  5.430022
 O  5.774541  1.893998  5.545709
 O  5.767172  5.771528  5.445147
 O  5.765298  9.680424  5.435785
 O  9.656474  1.910884  5.427428
 O  9.650471  5.785737  5.410572
 O  9.648941  9.663515  5.410216
 O  3.824603  3.845220  5.488171
 O  3.827204  7.727372  5.580029
 O  3.835927 11.618065  5.552351
 O  7.704500  3.836160  5.522804
 O  7.698166  7.731869  5.549765
 O  7.706796 11.608143  5.551351
 O 11.598200  3.860422  5.521293
 O 11.606448  7.726455  5.583684
 O 11.590599 11.602738  5.540803
 O  1.892784  1.963252  8.149439
 O  1.896709  5.786958  8.299961
 O  1.911433  9.648396  8.067087
 O  5.775558  1.926069  8.436795
 O  5.786572  5.735761  8.087959
 O  5.713379  9.677689  8.066690
 O  9.619940  1.892178  8.083194
 O  9.617068  5.804327  8.048745
 O  9.686119  9.662510  8.051958
 O  3.853512  3.852596  8.199216
 O  3.880038  7.681355  8.529089
 O  3.773624  0.000566  8.414868
 O  7.735443  3.852724  8.387525
 O  7.682248  7.751554  8.408201
 O  7.728712 11.621528  8.392589
 O 11.504335  3.880424  8.348270
 O 11.586877  7.719711  8.489571
 O 11.630850 11.622865  8.409244
 O  1.993998  2.005943 10.987041
 O  0.819251  5.463586 11.583618
 O  1.922936  9.686695 10.738263
 O  3.908437  3.730631 10.955994
 O  5.853182  6.041084 10.705287
 O  5.597587 10.137038 10.736177
 O  9.425611  2.073700 10.796399
 O  9.519736  5.951153 10.696045
 O  9.867135  9.940292 10.747728
Pt  1.948232  4.026379 11.251409