109
E: -856.1058311 | E_rel_metal 1.462665109999989: | E_rel_global 1.1196882899998855: 
Ce  1.884954  3.843916  1.372921
Ce  1.884954  7.726816  1.372921
Ce  1.884954 11.609716  1.372921
Ce  5.767854  3.843916  1.372921
Ce  5.767854  7.726816  1.372921
Ce  5.767854 11.609716  1.372921
Ce  9.650754  3.843916  1.372921
Ce  9.650754  7.726816  1.372921
Ce  9.650754 11.609716  1.372921
Ce  3.826404  1.902466  4.118502
Ce  3.826404  5.785366  4.118502
Ce  3.826404  9.668266  4.118502
Ce  7.709304  1.902466  4.118502
Ce  7.709304  5.785366  4.118502
Ce  7.709304  9.668266  4.118502
Ce 11.592204  1.902466  4.118502
Ce 11.592204  5.785366  4.118502
Ce 11.592204  9.668266  4.118502
Ce  1.870132  3.887302  6.857698
Ce  1.891427  7.713754  6.968726
Ce  1.880007 11.592412  6.887069
Ce  5.779525  3.823052  6.835808
Ce  5.755218  7.753055  6.879376
Ce  5.756852 11.572697  6.915813
Ce  9.653537  3.855531  6.800874
Ce  9.660252  7.752801  6.869693
Ce  9.672275 11.580603  6.857401
Ce  3.680594  1.994978  9.505349
Ce  4.060011  5.639244  9.597364
Ce  3.834001  9.671241  9.730950
Ce  7.891509  1.876800  9.500431
Ce  7.716021  5.862728  9.600888
Ce  7.744993  9.711375  9.704627
Ce 11.535266  2.026836  9.678839
Ce 11.383900  5.679101  9.600879
Ce 11.574744  9.671397  9.681285
 O  1.884954  1.902466  0.000000
 O  1.884954  5.785366  0.000000
 O  1.884954  9.668266  0.000000
 O  5.767854  1.902466  0.000000
 O  5.767854  5.785366  0.000000
 O  5.767854  9.668266  0.000000
 O  9.650754  1.902466  0.000000
 O  9.650754  5.785366  0.000000
 O  9.650754  9.668266  0.000000
 O  3.826404  3.843916  2.745841
 O  1.884954  1.902466  2.745841
 O  3.826404  7.726816  2.745841
 O  1.884954  5.785366  2.745841
 O  3.826404 11.609716  2.745841
 O  1.884954  9.668266  2.745841
 O  7.709304  3.843916  2.745841
 O  5.767854  1.902466  2.745841
 O  7.709304  7.726816  2.745841
 O  5.767854  5.785366  2.745841
 O  7.709304 11.609716  2.745841
 O  5.767854  9.668266  2.745841
 O 11.592204  3.843916  2.745841
 O  9.650754  1.902466  2.745841
 O 11.592204  7.726816  2.745841
 O  9.650754  5.785366  2.745841
 O 11.592204 11.609716  2.745841
 O  9.650754  9.668266  2.745841
 O  1.877947  1.911282  5.452035
 O  1.888460  5.790491  5.506443
 O  1.889317  9.678926  5.425690
 O  5.776626  1.888790  5.541245
 O  5.769922  5.771349  5.446258
 O  5.761720  9.678582  5.434369
 O  9.651455  1.905577  5.428779
 O  9.646941  5.793731  5.420395
 O  9.651249  9.663048  5.413788
 O  3.839148  3.842534  5.477690
 O  3.824541  7.728241  5.575420
 O  3.832951 11.617474  5.559133
 O  7.702843  3.833293  5.526351
 O  7.701355  7.729678  5.555353
 O  7.710269 11.607738  5.554793
 O 11.589029  3.858578  5.488071
 O 11.605012  7.724753  5.585022
 O 11.589784 11.605274  5.562146
 O  1.869584  1.968554  8.132178
 O  1.879216  5.763809  8.312414
 O  1.859000  9.667609  8.062426
 O  5.809454  1.890506  8.421618
 O  5.805949  5.719356  8.093121
 O  5.766092  9.671802  8.067798
 O  9.627829  1.919602  8.085780
 O  9.620076  5.767446  8.069531
 O  9.685521  9.673514  8.052794
 O  3.869215  3.828603  8.168002
 O  3.874629  7.658958  8.480259
 O  3.786215  0.004637  8.410908
 O  7.740095  3.837269  8.456691
 O  7.700486  7.759272  8.428552
 O  7.765722 11.612650  8.383956
 O 11.508873  3.841166  8.237285
 O 11.554904  7.689292  8.480044
 O 11.588768  0.028633  8.507023
 O  1.856509  1.708318 10.837153
 O  0.012382  3.947064 11.021101
 O  1.691582  9.465011 10.767805
 O  4.030552  3.722652 10.916703
 O  5.856464  6.156276 10.698661
 O  5.993439 10.167770 10.734375
 O  9.534416  1.790831 10.734209
 O  9.533517  6.040452 10.702451
 O  9.636982  9.751285 10.740413
Pt  1.995214  3.828809 11.086268