109
E: -853.47445668 | E_rel_metal 0.4913944300000139: | E_rel_global 0.37522271000000273: 
Ce  1.884954  3.843916  1.372921
Ce  1.884954  7.726816  1.372921
Ce  1.884954 11.609716  1.372921
Ce  5.767854  3.843916  1.372921
Ce  5.767854  7.726816  1.372921
Ce  5.767854 11.609716  1.372921
Ce  9.650754  3.843916  1.372921
Ce  9.650754  7.726816  1.372921
Ce  9.650754 11.609716  1.372921
Ce  3.826404  1.902466  4.118502
Ce  3.826404  5.785366  4.118502
Ce  3.826404  9.668266  4.118502
Ce  7.709304  1.902466  4.118502
Ce  7.709304  5.785366  4.118502
Ce  7.709304  9.668266  4.118502
Ce 11.592204  1.902466  4.118502
Ce 11.592204  5.785366  4.118502
Ce 11.592204  9.668266  4.118502
Ce  1.876305  3.897054  6.855827
Ce  1.885310  7.731381  6.981043
Ce  1.868946 11.602429  6.889988
Ce  5.774051  3.813693  6.852998
Ce  5.760967  7.750123  6.855588
Ce  5.752624 11.596936  6.917810
Ce  9.656718  3.852510  6.791116
Ce  9.667101  7.774366  6.866837
Ce  9.678825 11.575481  6.868965
Ce  3.633545  1.984038  9.558047
Ce  4.099028  5.657548  9.595515
Ce  3.843983  9.663537  9.677632
Ce  7.915137  1.885953  9.502764
Ce  7.734370  5.878651  9.583536
Ce  7.686498  9.700615  9.695305
Ce 11.584894  2.024610  9.679832
Ce 11.370587  5.694323  9.566613
Ce 11.591768  9.696595  9.730335
 O  1.884954  1.902466  0.000000
 O  1.884954  5.785366  0.000000
 O  1.884954  9.668266  0.000000
 O  5.767854  1.902466  0.000000
 O  5.767854  5.785366  0.000000
 O  5.767854  9.668266  0.000000
 O  9.650754  1.902466  0.000000
 O  9.650754  5.785366  0.000000
 O  9.650754  9.668266  0.000000
 O  3.826404  3.843916  2.745841
 O  1.884954  1.902466  2.745841
 O  3.826404  7.726816  2.745841
 O  1.884954  5.785366  2.745841
 O  3.826404 11.609716  2.745841
 O  1.884954  9.668266  2.745841
 O  7.709304  3.843916  2.745841
 O  5.767854  1.902466  2.745841
 O  7.709304  7.726816  2.745841
 O  5.767854  5.785366  2.745841
 O  7.709304 11.609716  2.745841
 O  5.767854  9.668266  2.745841
 O 11.592204  3.843916  2.745841
 O  9.650754  1.902466  2.745841
 O 11.592204  7.726816  2.745841
 O  9.650754  5.785366  2.745841
 O 11.592204 11.609716  2.745841
 O  9.650754  9.668266  2.745841
 O  1.876888  1.918137  5.454905
 O  1.890272  5.801730  5.546660
 O  1.890779  9.674086  5.442723
 O  5.773917  1.892909  5.546296
 O  5.767137  5.771770  5.446050
 O  5.761844  9.681672  5.434805
 O  9.656551  1.906614  5.426291
 O  9.648678  5.800875  5.413699
 O  9.651379  9.664306  5.410488
 O  3.839231  3.846812  5.480980
 O  3.822397  7.726925  5.571732
 O  3.828533 11.626336  5.558526
 O  7.700696  3.833285  5.527136
 O  7.698653  7.733000  5.548871
 O  7.705299 11.612865  5.558035
 O 11.593858  3.865585  5.472819
 O 11.610166  7.731856  5.568883
 O 11.593138 11.602213  5.550567
 O  1.873517  2.019383  8.133618
 O  1.897516  5.755422  8.443929
 O  1.904415  9.678669  8.084818
 O  5.797405  1.903123  8.440198
 O  5.819426  5.721541  8.091542
 O  5.740334  9.674697  8.072144
 O  9.623707  1.919750  8.081894
 O  9.613539  5.775570  8.058993
 O  9.666697  9.678735  8.051429
 O  3.858018  3.842919  8.184872
 O  3.893894  7.672954  8.455854
 O  3.787529  0.005895  8.411784
 O  7.750346  3.842120  8.454511
 O  7.687302  7.763797  8.397160
 O  7.733579 11.617992  8.396627
 O 11.513924  3.850356  8.205211
 O 11.575581  7.694035  8.436267
 O 11.597415  0.047204  8.439692
 O  1.847374  1.432604 10.700169
 O  0.044615  3.995367 10.915299
 O  2.122736  9.326791 10.767916
 O  4.045088  3.771120 10.886908
 O  5.877545  6.188486 10.691810
 O  5.770357 10.059648 10.715921
 O  9.569916  1.794185 10.730285
 O  9.537510  6.135730 10.685961
 O  9.427642  9.809335 10.765459
Ag  2.031377  3.887615 11.483461