109
E: -857.8907269 | E_rel_metal 0.6628061000000116: | E_rel_global 0.5087824899999305: 
Ce  1.884954  3.843916  1.372921
Ce  1.884954  7.726816  1.372921
Ce  1.884954 11.609716  1.372921
Ce  5.767854  3.843916  1.372921
Ce  5.767854  7.726816  1.372921
Ce  5.767854 11.609716  1.372921
Ce  9.650754  3.843916  1.372921
Ce  9.650754  7.726816  1.372921
Ce  9.650754 11.609716  1.372921
Ce  3.826404  1.902466  4.118502
Ce  3.826404  5.785366  4.118502
Ce  3.826404  9.668266  4.118502
Ce  7.709304  1.902466  4.118502
Ce  7.709304  5.785366  4.118502
Ce  7.709304  9.668266  4.118502
Ce 11.592204  1.902466  4.118502
Ce 11.592204  5.785366  4.118502
Ce 11.592204  9.668266  4.118502
Ce  1.885265  3.849624  6.912402
Ce  1.878264  7.718637  6.901607
Ce  1.894984 11.630062  6.900822
Ce  5.772824  3.826227  6.843716
Ce  5.769687  7.754015  6.856727
Ce  5.770918 11.612556  6.879222
Ce  9.646089  3.869105  6.846095
Ce  9.651585  7.733215  6.877307
Ce  9.650595 11.591403  6.857497
Ce  4.066979  1.933562  9.719020
Ce  3.907117  5.753660  9.553466
Ce  3.836543  9.684155  9.640459
Ce  7.805980  1.919710  9.630155
Ce  7.627831  5.780282  9.625947
Ce  7.717544  9.673552  9.659559
Ce 11.523210  1.947982  9.556124
Ce 11.370526  5.767438  9.714011
Ce 11.594471  9.665959  9.638660
 O  1.884954  1.902466  0.000000
 O  1.884954  5.785366  0.000000
 O  1.884954  9.668266  0.000000
 O  5.767854  1.902466  0.000000
 O  5.767854  5.785366  0.000000
 O  5.767854  9.668266  0.000000
 O  9.650754  1.902466  0.000000
 O  9.650754  5.785366  0.000000
 O  9.650754  9.668266  0.000000
 O  3.826404  3.843916  2.745841
 O  1.884954  1.902466  2.745841
 O  3.826404  7.726816  2.745841
 O  1.884954  5.785366  2.745841
 O  3.826404 11.609716  2.745841
 O  1.884954  9.668266  2.745841
 O  7.709304  3.843916  2.745841
 O  5.767854  1.902466  2.745841
 O  7.709304  7.726816  2.745841
 O  5.767854  5.785366  2.745841
 O  7.709304 11.609716  2.745841
 O  5.767854  9.668266  2.745841
 O 11.592204  3.843916  2.745841
 O  9.650754  1.902466  2.745841
 O 11.592204  7.726816  2.745841
 O  9.650754  5.785366  2.745841
 O 11.592204 11.609716  2.745841
 O  9.650754  9.668266  2.745841
 O  1.882764  1.900505  5.468561
 O  1.878900  5.787297  5.477180
 O  1.889650  9.677757  5.429361
 O  5.768171  1.902590  5.420011
 O  5.764247  5.786620  5.417912
 O  5.762542  9.677035  5.414919
 O  9.651795  1.906445  5.427959
 O  9.651153  5.797849  5.419904
 O  9.649930  9.662915  5.413873
 O  3.816658  3.840449  5.540600
 O  3.822058  7.729039  5.574613
 O  3.825414 11.624203  5.584118
 O  7.710295  3.848041  5.536521
 O  7.703580  7.733862  5.572166
 O  7.713556 11.609640  5.568511
 O 11.595407  3.852167  5.541353
 O 11.600878  7.727344  5.578121
 O 11.589337 11.611702  5.575550
 O  1.811872  1.930874  8.194815
 O  1.962720  5.777782  8.199961
 O  1.890634  9.674668  8.068710
 O  5.840972  1.889242  8.081085
 O  5.761539  5.795090  8.059864
 O  5.772201  9.682870  8.058782
 O  9.661203  1.895797  8.070377
 O  9.581869  5.812870  8.075036
 O  9.656655  9.664356  8.059138
 O  3.894977  3.830116  8.375149
 O  3.848887  7.746245  8.482882
 O  3.834871 11.610789  8.487054
 O  7.713842  3.846083  8.420868
 O  7.678350  7.756342  8.486502
 O  7.747810 11.588760  8.488873
 O 11.519847  3.866750  8.375063
 O 11.592149  7.737733  8.482496
 O 11.582953 11.603550  8.483420
 O  1.828634  2.106402 11.088512
 O  1.973249  5.604548 11.096859
 O  1.891366  9.669578 10.704291
 O  6.102744  1.963287 10.801237
 O  5.637015  5.758455 10.718116
 O  5.769875  9.702291 10.700060
 O  9.798451  1.970802 10.725702
 O  9.329847  5.760601 10.794768
 O  9.673027  9.669765 10.703495
Rh  1.901094  3.854821 11.524043