0;1;2;3;4;5;6;7;8;9;10;11;12;13;14;15;16;17;18;19;20;21;22;23;24;25;26;27;28;29;30;31;32;33;34;35;36;37;38;39;40;41;42;43;44;45;46;47;48;49
0.33970361948013306;0.34114086627960205;0.3425748944282532;0.343947172164917;0.3451838493347168;0.3462791442871094;0.34733450412750244;0.34839266538619995;0.3494373559951782;0.35042309761047363;0.3513166010379791;0.35220468044281006;0.3530887961387634;0.35396552085876465;0.354856014251709;0.3557544946670532;0.3566398620605469;0.35747185349464417;0.35829591751098633;0.35911959409713745;0.35994642972946167;0.36077725887298584;0.36162126064300537;0.362466961145401;0.36331865191459656;0.36418184638023376;0.36505207419395447;0.3659212291240692;0.36679381132125854;0.36767029762268066;0.36854907870292664;0.36943069100379944;0.37031808495521545;0.3711930811405182;0.37206166982650757;0.3729313015937805;0.37374043464660645;0.37454158067703247;0.37534099817276;0.3761431574821472;0.37694594264030457;0.377745121717453;0.37854552268981934;0.3793507218360901;0.3801570236682892;0.3809551000595093;0.38175803422927856;0.3825627565383911;0.38335293531417847;0.38413894176483154
0.3491683304309845;0.3501816987991333;0.3512076139450073;0.3522537052631378;0.3533139228820801;0.35433411598205566;0.35530972480773926;0.3562723696231842;0.35724323987960815;0.35822629928588867;0.35921573638916016;0.3602176308631897;0.36122214794158936;0.36223936080932617;0.3632599115371704;0.3642824590206146;0.36531317234039307;0.36635270714759827;0.3674008250236511;0.3684501051902771;0.36947885155677795;0.37051570415496826;0.37152230739593506;0.3724587857723236;0.37340056896209717;0.3743489980697632;0.3752911388874054;0.3762247562408447;0.3771640658378601;0.3781084418296814;0.3790562152862549;0.38000965118408203;0.3809589147567749;0.38189002871513367;0.3828258514404297;0.38375937938690186;0.38469257950782776;0.3856295943260193;0.38657334446907043;0.38751834630966187;0.38846999406814575;0.3894246220588684;0.39038434624671936;0.39131689071655273;0.39223021268844604;0.39312079548835754;0.39400434494018555;0.39489075541496277;0.39577996730804443;0.39668190479278564
0.35575228929519653;0.35688817501068115;0.3580339550971985;0.35919153690338135;0.36035701632499695;0.3615338206291199;0.362717866897583;0.3639078736305237;0.36511102318763733;0.3663201630115509;0.36751240491867065;0.3686918616294861;0.36987972259521484;0.37096405029296875;0.37204551696777344;0.37312451004981995;0.3742043972015381;0.3752923011779785;0.3763853907585144;0.3774855136871338;0.3785821497440338;0.3796657621860504;0.3807307183742523;0.38180434703826904;0.38288414478302;0.3839736878871918;0.38506564497947693;0.38616347312927246;0.38727015256881714;0.3883820176124573;0.38946935534477234;0.39053264260292053;0.391574501991272;0.3925955295562744;0.3936237096786499;0.3946572542190552;0.39569276571273804;0.3967280983924866;0.39776939153671265;0.39881521463394165;0.3998624086380005;0.4008748531341553;0.4018474817276001;0.40281081199645996;0.40374845266342163;0.40469592809677124;0.40564653277397156;0.4066006541252136;0.40755754709243774;0.40851861238479614
0.36251115798950195;0.3638758957386017;0.36522531509399414;0.3665626347064972;0.36791175603866577;0.3692237138748169;0.37044066190719604;0.3716598451137543;0.3728865385055542;0.3741196393966675;0.3753489553928375;0.37658795714378357;0.3778401017189026;0.3790631592273712;0.3802887499332428;0.38152092695236206;0.3827652335166931;0.3840133547782898;0.3852713406085968;0.38652539253234863;0.3877696990966797;0.38897407054901123;0.3901865482330322;0.3913462162017822;0.39251405000686646;0.3936811685562134;0.3948574960231781;0.39603090286254883;0.3972100019454956;0.39839237928390503;0.399522989988327;0.4006316661834717;0.40173858404159546;0.4028111696243286;0.4038889408111572;0.4049680233001709;0.40604567527770996;0.4071275591850281;0.40821316838264465;0.4092925786972046;0.4103530943393707;0.4114008843898773;0.4124518036842346;0.4135063588619232;0.4145539402961731;0.41558992862701416;0.4165893793106079;0.41757291555404663;0.41847455501556396;0.4192988872528076
0.3694693446159363;0.3708222210407257;0.3721676468849182;0.3735295534133911;0.3749058246612549;0.376309335231781;0.37770798802375793;0.3790815472602844;0.38046911358833313;0.38185808062553406;0.3832448720932007;0.3846440315246582;0.3860568404197693;0.3874158561229706;0.38877958059310913;0.3901183605194092;0.39141952991485596;0.3927156627178192;0.39402449131011963;0.3953450620174408;0.39667779207229614;0.39795801043510437;0.3992061913013458;0.40045130252838135;0.4016556143760681;0.40285366773605347;0.4040592908859253;0.4052712619304657;0.4064885377883911;0.40770238637924194;0.40887340903282166;0.4100165367126465;0.41114741563796997;0.4122771620750427;0.41341206431388855;0.41455382108688354;0.4156472086906433;0.41674333810806274;0.4177224636077881;0.4186326861381531;0.41952019929885864;0.4203958809375763;0.42123228311538696;0.42206865549087524;0.4229125380516052;0.4237560033798218;0.4246073365211487;0.42545777559280396;0.42631542682647705;0.4271751642227173
0.3759515881538391;0.3774786591529846;0.3790022134780884;0.38052934408187866;0.3820720314979553;0.38363319635391235;0.38520461320877075;0.3867111802101135;0.3882143497467041;0.389706015586853;0.39114153385162354;0.392592191696167;0.39405345916748047;0.395530104637146;0.3969348669052124;0.3983103334903717;0.3996737599372864;0.4010031819343567;0.4023105502128601;0.403605580329895;0.40490636229515076;0.40620774030685425;0.4074631333351135;0.4087158739566803;0.4099714457988739;0.41123417019844055;0.4125097393989563;0.4137827455997467;0.41499221324920654;0.41619300842285156;0.4172036647796631;0.4181612730026245;0.41912025213241577;0.42003577947616577;0.4209516644477844;0.42187756299972534;0.42281341552734375;0.4237598776817322;0.424712598323822;0.42567092180252075;0.4266294836997986;0.4275972545146942;0.42856499552726746;0.4295416474342346;0.4305188059806824;0.4315013289451599;0.4324636459350586;0.4334205985069275;0.4343962073326111;0.4353695213794708
0.382626473903656;0.3843558132648468;0.3860008716583252;0.38765084743499756;0.38929837942123413;0.39088374376296997;0.39248842000961304;0.39410606026649475;0.3956576883792877;0.397140234708786;0.39860427379608154;0.40002772212028503;0.40144670009613037;0.4028540253639221;0.4042753577232361;0.40569227933883667;0.40705493092536926;0.4084315896034241;0.40981143712997437;0.4111790060997009;0.4125584363937378;0.41389000415802;0.41521140933036804;0.41634953022003174;0.41739729046821594;0.41843336820602417;0.41944587230682373;0.4204598069190979;0.42148062586784363;0.4225141406059265;0.4235488176345825;0.42458924651145935;0.4256378412246704;0.42668983340263367;0.4277188181877136;0.4287540316581726;0.42980241775512695;0.43085789680480957;0.4319133758544922;0.43296951055526733;0.4340277314186096;0.43508630990982056;0.436149001121521;0.4372154474258423;0.4382883906364441;0.439370334148407;0.4404563903808594;0.44154423475265503;0.4425959587097168;0.44362691044807434
0.3893126845359802;0.391049861907959;0.392749547958374;0.3944157361984253;0.39601320028305054;0.39761263132095337;0.39915192127227783;0.40067699551582336;0.40221714973449707;0.4037727415561676;0.4053000807762146;0.4067774713039398;0.4082610011100769;0.40975794196128845;0.4112582206726074;0.41273874044418335;0.41419103741645813;0.4155101180076599;0.41665250062942505;0.4177784323692322;0.41886982321739197;0.4199701249599457;0.42108023166656494;0.4221929907798767;0.4232920706272125;0.42439916729927063;0.42551350593566895;0.4266355633735657;0.4277537763118744;0.4288913607597351;0.4300246834754944;0.4311624765396118;0.43229949474334717;0.4334479868412018;0.4345986843109131;0.4357583522796631;0.43693429231643677;0.4381038546562195;0.4392857551574707;0.440479040145874;0.4416322112083435;0.44276610016822815;0.44367706775665283;0.4445626139640808;0.44544777274131775;0.4463326334953308;0.4472254514694214;0.44811755418777466;0.44901376962661743;0.4499126672744751
0.39538705348968506;0.3970813751220703;0.3987513482570648;0.4004141092300415;0.40209516882896423;0.40375596284866333;0.4053433835506439;0.4069480895996094;0.40856602787971497;0.4102007746696472;0.4118223190307617;0.41339734196662903;0.4148755371570587;0.4161149859428406;0.41732704639434814;0.4185037612915039;0.4196564257144928;0.42082297801971436;0.4219997525215149;0.42318451404571533;0.42437684535980225;0.4255775213241577;0.4267868101596832;0.42800021171569824;0.42921608686447144;0.4304552674293518;0.4316907227039337;0.43293389678001404;0.43418455123901367;0.4354467988014221;0.4367106556892395;0.4379813075065613;0.4392629861831665;0.4405425488948822;0.44176754355430603;0.44284558296203613;0.4437966048717499;0.44475057721138;0.44570446014404297;0.44666630029678345;0.44762998819351196;0.448580265045166;0.4495302438735962;0.45048514008522034;0.45144397020339966;0.45239293575286865;0.45330458879470825;0.4541734457015991;0.454953670501709;0.45573168992996216
0.4009911119937897;0.4027757942676544;0.4044834077358246;0.406221866607666;0.40796467661857605;0.4097326993942261;0.4114809036254883;0.4131709039211273;0.41469210386276245;0.4160146713256836;0.4172511696815491;0.41848134994506836;0.419730544090271;0.4209921956062317;0.42225900292396545;0.42353397607803345;0.4248236119747162;0.42612120509147644;0.4274194836616516;0.42873120307922363;0.43004944920539856;0.4313775897026062;0.43270841240882874;0.4340655207633972;0.43542319536209106;0.4367891848087311;0.43817341327667236;0.43956640362739563;0.4409019351005554;0.4421566128730774;0.4431704878807068;0.44418543577194214;0.44521093368530273;0.44623178243637085;0.44723421335220337;0.44824180006980896;0.44925931096076965;0.45027559995651245;0.45129624009132385;0.45228347182273865;0.45327311754226685;0.45411574840545654;0.454960435628891;0.4558076560497284;0.4566553831100464;0.4575061798095703;0.45836707949638367;0.4592316150665283;0.4600912928581238;0.46094465255737305
0.40643590688705444;0.40833306312561035;0.4102154076099396;0.4120144546031952;0.41377055644989014;0.41516679525375366;0.41649696230888367;0.41780972480773926;0.4191373884677887;0.4204799234867096;0.4218372106552124;0.42320847511291504;0.4245913624763489;0.4259767532348633;0.42737409472465515;0.42878401279449463;0.43020594120025635;0.4316399097442627;0.4330872595310211;0.43454381823539734;0.436013400554657;0.43749165534973145;0.4389805197715759;0.440418541431427;0.44175654649734497;0.4428359568119049;0.44392216205596924;0.4450073838233948;0.4460753798484802;0.4471452236175537;0.4482228457927704;0.44930461049079895;0.4503934681415558;0.45145997405052185;0.45251286029815674;0.4534435272216797;0.4543382525444031;0.45523810386657715;0.4561481475830078;0.4570552408695221;0.45796531438827515;0.45887500047683716;0.45978236198425293;0.46069884300231934;0.46161794662475586;0.46254605054855347;0.46347475051879883;0.4644120931625366;0.4653463363647461;0.46628570556640625
0.4118374288082123;0.41362273693084717;0.4151136875152588;0.41650089621543884;0.41790658235549927;0.41932952404022217;0.4207702577114105;0.42222756147384644;0.4236927330493927;0.42516839504241943;0.42665910720825195;0.4281647205352783;0.42968475818634033;0.43122005462646484;0.43276774883270264;0.4343288838863373;0.4359033405780792;0.4374908208847046;0.4390713572502136;0.4406029284000397;0.4418778717517853;0.4430238604545593;0.44414710998535156;0.4452751874923706;0.4464120864868164;0.44755446910858154;0.44870442152023315;0.44986626505851746;0.45100241899490356;0.4521326422691345;0.4531053900718689;0.4540541172027588;0.4550049901008606;0.455962598323822;0.45692241191864014;0.4578830301761627;0.45885056257247925;0.45981913805007935;0.46079862117767334;0.46177566051483154;0.4627611041069031;0.46375370025634766;0.46474689245224;0.46574580669403076;0.4667503833770752;0.467764675617218;0.46877962350845337;0.46979981660842896;0.4708293676376343;0.4718589186668396
0.41604018211364746;0.4175342917442322;0.4190477132797241;0.42058107256889343;0.4221265912055969;0.4236834645271301;0.4252587556838989;0.42685145139694214;0.4284617304801941;0.43008869886398315;0.4317319393157959;0.4333912432193756;0.43506643176078796;0.43675732612609863;0.438438355922699;0.44006651639938354;0.4414575695991516;0.44264888763427734;0.4438416361808777;0.44504314661026;0.44625329971313477;0.44747233390808105;0.4487002491950989;0.4499252438545227;0.4511186480522156;0.4522308111190796;0.4532244801521301;0.45422613620758057;0.4552374482154846;0.456249475479126;0.4572632610797882;0.45828303694725037;0.459317147731781;0.4603465795516968;0.46138304471969604;0.46243274211883545;0.46348971128463745;0.4645453691482544;0.4656078815460205;0.4666837453842163;0.46775829792022705;0.46884649991989136;0.4699329137802124;0.47102534770965576;0.47213077545166016;0.47323405742645264;0.4743431806564331;0.47546470165252686;0.4765840172767639;0.4777159094810486
0.4198988080024719;0.4215267598628998;0.42317530512809753;0.4248448610305786;0.4265349507331848;0.4282448887825012;0.42997413873672485;0.4317226707935333;0.43349015712738037;0.4352615475654602;0.43704748153686523;0.4388000965118408;0.4405132532119751;0.4417639374732971;0.44302284717559814;0.4442940950393677;0.4455757737159729;0.44686755537986755;0.4481636881828308;0.4494516849517822;0.45071375370025635;0.45188963413238525;0.45294132828712463;0.4540027379989624;0.4550524950027466;0.4561154246330261;0.45718151330947876;0.45826244354248047;0.4593454599380493;0.46044307947158813;0.46154236793518066;0.4626498222351074;0.4637709856033325;0.4648935794830322;0.4660298824310303;0.46716588735580444;0.4683176875114441;0.46947795152664185;0.47063708305358887;0.47180241346359253;0.4729817509651184;0.474159300327301;0.4753429889678955;0.47654008865356445;0.47773510217666626;0.4789358973503113;0.48014962673187256;0.4813612103462219;0.48257821798324585;0.4838072657585144
0.4239175319671631;0.4256976544857025;0.4275006055831909;0.42932748794555664;0.43116992712020874;0.43302294611930847;0.43489426374435425;0.436785489320755;0.4386356472969055;0.4403653144836426;0.44168800115585327;0.4430232048034668;0.44436997175216675;0.44572776556015015;0.4470822215080261;0.4484548270702362;0.4497910737991333;0.45112621784210205;0.4522274136543274;0.4533243179321289;0.45443248748779297;0.45555105805397034;0.4566730260848999;0.45781147480010986;0.4589530825614929;0.46011072397232056;0.46127092838287354;0.462446928024292;0.4636250138282776;0.46481847763061523;0.4660136103630066;0.4672170877456665;0.46843504905700684;0.46965426206588745;0.47088778018951416;0.4721219539642334;0.47337019443511963;0.47461873292922974;0.4758809804916382;0.47714316844940186;0.4784122705459595;0.479694128036499;0.480975866317749;0.482269823551178;0.48356354236602783;0.484868586063385;0.48617374897003174;0.48748940229415894;0.48881274461746216;0.4900793433189392
0.42813459038734436;0.4300616979598999;0.4320106506347656;0.4339814782142639;0.43597179651260376;0.43793535232543945;0.4398384392261505;0.4412318170070648;0.4426342844963074;0.4440433979034424;0.4454655945301056;0.44689974188804626;0.44833898544311523;0.44975101947784424;0.45108383893966675;0.4522286057472229;0.45338553190231323;0.45454782247543335;0.45572805404663086;0.4569196403026581;0.45812246203422546;0.4593293070793152;0.4605534076690674;0.46178126335144043;0.4630257487297058;0.4642733931541443;0.4655371308326721;0.4668036699295044;0.46808576583862305;0.4693703055381775;0.4706697463989258;0.4719715118408203;0.4732815623283386;0.4746057391166687;0.47593194246292114;0.4772714376449585;0.4786125421524048;0.4799661636352539;0.48132646083831787;0.48268866539001465;0.48406195640563965;0.4854399561882019;0.48682403564453125;0.48813700675964355;0.48945456743240356;0.4907766580581665;0.4921032786369324;0.4934338927268982;0.49477052688598633;0.4961128234863281
0.43249523639678955;0.43457525968551636;0.43666380643844604;0.4386787712574005;0.4403805136680603;0.4418436884880066;0.4433261752128601;0.44481563568115234;0.4463191628456116;0.4478362202644348;0.44931676983833313;0.4507155418395996;0.45191508531570435;0.4531281888484955;0.4543546438217163;0.45558756589889526;0.45683956146240234;0.45809778571128845;0.45937424898147583;0.4606624245643616;0.46195584535598755;0.4632665514945984;0.4645819664001465;0.4659140706062317;0.4672505259513855;0.4686030149459839;0.4699594974517822;0.4713313579559326;0.4727068543434143;0.47409671545028687;0.4754953384399414;0.47689729928970337;0.4783124327659607;0.47973549365997314;0.4811648726463318;0.48260176181793213;0.4840467572212219;0.4854406714439392;0.4868173599243164;0.4882010817527771;0.48959243297576904;0.49098867177963257;0.49239039421081543;0.4937970042228699;0.49520784616470337;0.4966229200363159;0.4980471730232239;0.49947595596313477;0.5008752942085266;0.5022367238998413
0.43696311116218567;0.43907850980758667;0.4406736195087433;0.4422121047973633;0.4437673091888428;0.4453383684158325;0.4469243586063385;0.4484817683696747;0.4500422477722168;0.4512872099876404;0.45255282521247864;0.4538331627845764;0.4551226496696472;0.4564317464828491;0.4577544629573822;0.45908498764038086;0.4604340195655823;0.4617958068847656;0.4631645679473877;0.4645506739616394;0.4659433364868164;0.4673524498939514;0.4687724709510803;0.4702029824256897;0.4716436266899109;0.4730941653251648;0.47455430030822754;0.47602421045303345;0.4775005578994751;0.4789928197860718;0.4804942011833191;0.4820014238357544;0.4834352135658264;0.48487550020217896;0.4863234758377075;0.4877780079841614;0.48923826217651367;0.49070411920547485;0.4921796917915344;0.49365752935409546;0.4951455593109131;0.49663907289505005;0.4981346130371094;0.49961215257644653;0.5010368824005127;0.5024706721305847;0.5039052367210388;0.5053491592407227;0.5067929029464722;0.5082465410232544
0.44070136547088623;0.4423171281814575;0.4439506530761719;0.4456014037132263;0.4472501575946808;0.4488826394081116;0.45035600662231445;0.4516640603542328;0.4529932141304016;0.45433875918388367;0.4556957185268402;0.4570724070072174;0.45846426486968994;0.4598665237426758;0.4612874388694763;0.4627222418785095;0.46416616439819336;0.46562737226486206;0.4671013355255127;0.4685877561569214;0.4700860381126404;0.4715965986251831;0.47311973571777344;0.4746500849723816;0.4761953353881836;0.4777509570121765;0.4793154001235962;0.48081153631210327;0.4823090434074402;0.4838147759437561;0.4853302240371704;0.4868517518043518;0.4883798360824585;0.48991864919662476;0.491460919380188;0.49301421642303467;0.4945698380470276;0.4961366653442383;0.4977095127105713;0.4992138743400574;0.5007082223892212;0.5022130608558655;0.5037186741828918;0.5052348971366882;0.5067513585090637;0.5082786083221436;0.5098106861114502;0.511343240737915;0.5128855109214783;0.5144039988517761
0.4438960552215576;0.4456195533275604;0.44733136892318726;0.44904324412345886;0.450484037399292;0.45185667276382446;0.4532437324523926;0.45465248823165894;0.45607852935791016;0.4575214087963104;0.458976686000824;0.4604519009590149;0.4619424343109131;0.46344804763793945;0.4649682641029358;0.4665054678916931;0.4680543541908264;0.4696158766746521;0.47119271755218506;0.47277945280075073;0.474381685256958;0.47599589824676514;0.4775789976119995;0.47912681102752686;0.48068708181381226;0.4822552800178528;0.4838319420814514;0.48541659116744995;0.48701411485671997;0.4886157512664795;0.4902299642562866;0.4918517470359802;0.49347734451293945;0.49511462450027466;0.4967554807662964;0.49831855297088623;0.4998803734779358;0.501448392868042;0.5030292868614197;0.5046160817146301;0.5062088966369629;0.5078030824661255;0.5094080567359924;0.5110141634941101;0.5126140117645264;0.5141928195953369;0.5157760381698608;0.5173644423484802;0.5189574956893921;0.5205366015434265
0.44715750217437744;0.44894373416900635;0.4504086375236511;0.4518389403820038;0.4532891511917114;0.4547586441040039;0.45624685287475586;0.45775333046913147;0.4592776298522949;0.4608195424079895;0.46237802505493164;0.46395343542099;0.4655482769012451;0.46715444326400757;0.46877866983413696;0.47041743993759155;0.47207045555114746;0.4737359881401062;0.47535014152526855;0.4769520163536072;0.4785693287849426;0.4801950454711914;0.48183077573776245;0.48347610235214233;0.4851357340812683;0.48680055141448975;0.48847925662994385;0.49016231298446655;0.4918590188026428;0.4935638904571533;0.49527329206466675;0.49692589044570923;0.4985474944114685;0.5001881122589111;0.5018360018730164;0.503485381603241;0.5051476955413818;0.5068166255950928;0.5084877610206604;0.5101660490036011;0.5118178725242615;0.5134690999984741;0.5151276588439941;0.5167869329452515;0.518439531326294;0.5200928449630737;0.5217504501342773;0.5234100222587585;0.5250744819641113;0.5267399549484253
0.45013025403022766;0.4516148269176483;0.453121155500412;0.45464855432510376;0.4561966061592102;0.45776477456092834;0.4593544602394104;0.46096259355545044;0.4625876545906067;0.46423327922821045;0.4658964276313782;0.467576265335083;0.4692726731300354;0.47098469734191895;0.47264325618743896;0.4742959141731262;0.475957989692688;0.4776397943496704;0.4793294668197632;0.48103034496307373;0.4827476739883423;0.4844755530357361;0.4862099885940552;0.487959086894989;0.4897141456604004;0.4914831519126892;0.49325764179229736;0.4950295686721802;0.4967142939567566;0.4984179735183716;0.5001242756843567;0.5018449425697327;0.5035678744316101;0.5053045749664307;0.5070437788963318;0.5087946653366089;0.5105093717575073;0.5122337341308594;0.5139583945274353;0.5156828761100769;0.5174058079719543;0.5191349387168884;0.5208665728569031;0.5226042866706848;0.5243433713912964;0.5260865688323975;0.5278354287147522;0.5295853614807129;0.5313391089439392;0.5330976843833923
0.4527363181114197;0.4543188810348511;0.45592576265335083;0.4575555622577667;0.4592064619064331;0.46087825298309326;0.4625701904296875;0.4642815589904785;0.4660121202468872;0.46776074171066284;0.4694748520851135;0.47116684913635254;0.4728761911392212;0.47459977865219116;0.47634178400039673;0.47809284925460815;0.47985684871673584;0.4816386103630066;0.48342758417129517;0.4852335453033447;0.48704642057418823;0.48887521028518677;0.49071043729782104;0.4925609827041626;0.4943753480911255;0.49613332748413086;0.4979062080383301;0.4996883273124695;0.5014743208885193;0.5032746195793152;0.5050788521766663;0.5068925619125366;0.5086825489997864;0.510471522808075;0.5122604370117188;0.514053463935852;0.5158494710922241;0.5176515579223633;0.5194571614265442;0.5212692618370056;0.5230840444564819;0.5249035954475403;0.5267292857170105;0.5285570621490479;0.530390739440918;0.5322265028953552;0.5340556502342224;0.5357277989387512;0.5372679829597473;0.5388109087944031
0.45543748140335083;0.45712319016456604;0.45883214473724365;0.4605637192726135;0.4623173475265503;0.4640924334526062;0.4658685326576233;0.4675913453102112;0.46933645009994507;0.47109806537628174;0.4728756546974182;0.47467392683029175;0.47648245096206665;0.4783104658126831;0.4801481366157532;0.48199939727783203;0.4838692545890808;0.48574715852737427;0.48764264583587646;0.4895457625389099;0.49146080017089844;0.49335646629333496;0.4951803684234619;0.49701952934265137;0.4988640546798706;0.5007243156433105;0.502589762210846;0.5044640302658081;0.5063326954841614;0.5081815719604492;0.5100372433662415;0.5118991136550903;0.513766884803772;0.5156378149986267;0.5175150632858276;0.5194000005722046;0.5212883353233337;0.5231822729110718;0.5250833630561829;0.5269872546195984;0.5288980603218079;0.5308112502098083;0.5327221155166626;0.5346196889877319;0.5362304449081421;0.537843644618988;0.539459764957428;0.5410783886909485;0.5425735712051392;0.5438400506973267
0.4582288861274719;0.4600169062614441;0.4618253707885742;0.46359574794769287;0.4653671979904175;0.46715664863586426;0.46896451711654663;0.47079598903656006;0.47264015674591064;0.4745064377784729;0.4763845205307007;0.47827857732772827;0.48019301891326904;0.4821178913116455;0.48405712842941284;0.4860156774520874;0.48798322677612305;0.4899643659591675;0.4919505715370178;0.493847131729126;0.4957447052001953;0.49766045808792114;0.4995806813240051;0.5015119910240173;0.5034538507461548;0.5053721070289612;0.5072892308235168;0.5092176795005798;0.5111505389213562;0.5130913853645325;0.515036940574646;0.5169920921325684;0.5189512968063354;0.5209171772003174;0.5228914618492126;0.5248692631721497;0.5268549919128418;0.528843879699707;0.5308379530906677;0.5328162312507629;0.5347257852554321;0.5364066958427429;0.5380920171737671;0.5397809147834778;0.5414726734161377;0.5429154634475708;0.5442555546760559;0.5444732308387756;0.5444732308387756;0.5444732308387756
0.4610050916671753;0.4627854824066162;0.4646190404891968;0.46646571159362793;0.46834033727645874;0.47022783756256104;0.4721550941467285;0.474067747592926;0.4760321378707886;0.4779999852180481;0.47997963428497314;0.4819756746292114;0.4839932918548584;0.4860091805458069;0.4880584478378296;0.49011677503585815;0.49213099479675293;0.49409306049346924;0.49606192111968994;0.4980461597442627;0.50003981590271;0.5020444989204407;0.504021942615509;0.5060110688209534;0.5080062747001648;0.5100129246711731;0.5120235085487366;0.514042317867279;0.516071617603302;0.5181060433387756;0.5201481580734253;0.5221994519233704;0.5242552161216736;0.5263197422027588;0.5283902883529663;0.5304535627365112;0.5325126647949219;0.5344932079315186;0.5362457633018494;0.5380024313926697;0.5397639274597168;0.5415283441543579;0.542996346950531;0.5444121360778809;0.5444732308387756;0.5444732308387756;0.5444732308387756;0.5444732308387756;0.5444732308387756;0.5444732308387756
0.46365946531295776;0.465570330619812;0.46749448776245117;0.46944719552993774;0.47141504287719727;0.473410964012146;0.4754204750061035;0.47745537757873535;0.4795030951499939;0.4815751314163208;0.48365914821624756;0.4857606887817383;0.4878842830657959;0.49001508951187134;0.4920501708984375;0.4940806031227112;0.4961211681365967;0.4981765151023865;0.5002431273460388;0.5022859573364258;0.504341721534729;0.5064051151275635;0.508476197719574;0.5105592608451843;0.5126491785049438;0.5147508382797241;0.5168587565422058;0.5189752578735352;0.5211021304130554;0.5232343077659607;0.5253762006759644;0.527525007724762;0.5296623110771179;0.5318009853363037;0.5339164733886719;0.5357386469841003;0.5375667214393616;0.5393997430801392;0.5412369966506958;0.5427980422973633;0.5442916750907898;0.5444732308387756;0.5444732308387756;0.5444732308387756;0.5444732308387756;0.5444732308387756;0.5444732308387756;0.5444732308387756;0.5444732308387756;0.5444732308387756
0.46642160415649414;0.468424916267395;0.4704516530036926;0.47250819206237793;0.4745796322822571;0.4766724109649658;0.4787924289703369;0.48092585802078247;0.48308444023132324;0.4852558374404907;0.4874460697174072;0.489635169506073;0.4917181134223938;0.4938144087791443;0.495927095413208;0.49805670976638794;0.5001646280288696;0.5022820234298706;0.5044100880622864;0.506546676158905;0.5086972117424011;0.5108554363250732;0.5130243897438049;0.5152057409286499;0.5173945426940918;0.5195949077606201;0.521801769733429;0.5240193009376526;0.5262410044670105;0.5284563302993774;0.5306748747825623;0.5329012870788574;0.5348790884017944;0.5367764234542847;0.5386802554130554;0.5405892729759216;0.5423031449317932;0.5438762307167053;0.5444732308387756;0.5444732308387756;0.5444732308387756;0.5444732308387756;0.5444732308387756;0.5444732308387756;0.5444732308387756;0.5444732308387756;0.5444732308387756;0.5444732308387756;0.5444732308387756;0.5444732308387756
0.469249427318573;0.4713556170463562;0.47348570823669434;0.4756453037261963;0.4778216481208801;0.48001986742019653;0.48223966360092163;0.48448020219802856;0.48674124479293823;0.4889870285987854;0.49113547801971436;0.4932999014854431;0.49548012018203735;0.49766045808792114;0.4998359680175781;0.5020214319229126;0.5042230486869812;0.5064343214035034;0.5086608529090881;0.5108963251113892;0.5131459832191467;0.5154039263725281;0.5176754593849182;0.5199543833732605;0.5222455263137817;0.5245382785797119;0.5268314480781555;0.5291282534599304;0.5314339995384216;0.5336608290672302;0.5356261730194092;0.5375992059707642;0.5395788550376892;0.5414949655532837;0.5431486964225769;0.5444732308387756;0.5444732308387756;0.5444732308387756;0.5444732308387756;0.5444732308387756;0.5444732308387756;0.5444732308387756;0.5444732308387756;0.5444732308387756;0.5444732308387756;0.5444732308387756;0.5444732308387756;0.5444732308387756;0.5444732308387756;0.5444732308387756
0.4721461534500122;0.4743620753288269;0.4765976071357727;0.47885751724243164;0.48114097118377686;0.48344719409942627;0.4857756495475769;0.48808854818344116;0.4902989864349365;0.49253153800964355;0.4947732090950012;0.49700528383255005;0.49924951791763306;0.501505434513092;0.5037792325019836;0.5060641169548035;0.5083655714988708;0.5106770396232605;0.5130040645599365;0.5153402090072632;0.517690896987915;0.5200501084327698;0.5224161148071289;0.5247841477394104;0.5271568298339844;0.5295398235321045;0.531930148601532;0.5341119170188904;0.5361520051956177;0.5381999015808105;0.5402544736862183;0.5420928001403809;0.5438265800476074;0.5444732308387756;0.5444732308387756;0.5444732308387756;0.5444732308387756;0.5444732308387756;0.5444732308387756;0.5444732308387756;0.5444732308387756;0.5444732308387756;0.5444732308387756;0.5444732308387756;0.5444732308387756;0.5444732308387756;0.5444732308387756;0.5444732308387756;0.5444732308387756;0.5444732308387756
0.4751228094100952;0.47744065523147583;0.4797842502593994;0.48215246200561523;0.48454511165618896;0.4869403839111328;0.4892173409461975;0.4915177822113037;0.493801474571228;0.4960958957672119;0.49840420484542847;0.5007321834564209;0.5030733346939087;0.5054330825805664;0.5078048706054688;0.5101937651634216;0.512596607208252;0.5150098204612732;0.5174386501312256;0.5198731422424316;0.5223126411437988;0.5247585773468018;0.5272162556648254;0.5296820998191833;0.5321587920188904;0.5343362092971802;0.5364497900009155;0.5385723114013672;0.5406935811042786;0.5425099730491638;0.5443254709243774;0.5444732308387756;0.5444732308387756;0.5444732308387756;0.5444732308387756;0.5444732308387756;0.5444732308387756;0.5444732308387756;0.5444732308387756;0.5444732308387756;0.5444732308387756;0.5444732308387756;0.5444732308387756;0.5444732308387756;0.5444732308387756;0.5444732308387756;0.5444732308387756;0.5444732308387756;0.5444732308387756;0.5444732308387756
0.47817152738571167;0.48059773445129395;0.4830514192581177;0.4855402112007141;0.48789656162261963;0.4902380108833313;0.49257439374923706;0.494928777217865;0.49730509519577026;0.4996969699859619;0.5021092295646667;0.5045388340950012;0.5069818496704102;0.5094437599182129;0.5119179487228394;0.5144093036651611;0.5169088840484619;0.5194184184074402;0.5219334363937378;0.5244607925415039;0.5270010232925415;0.5295518040657043;0.532112181186676;0.5343277454376221;0.5365142226219177;0.5387104749679565;0.5408366918563843;0.5427356958389282;0.5444732308387756;0.5444732308387756;0.5444732308387756;0.5444732308387756;0.5444732308387756;0.5444732308387756;0.5444732308387756;0.5444732308387756;0.5444732308387756;0.5444732308387756;0.5444732308387756;0.5444732308387756;0.5444732308387756;0.5444732308387756;0.5444732308387756;0.5444732308387756;0.5444732308387756;0.5444732308387756;0.5444732308387756;0.5444732308387756;0.5444732308387756;0.5444732308387756
0.48131901025772095;0.48386240005493164;0.4863209128379822;0.4887009263038635;0.4910934567451477;0.4935108423233032;0.49594610929489136;0.4984048008918762;0.5008828639984131;0.503376841545105;0.5058919787406921;0.5084245800971985;0.5109708905220032;0.5135299563407898;0.5161023139953613;0.5186825394630432;0.5212786793708801;0.5238863229751587;0.5265080332756042;0.5291414856910706;0.5317863821983337;0.5340816378593445;0.5363401770591736;0.5386094450950623;0.5407764911651611;0.542759120464325;0.5444732308387756;0.5444732308387756;0.5444732308387756;0.5444732308387756;0.5444732308387756;0.5444732308387756;0.5444732308387756;0.5444732308387756;0.5444732308387756;0.5444732308387756;0.5444732308387756;0.5444732308387756;0.5444732308387756;0.5444732308387756;0.5444732308387756;0.5444732308387756;0.5444732308387756;0.5444732308387756;0.5444732308387756;0.5444732308387756;0.5444732308387756;0.5444732308387756;0.5444732308387756;0.5444732308387756
0.48448896408081055;0.4869178533554077;0.48936742544174194;0.4918375611305237;0.49433445930480957;0.4968506097793579;0.49939125776290894;0.5019526481628418;0.5045313239097595;0.5071319937705994;0.5097439885139465;0.5123736262321472;0.515015184879303;0.5176715850830078;0.5203449726104736;0.5230313539505005;0.5257331728935242;0.5284481048583984;0.5311756730079651;0.5335947871208191;0.535923957824707;0.5382649302482605;0.5405028462409973;0.5425698161125183;0.5444732308387756;0.5444732308387756;0.5444732308387756;0.5444732308387756;0.5444732308387756;0.5444732308387756;0.5444732308387756;0.5444732308387756;0.5444732308387756;0.5444732308387756;0.5444732308387756;0.5444732308387756;0.5444732308387756;0.5444732308387756;0.5444732308387756;0.5444732308387756;0.5444732308387756;0.5444732308387756;0.5444732308387756;0.5444732308387756;0.5444732308387756;0.5444732308387756;0.5444732308387756;0.5444732308387756;0.5444732308387756;0.5444732308387756
0.4873926639556885;0.4899148941040039;0.4924659729003906;0.495042085647583;0.4976387619972229;0.5002614855766296;0.5029060244560242;0.5055645704269409;0.5082427859306335;0.5109376311302185;0.513651430606842;0.5163812637329102;0.5191282033920288;0.5218929648399353;0.5246730446815491;0.5274679660797119;0.5302767753601074;0.5328637957572937;0.5352620482444763;0.5376737713813782;0.5400063395500183;0.542158305644989;0.5443129539489746;0.5444732308387756;0.5444732308387756;0.5444732308387756;0.5444732308387756;0.5444732308387756;0.5444732308387756;0.5444732308387756;0.5444732308387756;0.5444732308387756;0.5444732308387756;0.5444732308387756;0.5444732308387756;0.5444732308387756;0.5444732308387756;0.5444732308387756;0.5444732308387756;0.5444732308387756;0.5444732308387756;0.5444732308387756;0.5444732308387756;0.5444732308387756;0.5444732308387756;0.5444732308387756;0.5444732308387756;0.5444732308387756;0.5444732308387756;0.5444732308387756
0.490348219871521;0.49297648668289185;0.49562811851501465;0.49830806255340576;0.5010060667991638;0.5037240982055664;0.5064646005630493;0.5092272162437439;0.5120079517364502;0.5148100256919861;0.5176299214363098;0.5204691290855408;0.5233243703842163;0.5261973142623901;0.5290864706039429;0.531886637210846;0.5343521237373352;0.5368325114250183;0.5392782688140869;0.5415151715278625;0.5437561273574829;0.5444732308387756;0.5444732308387756;0.5444732308387756;0.5444732308387756;0.5444732308387756;0.5444732308387756;0.5444732308387756;0.5444732308387756;0.5444732308387756;0.5444732308387756;0.5444732308387756;0.5444732308387756;0.5444732308387756;0.5444732308387756;0.5444732308387756;0.5444732308387756;0.5444732308387756;0.5444732308387756;0.5444732308387756;0.5444732308387756;0.5444732308387756;0.5444732308387756;0.5444732308387756;0.5444732308387756;0.5444732308387756;0.5444732308387756;0.5444732308387756;0.5444732308387756;0.5444732308387756
0.4933568239212036;0.49608558416366577;0.49884068965911865;0.5016143918037415;0.5044165849685669;0.507240355014801;0.5100886821746826;0.5129568576812744;0.5158478021621704;0.5187575817108154;0.5216877460479736;0.5246362686157227;0.5276021957397461;0.5305851101875305;0.5331926941871643;0.5357398986816406;0.538284957408905;0.5406319499015808;0.5429589748382568;0.5444732308387756;0.5444732308387756;0.5444732308387756;0.5444732308387756;0.5444732308387756;0.5444732308387756;0.5444732308387756;0.5444732308387756;0.5444732308387756;0.5444732308387756;0.5444732308387756;0.5444732308387756;0.5444732308387756;0.5444732308387756;0.5444732308387756;0.5444732308387756;0.5444732308387756;0.5444732308387756;0.5444732308387756;0.5444732308387756;0.5444732308387756;0.5444732308387756;0.5444732308387756;0.5444732308387756;0.5444732308387756;0.5444732308387756;0.5444732308387756;0.5444732308387756;0.5444732308387756;0.5444732308387756;0.5444732308387756
0.4964110255241394;0.499240517616272;0.5020986199378967;0.5049817562103271;0.5078915953636169;0.5108241438865662;0.5137811899185181;0.5167608261108398;0.5197607278823853;0.522782027721405;0.5258235335350037;0.5288829207420349;0.5317830443382263;0.5343941450119019;0.5370185375213623;0.5395011901855469;0.5419135689735413;0.5443328022956848;0.5444732308387756;0.5444732308387756;0.5444732308387756;0.5444732308387756;0.5444732308387756;0.5444732308387756;0.5444732308387756;0.5444732308387756;0.5444732308387756;0.5444732308387756;0.5444732308387756;0.5444732308387756;0.5444732308387756;0.5444732308387756;0.5444732308387756;0.5444732308387756;0.5444732308387756;0.5444732308387756;0.5444732308387756;0.5444732308387756;0.5444732308387756;0.5444732308387756;0.5444732308387756;0.5444732308387756;0.5444732308387756;0.5444732308387756;0.5444732308387756;0.5444732308387756;0.5444732308387756;0.5444732308387756;0.5444732308387756;0.5444732308387756
0.49951761960983276;0.5024548768997192;0.5054217576980591;0.5084154009819031;0.5114336013793945;0.5144777894020081;0.5175459384918213;0.520636796951294;0.5237491726875305;0.5268824100494385;0.5300348997116089;0.5327960848808289;0.535488486289978;0.5381165742874146;0.5406129360198975;0.5431180596351624;0.5444732308387756;0.5444732308387756;0.5444732308387756;0.5444732308387756;0.5444732308387756;0.5444732308387756;0.5444732308387756;0.5444732308387756;0.5444732308387756;0.5444732308387756;0.5444732308387756;0.5444732308387756;0.5444732308387756;0.5444732308387756;0.5444732308387756;0.5444732308387756;0.5444732308387756;0.5444732308387756;0.5444732308387756;0.5444732308387756;0.5444732308387756;0.5444732308387756;0.5444732308387756;0.5444732308387756;0.5444732308387756;0.5444732308387756;0.5444732308387756;0.5444732308387756;0.5444732308387756;0.5444732308387756;0.5444732308387756;0.5444732308387756;0.5444732308387756;0.5444732308387756
0.5026835799217224;0.5057320594787598;0.508807897567749;0.51191246509552;0.5150434970855713;0.5181999206542969;0.5213805437088013;0.524584174156189;0.527810275554657;0.5309463143348694;0.5336984395980835;0.5364330410957336;0.5390514135360718;0.5416406989097595;0.5442402362823486;0.5444732308387756;0.5444732308387756;0.5444732308387756;0.5444732308387756;0.5444732308387756;0.5444732308387756;0.5444732308387756;0.5444732308387756;0.5444732308387756;0.5444732308387756;0.5444732308387756;0.5444732308387756;0.5444732308387756;0.5444732308387756;0.5444732308387756;0.5444732308387756;0.5444732308387756;0.5444732308387756;0.5444732308387756;0.5444732308387756;0.5444732308387756;0.5444732308387756;0.5444732308387756;0.5444732308387756;0.5444732308387756;0.5444732308387756;0.5444732308387756;0.5444732308387756;0.5444732308387756;0.5444732308387756;0.5444732308387756;0.5444732308387756;0.5444732308387756;0.5444732308387756;0.5444732308387756
0.5059089660644531;0.5090687870979309;0.5122578144073486;0.5154752135276794;0.5187188982963562;0.5219898223876953;0.5252849459648132;0.5286031365394592;0.5316556692123413;0.5344597101211548;0.5372247099876404;0.53989577293396;0.5425794720649719;0.5444732308387756;0.5444732308387756;0.5444732308387756;0.5444732308387756;0.5444732308387756;0.5444732308387756;0.5444732308387756;0.5444732308387756;0.5444732308387756;0.5444732308387756;0.5444732308387756;0.5444732308387756;0.5444732308387756;0.5444732308387756;0.5444732308387756;0.5444732308387756;0.5444732308387756;0.5444732308387756;0.5444732308387756;0.5444732308387756;0.5444732308387756;0.5444732308387756;0.5444732308387756;0.5444732308387756;0.5444732308387756;0.5444732308387756;0.5444732308387756;0.5444732308387756;0.5444732308387756;0.5444732308387756;0.5444732308387756;0.5444732308387756;0.5444732308387756;0.5444732308387756;0.5444732308387756;0.5444732308387756;0.5444732308387756
0.509192943572998;0.5124659538269043;0.5157691240310669;0.5191013216972351;0.5224615335464478;0.5258475542068481;0.5292578935623169;0.5322269201278687;0.5350967049598694;0.5378799438476562;0.5406447649002075;0.5434240102767944;0.5444732308387756;0.5444732308387756;0.5444732308387756;0.5444732308387756;0.5444732308387756;0.5444732308387756;0.5444732308387756;0.5444732308387756;0.5444732308387756;0.5444732308387756;0.5444732308387756;0.5444732308387756;0.5444732308387756;0.5444732308387756;0.5444732308387756;0.5444732308387756;0.5444732308387756;0.5444732308387756;0.5444732308387756;0.5444732308387756;0.5444732308387756;0.5444732308387756;0.5444732308387756;0.5444732308387756;0.5444732308387756;0.5444732308387756;0.5444732308387756;0.5444732308387756;0.5444732308387756;0.5444732308387756;0.5444732308387756;0.5444732308387756;0.5444732308387756;0.5444732308387756;0.5444732308387756;0.5444732308387756;0.5444732308387756;0.5444732308387756
0.5125359296798706;0.5159242153167725;0.5193434357643127;0.5227924585342407;0.5262693166732788;0.5297459363937378;0.532667338848114;0.5355915427207947;0.5384339690208435;0.5412936806678772;0.5441694855690002;0.5444732308387756;0.5444732308387756;0.5444732308387756;0.5444732308387756;0.5444732308387756;0.5444732308387756;0.5444732308387756;0.5444732308387756;0.5444732308387756;0.5444732308387756;0.5444732308387756;0.5444732308387756;0.5444732308387756;0.5444732308387756;0.5444732308387756;0.5444732308387756;0.5444732308387756;0.5444732308387756;0.5444732308387756;0.5444732308387756;0.5444732308387756;0.5444732308387756;0.5444732308387756;0.5444732308387756;0.5444732308387756;0.5444732308387756;0.5444732308387756;0.5444732308387756;0.5444732308387756;0.5444732308387756;0.5444732308387756;0.5444732308387756;0.5444732308387756;0.5444732308387756;0.5444732308387756;0.5444732308387756;0.5444732308387756;0.5444732308387756;0.5444732308387756
0.5159358978271484;0.5194447040557861;0.5229798555374146;0.5265262722969055;0.5299819111824036;0.5329887270927429;0.5359465479850769;0.538882315158844;0.5418373346328735;0.5444732308387756;0.5444732308387756;0.5444732308387756;0.5444732308387756;0.5444732308387756;0.5444732308387756;0.5444732308387756;0.5444732308387756;0.5444732308387756;0.5444732308387756;0.5444732308387756;0.5444732308387756;0.5444732308387756;0.5444732308387756;0.5444732308387756;0.5444732308387756;0.5444732308387756;0.5444732308387756;0.5444732308387756;0.5444732308387756;0.5444732308387756;0.5444732308387756;0.5444732308387756;0.5444732308387756;0.5444732308387756;0.5444732308387756;0.5444732308387756;0.5444732308387756;0.5444732308387756;0.5444732308387756;0.5444732308387756;0.5444732308387756;0.5444732308387756;0.5444732308387756;0.5444732308387756;0.5444732308387756;0.5444732308387756;0.5444732308387756;0.5444732308387756;0.5444732308387756;0.5444732308387756
0.5193682312965393;0.5229938626289368;0.52665114402771;0.5301026701927185;0.5331840515136719;0.5361909866333008;0.53922039270401;0.5422713756561279;0.5444732308387756;0.5444732308387756;0.5444732308387756;0.5444732308387756;0.5444732308387756;0.5444732308387756;0.5444732308387756;0.5444732308387756;0.5444732308387756;0.5444732308387756;0.5444732308387756;0.5444732308387756;0.5444732308387756;0.5444732308387756;0.5444732308387756;0.5444732308387756;0.5444732308387756;0.5444732308387756;0.5444732308387756;0.5444732308387756;0.5444732308387756;0.5444732308387756;0.5444732308387756;0.5444732308387756;0.5444732308387756;0.5444732308387756;0.5444732308387756;0.5444732308387756;0.5444732308387756;0.5444732308387756;0.5444732308387756;0.5444732308387756;0.5444732308387756;0.5444732308387756;0.5444732308387756;0.5444732308387756;0.5444732308387756;0.5444732308387756;0.5444732308387756;0.5444732308387756;0.5444732308387756;0.5444732308387756
0.522880494594574;0.5266276001930237;0.5301008224487305;0.5332226157188416;0.5363207459449768;0.539443850517273;0.5425911545753479;0.5444732308387756;0.5444732308387756;0.5444732308387756;0.5444732308387756;0.5444732308387756;0.5444732308387756;0.5444732308387756;0.5444732308387756;0.5444732308387756;0.5444732308387756;0.5444732308387756;0.5444732308387756;0.5444732308387756;0.5444732308387756;0.5444732308387756;0.5444732308387756;0.5444732308387756;0.5444732308387756;0.5444732308387756;0.5444732308387756;0.5444732308387756;0.5444732308387756;0.5444732308387756;0.5444732308387756;0.5444732308387756;0.5444732308387756;0.5444732308387756;0.5444732308387756;0.5444732308387756;0.5444732308387756;0.5444732308387756;0.5444732308387756;0.5444732308387756;0.5444732308387756;0.5444732308387756;0.5444732308387756;0.5444732308387756;0.5444732308387756;0.5444732308387756;0.5444732308387756;0.5444732308387756;0.5444732308387756;0.5444732308387756
0.5264545679092407;0.5299733877182007;0.5331428050994873;0.5363318920135498;0.5395487546920776;0.5427922606468201;0.5444732308387756;0.5444732308387756;0.5444732308387756;0.5444732308387756;0.5444732308387756;0.5444732308387756;0.5444732308387756;0.5444732308387756;0.5444732308387756;0.5444732308387756;0.5444732308387756;0.5444732308387756;0.5444732308387756;0.5444732308387756;0.5444732308387756;0.5444732308387756;0.5444732308387756;0.5444732308387756;0.5444732308387756;0.5444732308387756;0.5444732308387756;0.5444732308387756;0.5444732308387756;0.5444732308387756;0.5444732308387756;0.5444732308387756;0.5444732308387756;0.5444732308387756;0.5444732308387756;0.5444732308387756;0.5444732308387756;0.5444732308387756;0.5444732308387756;0.5444732308387756;0.5444732308387756;0.5444732308387756;0.5444732308387756;0.5444732308387756;0.5444732308387756;0.5444732308387756;0.5444732308387756;0.5444732308387756;0.5444732308387756;0.5444732308387756
0.5296939611434937;0.5329414010047913;0.5362207889556885;0.5395308136940002;0.5428705811500549;0.5444732308387756;0.5444732308387756;0.5444732308387756;0.5444732308387756;0.5444732308387756;0.5444732308387756;0.5444732308387756;0.5444732308387756;0.5444732308387756;0.5444732308387756;0.5444732308387756;0.5444732308387756;0.5444732308387756;0.5444732308387756;0.5444732308387756;0.5444732308387756;0.5444732308387756;0.5444732308387756;0.5444732308387756;0.5444732308387756;0.5444732308387756;0.5444732308387756;0.5444732308387756;0.5444732308387756;0.5444732308387756;0.5444732308387756;0.5444732308387756;0.5444732308387756;0.5444732308387756;0.5444732308387756;0.5444732308387756;0.5444732308387756;0.5444732308387756;0.5444732308387756;0.5444732308387756;0.5444732308387756;0.5444732308387756;0.5444732308387756;0.5444732308387756;0.5444732308387756;0.5444732308387756;0.5444732308387756;0.5444732308387756;0.5444732308387756;0.5444732308387756
0.5326152443885803;0.5359840393066406;0.5393867492675781;0.542822003364563;0.5444732308387756;0.5444732308387756;0.5444732308387756;0.5444732308387756;0.5444732308387756;0.5444732308387756;0.5444732308387756;0.5444732308387756;0.5444732308387756;0.5444732308387756;0.5444732308387756;0.5444732308387756;0.5444732308387756;0.5444732308387756;0.5444732308387756;0.5444732308387756;0.5444732308387756;0.5444732308387756;0.5444732308387756;0.5444732308387756;0.5444732308387756;0.5444732308387756;0.5444732308387756;0.5444732308387756;0.5444732308387756;0.5444732308387756;0.5444732308387756;0.5444732308387756;0.5444732308387756;0.5444732308387756;0.5444732308387756;0.5444732308387756;0.5444732308387756;0.5444732308387756;0.5444732308387756;0.5444732308387756;0.5444732308387756;0.5444732308387756;0.5444732308387756;0.5444732308387756;0.5444732308387756;0.5444732308387756;0.5444732308387756;0.5444732308387756;0.5444732308387756;0.5444732308387756
0.5356185436248779;0.5391127467155457;0.5426430106163025;0.5444732308387756;0.5444732308387756;0.5444732308387756;0.5444732308387756;0.5444732308387756;0.5444732308387756;0.5444732308387756;0.5444732308387756;0.5444732308387756;0.5444732308387756;0.5444732308387756;0.5444732308387756;0.5444732308387756;0.5444732308387756;0.5444732308387756;0.5444732308387756;0.5444732308387756;0.5444732308387756;0.5444732308387756;0.5444732308387756;0.5444732308387756;0.5444732308387756;0.5444732308387756;0.5444732308387756;0.5444732308387756;0.5444732308387756;0.5444732308387756;0.5444732308387756;0.5444732308387756;0.5444732308387756;0.5444732308387756;0.5444732308387756;0.5444732308387756;0.5444732308387756;0.5444732308387756;0.5444732308387756;0.5444732308387756;0.5444732308387756;0.5444732308387756;0.5444732308387756;0.5444732308387756;0.5444732308387756;0.5444732308387756;0.5444732308387756;0.5444732308387756;0.5444732308387756;0.5444732308387756
