109
E: -854.95172032 | E_rel_metal 0.6832150699999602: | E_rel_global -0.093420930000093: 
Ce  1.884954  3.843916  1.372921
Ce  1.884954  7.726816  1.372921
Ce  1.884954 11.609716  1.372921
Ce  5.767854  3.843916  1.372921
Ce  5.767854  7.726816  1.372921
Ce  5.767854 11.609716  1.372921
Ce  9.650754  3.843916  1.372921
Ce  9.650754  7.726816  1.372921
Ce  9.650754 11.609716  1.372921
Ce  3.826404  1.902466  4.118502
Ce  3.826404  5.785366  4.118502
Ce  3.826404  9.668266  4.118502
Ce  7.709304  1.902466  4.118502
Ce  7.709304  5.785366  4.118502
Ce  7.709304  9.668266  4.118502
Ce 11.592204  1.902466  4.118502
Ce 11.592204  5.785366  4.118502
Ce 11.592204  9.668266  4.118502
Ce  1.893128  3.855413  6.794764
Ce  1.919576  7.750358  6.912325
Ce  1.872147 11.599822  6.894213
Ce  5.755310  3.837037  6.863771
Ce  5.736286  7.762863  6.878091
Ce  5.748509 11.586389  6.916483
Ce  9.663678  3.875219  6.841447
Ce  9.672209  7.754118  6.908007
Ce  9.668536 11.592074  6.851262
Ce  3.595289  1.997236  9.546794
Ce  3.940564  5.668261  9.754860
Ce  3.810783  9.675773  9.699907
Ce  7.830935  1.865112  9.498875
Ce  7.612672  5.832873  9.507324
Ce  7.737070  9.690550  9.693721
Ce 11.472453  2.019854  9.662851
Ce  0.153885  5.686485  9.545963
Ce 11.579304  9.665693  9.670616
 O  1.884954  1.902466  0.000000
 O  1.884954  5.785366  0.000000
 O  1.884954  9.668266  0.000000
 O  5.767854  1.902466  0.000000
 O  5.767854  5.785366  0.000000
 O  5.767854  9.668266  0.000000
 O  9.650754  1.902466  0.000000
 O  9.650754  5.785366  0.000000
 O  9.650754  9.668266  0.000000
 O  3.826404  3.843916  2.745841
 O  1.884954  1.902466  2.745841
 O  3.826404  7.726816  2.745841
 O  1.884954  5.785366  2.745841
 O  3.826404 11.609716  2.745841
 O  1.884954  9.668266  2.745841
 O  7.709304  3.843916  2.745841
 O  5.767854  1.902466  2.745841
 O  7.709304  7.726816  2.745841
 O  5.767854  5.785366  2.745841
 O  7.709304 11.609716  2.745841
 O  5.767854  9.668266  2.745841
 O 11.592204  3.843916  2.745841
 O  9.650754  1.902466  2.745841
 O 11.592204  7.726816  2.745841
 O  9.650754  5.785366  2.745841
 O 11.592204 11.609716  2.745841
 O  9.650754  9.668266  2.745841
 O  1.882442  1.903080  5.438153
 O  1.892574  5.791306  5.441044
 O  1.892177  9.681077  5.420235
 O  5.776668  1.897224  5.551732
 O  5.761691  5.774921  5.447481
 O  5.760156  9.684005  5.429781
 O  9.651440  1.918765  5.441155
 O  9.651456  5.793702  5.524771
 O  9.650929  9.656254  5.430034
 O  3.844584  3.835880  5.472518
 O  3.827188  7.735900  5.539834
 O  3.830014 11.628217  5.567935
 O  7.710794  3.849278  5.534426
 O  7.714364  7.723592  5.563404
 O  7.710464 11.611534  5.549281
 O 11.580549  3.859549  5.464117
 O 11.592688  7.726380  5.572627
 O 11.585515 11.607936  5.557893
 O  1.829308  1.948103  8.136790
 O  1.890800  5.749134  8.132903
 O  1.835884  9.691333  8.056945
 O  5.795984  1.890942  8.455499
 O  5.854439  5.753993  8.102050
 O  5.790198  9.695500  8.065367
 O  9.612797  1.948451  8.095101
 O  9.646514  5.798311  8.387002
 O  9.684160  9.681402  8.063180
 O  3.841442  3.799892  8.189624
 O  3.852505  7.731049  8.393185
 O  3.772375  0.012118  8.414625
 O  7.727287  3.836719  8.410910
 O  7.695264  7.765827  8.416681
 O  7.766198 11.614854  8.385301
 O 11.581350  3.853956  8.178961
 O 11.622676  7.709338  8.447635
 O 11.545158  0.023355  8.487320
 O  1.706436  1.831562 10.849084
 O  1.851113  5.734571 10.919521
 O  1.675310  9.605249 10.767545
 O  3.758568  3.591633 10.973554
 O  6.111142  5.965630 10.827632
 O  5.989068 10.043122 10.751776
 O  9.447923  1.654947 10.737288
 O 11.492087  3.932320 10.885927
 O  9.622392  9.353862 10.729861
Cu  1.804048  3.786101 11.224137