109
E: -855.50290808 | E_rel_metal 1.2708698500000537: | E_rel_global 0.8434213099999397: 
Ce  1.884954  3.843916  1.372921
Ce  1.884954  7.726816  1.372921
Ce  1.884954 11.609716  1.372921
Ce  5.767854  3.843916  1.372921
Ce  5.767854  7.726816  1.372921
Ce  5.767854 11.609716  1.372921
Ce  9.650754  3.843916  1.372921
Ce  9.650754  7.726816  1.372921
Ce  9.650754 11.609716  1.372921
Ce  3.826404  1.902466  4.118502
Ce  3.826404  5.785366  4.118502
Ce  3.826404  9.668266  4.118502
Ce  7.709304  1.902466  4.118502
Ce  7.709304  5.785366  4.118502
Ce  7.709304  9.668266  4.118502
Ce 11.592204  1.902466  4.118502
Ce 11.592204  5.785366  4.118502
Ce 11.592204  9.668266  4.118502
Ce  1.865135  3.876857  6.889290
Ce  1.894842  7.695971  6.961241
Ce  1.863867 11.613548  6.883862
Ce  5.770523  3.843869  6.843037
Ce  5.756794  7.733606  6.871722
Ce  5.763367 11.584609  6.892179
Ce  9.652856  3.839970  6.811627
Ce  9.657371  7.754128  6.848061
Ce  9.671455 11.590932  6.871854
Ce  3.721911  1.991965  9.502938
Ce  4.140624  5.641109  9.698841
Ce  3.820823  9.655050  9.622568
Ce  7.839896  1.909414  9.510597
Ce  7.779168  5.854774  9.610588
Ce  7.713798  9.680168  9.669289
Ce 11.490074  2.042380  9.782491
Ce 11.406246  5.696968  9.572659
Ce 11.580699  9.682445  9.618684
 O  1.884954  1.902466  0.000000
 O  1.884954  5.785366  0.000000
 O  1.884954  9.668266  0.000000
 O  5.767854  1.902466  0.000000
 O  5.767854  5.785366  0.000000
 O  5.767854  9.668266  0.000000
 O  9.650754  1.902466  0.000000
 O  9.650754  5.785366  0.000000
 O  9.650754  9.668266  0.000000
 O  3.826404  3.843916  2.745841
 O  1.884954  1.902466  2.745841
 O  3.826404  7.726816  2.745841
 O  1.884954  5.785366  2.745841
 O  3.826404 11.609716  2.745841
 O  1.884954  9.668266  2.745841
 O  7.709304  3.843916  2.745841
 O  5.767854  1.902466  2.745841
 O  7.709304  7.726816  2.745841
 O  5.767854  5.785366  2.745841
 O  7.709304 11.609716  2.745841
 O  5.767854  9.668266  2.745841
 O 11.592204  3.843916  2.745841
 O  9.650754  1.902466  2.745841
 O 11.592204  7.726816  2.745841
 O  9.650754  5.785366  2.745841
 O 11.592204 11.609716  2.745841
 O  9.650754  9.668266  2.745841
 O  1.874260  1.901667  5.455300
 O  1.889424  5.792052  5.527920
 O  1.887621  9.676799  5.432776
 O  5.778771  1.888378  5.522942
 O  5.763806  5.781874  5.440076
 O  5.762544  9.682651  5.431375
 O  9.652196  1.903847  5.429772
 O  9.646574  5.798107  5.413319
 O  9.650007  9.662719  5.413181
 O  3.831836  3.845523  5.479558
 O  3.823687  7.726773  5.573420
 O  3.830426 11.625458  5.574440
 O  7.699503  3.837570  5.519061
 O  7.699136  7.732212  5.551473
 O  7.711720 11.609295  5.568906
 O 11.594211  3.855594  5.485328
 O 11.606213  7.723195  5.575520
 O 11.585076 11.606891  5.559396
 O  1.895382  1.949055  8.145559
 O  1.833289  5.768045  8.362627
 O  1.889840  9.663854  8.072693
 O  5.795484  1.883613  8.359301
 O  5.828480  5.752380  8.091900
 O  5.750389  9.665200  8.068654
 O  9.586142  1.884169  8.095129
 O  9.633620  5.786750  8.052380
 O  9.672937  9.672981  8.053255
 O  3.861809  3.831576  8.185548
 O  3.854917  7.728256  8.470893
 O  3.796747 11.593823  8.442017
 O  7.741220  3.845080  8.404376
 O  7.715789  7.788899  8.419523
 O  7.715940 11.573058  8.438634
 O 11.499819  3.846219  8.236411
 O 11.573407  7.748442  8.460682
 O 11.599243 11.599603  8.472239
 O  1.967551  1.795504 10.930602
 O  0.227419  4.140886 11.113633
 O  1.893774  9.514837 10.689780
 O  4.144055  3.524910 11.001526
 O  6.105376  6.087095 10.798173
 O  5.772097  9.945767 10.682359
 O  9.344243  1.942354 10.831652
 O  9.643599  6.105498 10.697841
 O  9.633152  9.781697 10.691913
Pd  2.123079  3.716200 11.340542