109
E: -857.42026612 | E_rel_metal 0.20574945999999272: | E_rel_global -0.8793067299999393: 
Ce  1.884954  3.843916  1.372921
Ce  1.884954  7.726816  1.372921
Ce  1.884954 11.609716  1.372921
Ce  5.767854  3.843916  1.372921
Ce  5.767854  7.726816  1.372921
Ce  5.767854 11.609716  1.372921
Ce  9.650754  3.843916  1.372921
Ce  9.650754  7.726816  1.372921
Ce  9.650754 11.609716  1.372921
Ce  3.826404  1.902466  4.118502
Ce  3.826404  5.785366  4.118502
Ce  3.826404  9.668266  4.118502
Ce  7.709304  1.902466  4.118502
Ce  7.709304  5.785366  4.118502
Ce  7.709304  9.668266  4.118502
Ce 11.592204  1.902466  4.118502
Ce 11.592204  5.785366  4.118502
Ce 11.592204  9.668266  4.118502
Ce  1.895843  3.827978  6.813696
Ce  1.902380  7.748381  6.894602
Ce  1.892056 11.601419  6.907037
Ce  5.752408  3.807302  6.856338
Ce  5.744202  7.754195  6.866984
Ce  5.737511 11.576112  6.919272
Ce  9.661077  3.871005  6.839914
Ce  9.666108  7.752312  6.906894
Ce  9.676609 11.591061  6.850985
Ce  3.625950  1.978892  9.622808
Ce  3.878319  5.651767  9.678688
Ce  3.818394  9.684469  9.696415
Ce  7.850538  1.855010  9.490395
Ce  7.554040  5.829323  9.502252
Ce  7.733428  9.697682  9.692123
Ce 11.511924  2.069681  9.686571
Ce  0.123976  5.718873  9.517007
Ce 11.582864  9.696176  9.666402
 O  1.884954  1.902466  0.000000
 O  1.884954  5.785366  0.000000
 O  1.884954  9.668266  0.000000
 O  5.767854  1.902466  0.000000
 O  5.767854  5.785366  0.000000
 O  5.767854  9.668266  0.000000
 O  9.650754  1.902466  0.000000
 O  9.650754  5.785366  0.000000
 O  9.650754  9.668266  0.000000
 O  3.826404  3.843916  2.745841
 O  1.884954  1.902466  2.745841
 O  3.826404  7.726816  2.745841
 O  1.884954  5.785366  2.745841
 O  3.826404 11.609716  2.745841
 O  1.884954  9.668266  2.745841
 O  7.709304  3.843916  2.745841
 O  5.767854  1.902466  2.745841
 O  7.709304  7.726816  2.745841
 O  5.767854  5.785366  2.745841
 O  7.709304 11.609716  2.745841
 O  5.767854  9.668266  2.745841
 O 11.592204  3.843916  2.745841
 O  9.650754  1.902466  2.745841
 O 11.592204  7.726816  2.745841
 O  9.650754  5.785366  2.745841
 O 11.592204 11.609716  2.745841
 O  9.650754  9.668266  2.745841
 O  1.886423  1.900525  5.442454
 O  1.890577  5.785182  5.442581
 O  1.890905  9.668256  5.420189
 O  5.776346  1.889804  5.534888
 O  5.767024  5.772340  5.446278
 O  5.761320  9.672629  5.433801
 O  9.652432  1.918375  5.440270
 O  9.648310  5.792618  5.525418
 O  9.652776  9.653737  5.429185
 O  3.845195  3.829001  5.475942
 O  3.828915  7.729001  5.562410
 O  3.833186 11.614370  5.530592
 O  7.711883  3.845658  5.538837
 O  7.711840  7.723849  5.566727
 O  7.715755 11.608831  5.546395
 O 11.578708  3.853968  5.467855
 O 11.590013  7.720623  5.569841
 O 11.589165 11.605677  5.559520
 O  1.811314  1.929076  8.147898
 O  1.901366  5.752218  8.130352
 O  1.844386  9.662132  8.056860
 O  5.850864  1.874109  8.390511
 O  5.819436  5.741423  8.100559
 O  5.785530  9.646847  8.067901
 O  9.617302  1.949661  8.092685
 O  9.617862  5.805978  8.403117
 O  9.684521  9.665414  8.058163
 O  3.856684  3.844304  8.190781
 O  3.839637  7.655043  8.484027
 O  3.796933 11.591131  8.330732
 O  7.716427  3.850652  8.432974
 O  7.683779  7.744092  8.430202
 O  7.788606 11.591706  8.382884
 O 11.567554  3.871222  8.175063
 O 11.618094  7.715055  8.433246
 O 11.540361  0.021362  8.511385
 O  1.654482  2.073300 10.959366
 O  1.920792  5.837194 10.861830
 O  1.682114  9.768487 10.765563
 O  3.677154  3.890595 10.995188
 O  5.942673  6.010358 10.748622
 O  5.996346 10.164058 10.734644
 O  9.463639  1.768374 10.748937
 O 11.575298  4.043773 10.918201
 O  9.619503  9.427320 10.735299
Ni  1.805344  3.952095 11.069363