109
E: -853.55625787 | E_rel_metal 1.0752111000000468: | E_rel_global 0.7951015200000029: 
Ce  1.884954  3.843916  1.372921
Ce  1.884954  7.726816  1.372921
Ce  1.884954 11.609716  1.372921
Ce  5.767854  3.843916  1.372921
Ce  5.767854  7.726816  1.372921
Ce  5.767854 11.609716  1.372921
Ce  9.650754  3.843916  1.372921
Ce  9.650754  7.726816  1.372921
Ce  9.650754 11.609716  1.372921
Ce  3.826404  1.902466  4.118502
Ce  3.826404  5.785366  4.118502
Ce  3.826404  9.668266  4.118502
Ce  7.709304  1.902466  4.118502
Ce  7.709304  5.785366  4.118502
Ce  7.709304  9.668266  4.118502
Ce 11.592204  1.902466  4.118502
Ce 11.592204  5.785366  4.118502
Ce 11.592204  9.668266  4.118502
Ce  1.878404  3.839575  6.805969
Ce  1.907457  7.753459  6.871203
Ce  1.855025 11.605604  6.898484
Ce  5.757715  3.825368  6.825857
Ce  5.760475  7.775106  6.871839
Ce  5.756685 11.569241  6.909492
Ce  9.673255  3.850512  6.852964
Ce  9.659057  7.772265  6.900218
Ce  9.672242 11.583866  6.868163
Ce  3.655176  1.994862  9.510024
Ce  3.984451  5.727283  9.652300
Ce  3.805566  9.721655  9.712473
Ce  7.823083  1.876680  9.497161
Ce  7.580173  5.825789  9.498013
Ce  7.686263  9.699435  9.764936
Ce 11.458504  2.000605  9.764085
Ce  0.135056  5.736561  9.499856
Ce 11.611434  9.685690  9.658178
 O  1.884954  1.902466  0.000000
 O  1.884954  5.785366  0.000000
 O  1.884954  9.668266  0.000000
 O  5.767854  1.902466  0.000000
 O  5.767854  5.785366  0.000000
 O  5.767854  9.668266  0.000000
 O  9.650754  1.902466  0.000000
 O  9.650754  5.785366  0.000000
 O  9.650754  9.668266  0.000000
 O  3.826404  3.843916  2.745841
 O  1.884954  1.902466  2.745841
 O  3.826404  7.726816  2.745841
 O  1.884954  5.785366  2.745841
 O  3.826404 11.609716  2.745841
 O  1.884954  9.668266  2.745841
 O  7.709304  3.843916  2.745841
 O  5.767854  1.902466  2.745841
 O  7.709304  7.726816  2.745841
 O  5.767854  5.785366  2.745841
 O  7.709304 11.609716  2.745841
 O  5.767854  9.668266  2.745841
 O 11.592204  3.843916  2.745841
 O  9.650754  1.902466  2.745841
 O 11.592204  7.726816  2.745841
 O  9.650754  5.785366  2.745841
 O 11.592204 11.609716  2.745841
 O  9.650754  9.668266  2.745841
 O  1.870077  1.899072  5.457558
 O  1.877109  5.774317  5.457825
 O  1.877888  9.686889  5.429018
 O  5.776235  1.897138  5.541810
 O  5.766745  5.700901  5.419582
 O  5.776143  9.745902  5.400895
 O  9.662087  1.923043  5.448064
 O  9.673265  5.768227  5.562298
 O  9.666706  9.669761  5.430390
 O  3.822645  3.813752  5.487056
 O  3.772898  7.730568  5.522811
 O  3.813380 11.634265  5.582504
 O  7.724165  3.833193  5.543089
 O  7.788105  7.715022  5.514709
 O  7.727715 11.626168  5.561013
 O 11.587894  3.843716  5.480388
 O 11.601372  7.727011  5.569148
 O 11.586966 11.612380  5.549300
 O  1.879048  1.957101  8.174564
 O  1.930198  5.758619  8.163656
 O  1.910667  9.659758  8.059593
 O  5.747240  1.907938  8.451295
 O  5.792221  5.691976  8.154537
 O  5.702920  9.770165  8.124985
 O  9.602455  1.945330  8.116746
 O  9.657499  5.804253  8.476430
 O  9.684826  9.659503  8.054444
 O  3.824854  3.848757  8.219551
 O  3.821114  7.688788  8.604030
 O  3.739488  0.021823  8.458050
 O  7.716504  3.856763  8.391770
 O  7.714259  7.728434  8.468801
 O  7.747981 11.620842  8.399405
 O 11.598590  3.893768  8.229397
 O  0.005633  7.700909  8.426879
 O 11.575494 11.622941  8.442856
 O  1.926841  1.919790 11.027229
 O  2.042636  5.949840 10.934122
 O  1.858946  9.803028 10.736354
 O  3.971913  3.759952 10.983267
 O  5.957797  6.064483 10.761147
 O  5.562044 10.045041 10.812018
 O  9.315868  1.757576 10.841516
 O 11.603380  4.132941 11.063671
 O  9.847621  9.429245 10.758594
Au  1.965677  3.935518 11.213187