109
E: -855.39183385 | E_rel_metal 1.3819440800000393: | E_rel_global 0.9544955399999253: 
Ce  1.884954  3.843916  1.372921
Ce  1.884954  7.726816  1.372921
Ce  1.884954 11.609716  1.372921
Ce  5.767854  3.843916  1.372921
Ce  5.767854  7.726816  1.372921
Ce  5.767854 11.609716  1.372921
Ce  9.650754  3.843916  1.372921
Ce  9.650754  7.726816  1.372921
Ce  9.650754 11.609716  1.372921
Ce  3.826404  1.902466  4.118502
Ce  3.826404  5.785366  4.118502
Ce  3.826404  9.668266  4.118502
Ce  7.709304  1.902466  4.118502
Ce  7.709304  5.785366  4.118502
Ce  7.709304  9.668266  4.118502
Ce 11.592204  1.902466  4.118502
Ce 11.592204  5.785366  4.118502
Ce 11.592204  9.668266  4.118502
Ce  1.858632  3.890291  6.875845
Ce  1.881392  7.696243  6.962519
Ce  1.875732 11.609035  6.874769
Ce  5.777295  3.820225  6.838530
Ce  5.758114  7.744223  6.860336
Ce  5.758272 11.588176  6.912871
Ce  9.664316  3.874262  6.830311
Ce  9.665256  7.742137  6.871001
Ce  9.670811 11.590996  6.855993
Ce  3.670041  1.982989  9.528329
Ce  4.029216  5.621458  9.600841
Ce  3.849764  9.644204  9.645813
Ce  7.887589  1.884243  9.504292
Ce  7.660184  5.861887  9.617195
Ce  7.754627  9.674064  9.677947
Ce 11.543900  2.030886  9.722652
Ce 11.336717  5.686878  9.714982
Ce 11.616663  9.674180  9.613358
 O  1.884954  1.902466  0.000000
 O  1.884954  5.785366  0.000000
 O  1.884954  9.668266  0.000000
 O  5.767854  1.902466  0.000000
 O  5.767854  5.785366  0.000000
 O  5.767854  9.668266  0.000000
 O  9.650754  1.902466  0.000000
 O  9.650754  5.785366  0.000000
 O  9.650754  9.668266  0.000000
 O  3.826404  3.843916  2.745841
 O  1.884954  1.902466  2.745841
 O  3.826404  7.726816  2.745841
 O  1.884954  5.785366  2.745841
 O  3.826404 11.609716  2.745841
 O  1.884954  9.668266  2.745841
 O  7.709304  3.843916  2.745841
 O  5.767854  1.902466  2.745841
 O  7.709304  7.726816  2.745841
 O  5.767854  5.785366  2.745841
 O  7.709304 11.609716  2.745841
 O  5.767854  9.668266  2.745841
 O 11.592204  3.843916  2.745841
 O  9.650754  1.902466  2.745841
 O 11.592204  7.726816  2.745841
 O  9.650754  5.785366  2.745841
 O 11.592204 11.609716  2.745841
 O  9.650754  9.668266  2.745841
 O  1.877337  1.901355  5.445925
 O  1.886527  5.795356  5.507468
 O  1.891074  9.678977  5.432533
 O  5.777166  1.887181  5.532084
 O  5.767867  5.776504  5.444587
 O  5.764147  9.679391  5.436584
 O  9.652780  1.903888  5.429417
 O  9.651059  5.801768  5.418572
 O  9.649489  9.665570  5.414951
 O  3.837369  3.841478  5.475126
 O  3.825478  7.728158  5.574712
 O  3.831810 11.624813  5.577855
 O  7.703885  3.837313  5.527091
 O  7.698954  7.728774  5.552566
 O  7.707520 11.611710  5.574033
 O 11.592948  3.863261  5.485841
 O 11.605871  7.727171  5.570596
 O 11.588797 11.604339  5.561459
 O  1.879177  1.954318  8.120271
 O  1.939134  5.767055  8.314775
 O  1.896780  9.678233  8.076066
 O  5.802821  1.863845  8.396842
 O  5.782009  5.732221  8.088019
 O  5.734794  9.673613  8.076388
 O  9.610643  1.909265  8.087865
 O  9.582367  5.800034  8.079603
 O  9.668474  9.685274  8.057734
 O  3.868030  3.812340  8.168998
 O  3.869004  7.712047  8.483597
 O  3.795267 11.595705  8.451476
 O  7.722125  3.831208  8.446652
 O  7.681987  7.798392  8.414229
 O  7.741480 11.578690  8.435423
 O 11.514697  3.824272  8.238747
 O 11.589330  7.770086  8.437374
 O 11.597341 11.637298  8.486457
 O  1.874471  1.576346 10.791427
 O  0.008426  3.785060 11.072004
 O  1.941799  9.436455 10.686431
 O  4.047799  3.695903 10.892583
 O  5.741947  6.194343 10.696114
 O  5.832645  9.954577 10.690081
 O  9.500053  1.673788 10.737574
 O  9.295702  6.001404 10.812648
 O  9.692829  9.652958 10.694929
Pd  2.007583  3.695278 11.225946