109
E: -855.43968824 | E_rel_metal 1.3340896900000416: | E_rel_global 0.9066411499999276: 
Ce  1.884954  3.843916  1.372921
Ce  1.884954  7.726816  1.372921
Ce  1.884954 11.609716  1.372921
Ce  5.767854  3.843916  1.372921
Ce  5.767854  7.726816  1.372921
Ce  5.767854 11.609716  1.372921
Ce  9.650754  3.843916  1.372921
Ce  9.650754  7.726816  1.372921
Ce  9.650754 11.609716  1.372921
Ce  3.826404  1.902466  4.118502
Ce  3.826404  5.785366  4.118502
Ce  3.826404  9.668266  4.118502
Ce  7.709304  1.902466  4.118502
Ce  7.709304  5.785366  4.118502
Ce  7.709304  9.668266  4.118502
Ce 11.592204  1.902466  4.118502
Ce 11.592204  5.785366  4.118502
Ce 11.592204  9.668266  4.118502
Ce  1.871708  3.881953  6.871876
Ce  1.897639  7.719029  6.978531
Ce  1.873674 11.598909  6.886850
Ce  5.773093  3.841163  6.843736
Ce  5.749944  7.747784  6.882692
Ce  5.759105 11.571250  6.903127
Ce  9.648038  3.852011  6.789667
Ce  9.658033  7.760136  6.859416
Ce  9.667168 11.577773  6.856506
Ce  3.715176  1.980446  9.496206
Ce  4.121393  5.650866  9.662080
Ce  3.813976  9.658992  9.703750
Ce  7.876991  1.881906  9.494679
Ce  7.764614  5.861484  9.609474
Ce  7.730873  9.704009  9.697963
Ce 11.495126  2.024536  9.659242
Ce 11.393433  5.691221  9.560805
Ce 11.558419  9.661468  9.679436
 O  1.884954  1.902466  0.000000
 O  1.884954  5.785366  0.000000
 O  1.884954  9.668266  0.000000
 O  5.767854  1.902466  0.000000
 O  5.767854  5.785366  0.000000
 O  5.767854  9.668266  0.000000
 O  9.650754  1.902466  0.000000
 O  9.650754  5.785366  0.000000
 O  9.650754  9.668266  0.000000
 O  3.826404  3.843916  2.745841
 O  1.884954  1.902466  2.745841
 O  3.826404  7.726816  2.745841
 O  1.884954  5.785366  2.745841
 O  3.826404 11.609716  2.745841
 O  1.884954  9.668266  2.745841
 O  7.709304  3.843916  2.745841
 O  5.767854  1.902466  2.745841
 O  7.709304  7.726816  2.745841
 O  5.767854  5.785366  2.745841
 O  7.709304 11.609716  2.745841
 O  5.767854  9.668266  2.745841
 O 11.592204  3.843916  2.745841
 O  9.650754  1.902466  2.745841
 O 11.592204  7.726816  2.745841
 O  9.650754  5.785366  2.745841
 O 11.592204 11.609716  2.745841
 O  9.650754  9.668266  2.745841
 O  1.873329  1.920680  5.460803
 O  1.887636  5.787658  5.541372
 O  1.892158  9.677618  5.434779
 O  5.778535  1.894199  5.540673
 O  5.766296  5.771066  5.444709
 O  5.756753  9.684649  5.426842
 O  9.649606  1.904364  5.429573
 O  9.645517  5.795145  5.414986
 O  9.651071  9.665819  5.412436
 O  3.834679  3.846842  5.482241
 O  3.821877  7.723962  5.561904
 O  3.825932 11.632274  5.560627
 O  7.701882  3.838397  5.522994
 O  7.699157  7.734697  5.550490
 O  7.709781 11.607409  5.553176
 O 11.589197  3.859570  5.485167
 O 11.605088  7.727167  5.569230
 O 11.588210 11.608470  5.563353
 O  1.854434  1.969919  8.166332
 O  1.819653  5.737925  8.403568
 O  1.847763  9.684579  8.068768
 O  5.811906  1.887643  8.418812
 O  5.839682  5.733787  8.096608
 O  5.776546  9.676962  8.058644
 O  9.624699  1.910736  8.088120
 O  9.638878  5.766696  8.057215
 O  9.684662  9.682690  8.050089
 O  3.861395  3.809855  8.184081
 O  3.852382  7.692147  8.417750
 O  3.784614  0.002735  8.406608
 O  7.755368  3.826261  8.440375
 O  7.719390  7.769314  8.420277
 O  7.758134 11.615256  8.387586
 O 11.499722  3.820062  8.229316
 O 11.550329  7.709050  8.443552
 O 11.584600  0.028398  8.513695
 O  1.827917  1.717084 10.864877
 O  0.083634  3.923136 11.020410
 O  1.674689  9.398319 10.766593
 O  4.022125  3.527232 11.027837
 O  6.072125  6.082586 10.788139
 O  5.972481 10.113400 10.734470
 O  9.525164  1.808682 10.735608
 O  9.649809  6.066558 10.705696
 O  9.628510  9.762595 10.737692
Pd  2.013379  3.632670 11.296158