109
E: -854.76263366 | E_rel_metal 0.8723017300000038: | E_rel_global 0.0956657299999506: 
Ce  1.884954  3.843916  1.372921
Ce  1.884954  7.726816  1.372921
Ce  1.884954 11.609716  1.372921
Ce  5.767854  3.843916  1.372921
Ce  5.767854  7.726816  1.372921
Ce  5.767854 11.609716  1.372921
Ce  9.650754  3.843916  1.372921
Ce  9.650754  7.726816  1.372921
Ce  9.650754 11.609716  1.372921
Ce  3.826404  1.902466  4.118502
Ce  3.826404  5.785366  4.118502
Ce  3.826404  9.668266  4.118502
Ce  7.709304  1.902466  4.118502
Ce  7.709304  5.785366  4.118502
Ce  7.709304  9.668266  4.118502
Ce 11.592204  1.902466  4.118502
Ce 11.592204  5.785366  4.118502
Ce 11.592204  9.668266  4.118502
Ce  1.908390  3.838107  6.835218
Ce  1.909441  7.727382  6.889554
Ce  1.881828 11.625595  6.891083
Ce  5.737381  3.829200  6.887422
Ce  5.748590  7.738464  6.861628
Ce  5.747244 11.599343  6.902804
Ce  9.667321  3.872682  6.836203
Ce  9.671404  7.750051  6.902116
Ce  9.673396 11.591084  6.854378
Ce  3.591230  1.978250  9.672044
Ce  3.925146  5.650779  9.830319
Ce  3.826326  9.669783  9.577803
Ce  7.827046  1.865297  9.493788
Ce  7.619763  5.817823  9.513905
Ce  7.724944  9.670327  9.668794
Ce 11.460337  2.049834  9.701284
Ce  0.132974  5.702274  9.548091
Ce 11.617888  9.682513  9.630059
 O  1.884954  1.902466  0.000000
 O  1.884954  5.785366  0.000000
 O  1.884954  9.668266  0.000000
 O  5.767854  1.902466  0.000000
 O  5.767854  5.785366  0.000000
 O  5.767854  9.668266  0.000000
 O  9.650754  1.902466  0.000000
 O  9.650754  5.785366  0.000000
 O  9.650754  9.668266  0.000000
 O  3.826404  3.843916  2.745841
 O  1.884954  1.902466  2.745841
 O  3.826404  7.726816  2.745841
 O  1.884954  5.785366  2.745841
 O  3.826404 11.609716  2.745841
 O  1.884954  9.668266  2.745841
 O  7.709304  3.843916  2.745841
 O  5.767854  1.902466  2.745841
 O  7.709304  7.726816  2.745841
 O  5.767854  5.785366  2.745841
 O  7.709304 11.609716  2.745841
 O  5.767854  9.668266  2.745841
 O 11.592204  3.843916  2.745841
 O  9.650754  1.902466  2.745841
 O 11.592204  7.726816  2.745841
 O  9.650754  5.785366  2.745841
 O 11.592204 11.609716  2.745841
 O  9.650754  9.668266  2.745841
 O  1.886727  1.898732  5.441183
 O  1.893624  5.792956  5.440222
 O  1.891431  9.674635  5.421384
 O  5.777066  1.893393  5.538343
 O  5.761186  5.782245  5.447767
 O  5.762617  9.680183  5.429360
 O  9.654452  1.911517  5.435393
 O  9.648188  5.799307  5.517698
 O  9.652009  9.656107  5.428295
 O  3.845427  3.833922  5.477007
 O  3.829836  7.730133  5.551561
 O  3.832194 11.624511  5.546648
 O  7.710722  3.848344  5.535786
 O  7.714295  7.725551  5.567799
 O  7.716513 11.611904  5.563594
 O 11.581404  3.858276  5.464952
 O 11.592544  7.724175  5.573325
 O 11.587222 11.607939  5.563490
 O  1.804158  1.917847  8.145794
 O  1.885032  5.766804  8.128670
 O  1.840030  9.681317  8.054060
 O  5.845354  1.856282  8.395679
 O  5.861920  5.775496  8.113922
 O  5.795297  9.670572  8.062570
 O  9.604586  1.939439  8.088547
 O  9.637900  5.814137  8.361013
 O  9.688522  9.672185  8.061588
 O  3.853946  3.821731  8.200207
 O  3.846331  7.772841  8.416012
 O  3.805606 11.549689  8.366726
 O  7.727759  3.838969  8.412109
 O  7.708967  7.779304  8.432759
 O  7.774589 11.569430  8.427778
 O 11.577132  3.860249  8.180075
 O 11.621823  7.748667  8.454117
 O 11.539514 11.629757  8.510991
 O  1.551175  1.902121 10.954887
 O  1.787988  5.843882 10.925999
 O  1.915286  9.688824 10.671912
 O  3.647979  3.742769 11.098859
 O  6.150286  5.914506 10.857087
 O  5.803355  9.926025 10.675638
 O  9.418783  1.649225 10.749481
 O 11.401829  4.005740 10.893704
 O  9.640567  9.406778 10.693705
Cu  1.721793  3.869057 11.277470