109
E: -858.51469209 | E_rel_metal 0.03884090999997625: | E_rel_global -0.11518270000010489: 
Ce  1.884954  3.843916  1.372921
Ce  1.884954  7.726816  1.372921
Ce  1.884954 11.609716  1.372921
Ce  5.767854  3.843916  1.372921
Ce  5.767854  7.726816  1.372921
Ce  5.767854 11.609716  1.372921
Ce  9.650754  3.843916  1.372921
Ce  9.650754  7.726816  1.372921
Ce  9.650754 11.609716  1.372921
Ce  3.826404  1.902466  4.118502
Ce  3.826404  5.785366  4.118502
Ce  3.826404  9.668266  4.118502
Ce  7.709304  1.902466  4.118502
Ce  7.709304  5.785366  4.118502
Ce  7.709304  9.668266  4.118502
Ce 11.592204  1.902466  4.118502
Ce 11.592204  5.785366  4.118502
Ce 11.592204  9.668266  4.118502
Ce  1.882114  3.850220  6.798009
Ce  1.899238  7.741210  6.899090
Ce  1.862236 11.600273  6.897364
Ce  5.763042  3.801404  6.845110
Ce  5.747172  7.768249  6.860350
Ce  5.755578 11.594651  6.929407
Ce  9.655076  3.860973  6.848531
Ce  9.668205  7.770075  6.905585
Ce  9.655680 11.598049  6.878788
Ce  3.668100  2.020374  9.501596
Ce  3.965337  5.654667  9.679656
Ce  3.787453  9.682470  9.686206
Ce  7.868620  1.857433  9.592772
Ce  7.580397  5.827878  9.462279
Ce  7.695170  9.674640  9.731887
Ce 11.484843  2.018567  9.688172
Ce  0.137668  5.689565  9.521729
Ce 11.588353  9.667455  9.677090
 O  1.884954  1.902466  0.000000
 O  1.884954  5.785366  0.000000
 O  1.884954  9.668266  0.000000
 O  5.767854  1.902466  0.000000
 O  5.767854  5.785366  0.000000
 O  5.767854  9.668266  0.000000
 O  9.650754  1.902466  0.000000
 O  9.650754  5.785366  0.000000
 O  9.650754  9.668266  0.000000
 O  3.826404  3.843916  2.745841
 O  1.884954  1.902466  2.745841
 O  3.826404  7.726816  2.745841
 O  1.884954  5.785366  2.745841
 O  3.826404 11.609716  2.745841
 O  1.884954  9.668266  2.745841
 O  7.709304  3.843916  2.745841
 O  5.767854  1.902466  2.745841
 O  7.709304  7.726816  2.745841
 O  5.767854  5.785366  2.745841
 O  7.709304 11.609716  2.745841
 O  5.767854  9.668266  2.745841
 O 11.592204  3.843916  2.745841
 O  9.650754  1.902466  2.745841
 O 11.592204  7.726816  2.745841
 O  9.650754  5.785366  2.745841
 O 11.592204 11.609716  2.745841
 O  9.650754  9.668266  2.745841
 O  1.872338  1.907361  5.439351
 O  1.890691  5.792569  5.444036
 O  1.888726  9.675380  5.421654
 O  5.783247  1.890220  5.511357
 O  5.763465  5.778931  5.443891
 O  5.760294  9.679465  5.427052
 O  9.648328  1.918818  5.446808
 O  9.646597  5.800211  5.530913
 O  9.649977  9.654311  5.430266
 O  3.839425  3.830214  5.469330
 O  3.825578  7.734819  5.573123
 O  3.822792 11.627377  5.579918
 O  7.707895  3.843647  5.526815
 O  7.705662  7.727374  5.558995
 O  7.709057 11.607463  5.549415
 O 11.577364  3.861694  5.462922
 O 11.597428  7.727199  5.570628
 O 11.583460 11.606453  5.557506
 O  1.875563  1.946663  8.129513
 O  1.917049  5.760538  8.142899
 O  1.885381  9.657402  8.062333
 O  5.697403  1.896930  8.340411
 O  5.796319  5.748312  8.096328
 O  5.699653  9.663157  8.061413
 O  9.646610  1.973435  8.109767
 O  9.643171  5.796823  8.415087
 O  9.693567  9.673840  8.058582
 O  3.835717  3.866184  8.179361
 O  3.848720  7.671074  8.535766
 O  3.747411 11.628702  8.453094
 O  7.689926  3.864018  8.396039
 O  7.674731  7.735606  8.383762
 O  7.722278 11.602904  8.376921
 O 11.587565  3.878257  8.174411
 O 11.644906  7.699863  8.427497
 O 11.582115  0.000722  8.460403
 O  1.820649  1.934492 10.896286
 O  2.032112  5.839922 10.897061
 O  1.850125  9.683778 10.736601
 O  4.024290  3.707573 10.920223
 O  5.979118  6.044345 10.736254
 O  5.561837 10.036886 10.753635
 O  9.760865  1.496973 10.773160
 O 11.573038  4.041843 10.937614
 O  9.819825  9.252925 10.734461
Rh  1.975442  3.879628 11.122164