109
E: -857.28945004 | E_rel_metal 0.2790461700000151: | E_rel_global -0.06393065000008846: 
Ce  1.884954  3.843916  1.372921
Ce  1.884954  7.726816  1.372921
Ce  1.884954 11.609716  1.372921
Ce  5.767854  3.843916  1.372921
Ce  5.767854  7.726816  1.372921
Ce  5.767854 11.609716  1.372921
Ce  9.650754  3.843916  1.372921
Ce  9.650754  7.726816  1.372921
Ce  9.650754 11.609716  1.372921
Ce  3.826404  1.902466  4.118502
Ce  3.826404  5.785366  4.118502
Ce  3.826404  9.668266  4.118502
Ce  7.709304  1.902466  4.118502
Ce  7.709304  5.785366  4.118502
Ce  7.709304  9.668266  4.118502
Ce 11.592204  1.902466  4.118502
Ce 11.592204  5.785366  4.118502
Ce 11.592204  9.668266  4.118502
Ce  1.875971  3.863972  6.831342
Ce  1.889187  7.729763  6.904634
Ce  1.871490 11.604132  6.881936
Ce  5.756395  3.820321  6.835966
Ce  5.748531  7.765164  6.865121
Ce  5.754985 11.573794  6.914840
Ce  9.676353  3.884543  6.856001
Ce  9.675751  7.763859  6.914403
Ce  9.664118 11.586158  6.861941
Ce  3.656190  1.964455  9.516377
Ce  3.933198  5.642142  9.690543
Ce  3.787982  9.673482  9.679320
Ce  7.858353  1.863775  9.485145
Ce  7.578504  5.848296  9.471315
Ce  7.700994  9.664453  9.760880
Ce 11.524996  2.034813  9.693931
Ce  0.143919  5.734262  9.638597
Ce 11.601881  9.652334  9.646199
 O  1.884954  1.902466  0.000000
 O  1.884954  5.785366  0.000000
 O  1.884954  9.668266  0.000000
 O  5.767854  1.902466  0.000000
 O  5.767854  5.785366  0.000000
 O  5.767854  9.668266  0.000000
 O  9.650754  1.902466  0.000000
 O  9.650754  5.785366  0.000000
 O  9.650754  9.668266  0.000000
 O  3.826404  3.843916  2.745841
 O  1.884954  1.902466  2.745841
 O  3.826404  7.726816  2.745841
 O  1.884954  5.785366  2.745841
 O  3.826404 11.609716  2.745841
 O  1.884954  9.668266  2.745841
 O  7.709304  3.843916  2.745841
 O  5.767854  1.902466  2.745841
 O  7.709304  7.726816  2.745841
 O  5.767854  5.785366  2.745841
 O  7.709304 11.609716  2.745841
 O  5.767854  9.668266  2.745841
 O 11.592204  3.843916  2.745841
 O  9.650754  1.902466  2.745841
 O 11.592204  7.726816  2.745841
 O  9.650754  5.785366  2.745841
 O 11.592204 11.609716  2.745841
 O  9.650754  9.668266  2.745841
 O  1.879308  1.901799  5.444118
 O  1.887272  5.786569  5.448530
 O  1.889011  9.679151  5.423249
 O  5.777217  1.892907  5.538985
 O  5.762243  5.775423  5.444409
 O  5.762912  9.682322  5.431004
 O  9.649989  1.918654  5.442376
 O  9.650995  5.798755  5.520646
 O  9.651413  9.657708  5.425148
 O  3.840433  3.835225  5.473681
 O  3.828913  7.735006  5.572254
 O  3.830661 11.618815  5.557153
 O  7.709803  3.848696  5.536146
 O  7.700280  7.725591  5.552952
 O  7.709513 11.607611  5.555100
 O 11.581238  3.858977  5.473463
 O 11.599296  7.723413  5.546496
 O 11.585588 11.606898  5.560498
 O  1.859171  1.938104  8.135041
 O  1.961554  5.760777  8.153903
 O  1.897901  9.680546  8.061784
 O  5.790320  1.879941  8.416027
 O  5.800581  5.740984  8.093255
 O  5.716062  9.670630  8.065265
 O  9.614485  1.944269  8.096949
 O  9.583938  5.818334  8.376163
 O  9.675951  9.694696  8.059133
 O  3.857505  3.815009  8.186481
 O  3.864738  7.680002  8.537918
 O  3.778642 11.629667  8.403333
 O  7.705848  3.841759  8.416567
 O  7.664695  7.754850  8.382430
 O  7.734215 11.613499  8.398756
 O 11.562530  3.850463  8.207145
 O 11.631899  7.754908  8.348164
 O 11.571497  0.020301  8.506043
 O  1.835876  1.719569 10.891302
 O  2.141770  5.790139 11.008680
 O  1.854013  9.609787 10.725672
 O  4.025489  3.642573 10.932148
 O  5.972109  6.038577 10.732626
 O  5.565217 10.043230 10.745793
 O  9.469969  1.665197 10.736157
 O 11.599995  3.826227 11.053720
 O  9.821326  9.237706 10.723265
Pt  1.978925  3.758076 11.071047