109
E: -856.23205558 | E_rel_metal 0.5417223500001: | E_rel_global 0.11427380999998604: 
Ce  1.884954  3.843916  1.372921
Ce  1.884954  7.726816  1.372921
Ce  1.884954 11.609716  1.372921
Ce  5.767854  3.843916  1.372921
Ce  5.767854  7.726816  1.372921
Ce  5.767854 11.609716  1.372921
Ce  9.650754  3.843916  1.372921
Ce  9.650754  7.726816  1.372921
Ce  9.650754 11.609716  1.372921
Ce  3.826404  1.902466  4.118502
Ce  3.826404  5.785366  4.118502
Ce  3.826404  9.668266  4.118502
Ce  7.709304  1.902466  4.118502
Ce  7.709304  5.785366  4.118502
Ce  7.709304  9.668266  4.118502
Ce 11.592204  1.902466  4.118502
Ce 11.592204  5.785366  4.118502
Ce 11.592204  9.668266  4.118502
Ce  1.892576  3.822238  6.844041
Ce  1.904302  7.733574  6.873353
Ce  1.875171 11.629549  6.903827
Ce  5.743280  3.812617  6.864430
Ce  5.752570  7.747111  6.851533
Ce  5.744438 11.597446  6.904695
Ce  9.673321  3.858534  6.861824
Ce  9.667726  7.748453  6.896943
Ce  9.675282 11.601687  6.864766
Ce  3.602764  1.987465  9.674371
Ce  3.918865  5.678629  9.700095
Ce  3.829811  9.692750  9.609664
Ce  7.796582  1.871371  9.505047
Ce  7.580260  5.837509  9.501625
Ce  7.714147  9.680918  9.672033
Ce 11.467553  2.067216  9.823756
Ce  0.152908  5.730511  9.538250
Ce 11.619553  9.703018  9.607034
 O  1.884954  1.902466  0.000000
 O  1.884954  5.785366  0.000000
 O  1.884954  9.668266  0.000000
 O  5.767854  1.902466  0.000000
 O  5.767854  5.785366  0.000000
 O  5.767854  9.668266  0.000000
 O  9.650754  1.902466  0.000000
 O  9.650754  5.785366  0.000000
 O  9.650754  9.668266  0.000000
 O  3.826404  3.843916  2.745841
 O  1.884954  1.902466  2.745841
 O  3.826404  7.726816  2.745841
 O  1.884954  5.785366  2.745841
 O  3.826404 11.609716  2.745841
 O  1.884954  9.668266  2.745841
 O  7.709304  3.843916  2.745841
 O  5.767854  1.902466  2.745841
 O  7.709304  7.726816  2.745841
 O  5.767854  5.785366  2.745841
 O  7.709304 11.609716  2.745841
 O  5.767854  9.668266  2.745841
 O 11.592204  3.843916  2.745841
 O  9.650754  1.902466  2.745841
 O 11.592204  7.726816  2.745841
 O  9.650754  5.785366  2.745841
 O 11.592204 11.609716  2.745841
 O  9.650754  9.668266  2.745841
 O  1.883811  1.895931  5.443682
 O  1.893114  5.793625  5.439714
 O  1.889681  9.664536  5.420877
 O  5.775912  1.883164  5.517870
 O  5.764071  5.782571  5.444193
 O  5.762909  9.673225  5.433852
 O  9.659821  1.913757  5.439533
 O  9.651368  5.793605  5.525728
 O  9.650251  9.653429  5.424940
 O  3.843512  3.825712  5.476296
 O  3.833354  7.728913  5.562114
 O  3.828528 11.614011  5.551268
 O  7.711411  3.844852  5.538552
 O  7.711153  7.722818  5.565235
 O  7.713701 11.610047  5.562204
 O 11.583933  3.851824  5.471515
 O 11.592028  7.722790  5.571839
 O 11.587927 11.605321  5.557417
 O  1.843521  1.912784  8.142613
 O  1.927460  5.773932  8.123939
 O  1.885343  9.658810  8.057971
 O  5.831593  1.877182  8.343107
 O  5.814230  5.769370  8.102392
 O  5.758626  9.654205  8.072074
 O  9.562846  1.934463  8.096725
 O  9.621812  5.839675  8.402109
 O  9.678601  9.657586  8.055453
 O  3.856324  3.863089  8.202653
 O  3.858494  7.721093  8.489531
 O  3.814725 11.566577  8.389274
 O  7.698620  3.876599  8.425082
 O  7.685823  7.771903  8.418926
 O  7.747136 11.549851  8.427462
 O 11.573422  3.903117  8.185319
 O 11.637051  7.750165  8.437697
 O 11.549423 11.592778  8.461204
 O  1.774175  1.996494 11.087954
 O  1.997991  6.070346 10.850505
 O  1.910715  9.821047 10.666705
 O  3.901491  3.913812 11.022195
 O  5.985974  6.080752 10.743773
 O  5.808632  9.992121 10.688100
 O  9.261446  1.746859 10.850932
 O 11.482868  4.191409 11.006357
 O  9.638936  9.471684 10.682115
Pd  1.878539  4.024812 11.181313