109
E: -859.15613486 | E_rel_metal 0.9985942100000784: | E_rel_global 0.8234845299999733: 
Ce  1.884954  3.843916  1.372921
Ce  1.884954  7.726816  1.372921
Ce  1.884954 11.609716  1.372921
Ce  5.767854  3.843916  1.372921
Ce  5.767854  7.726816  1.372921
Ce  5.767854 11.609716  1.372921
Ce  9.650754  3.843916  1.372921
Ce  9.650754  7.726816  1.372921
Ce  9.650754 11.609716  1.372921
Ce  3.826404  1.902466  4.118502
Ce  3.826404  5.785366  4.118502
Ce  3.826404  9.668266  4.118502
Ce  7.709304  1.902466  4.118502
Ce  7.709304  5.785366  4.118502
Ce  7.709304  9.668266  4.118502
Ce 11.592204  1.902466  4.118502
Ce 11.592204  5.785366  4.118502
Ce 11.592204  9.668266  4.118502
Ce  1.883397  3.843916  6.896468
Ce  1.885425  7.727786  6.902111
Ce  1.885425 11.608745  6.902111
Ce  5.789056  3.843916  6.857984
Ce  5.772718  7.733208  6.868194
Ce  5.772718 11.603323  6.868194
Ce  9.629900  3.843916  6.855115
Ce  9.645641  7.733197  6.866149
Ce  9.645641 11.603335  6.866149
Ce  3.949306  1.936311  9.597825
Ce  3.949306  5.751520  9.597825
Ce  3.839565  9.668266  9.665856
Ce  7.710437  1.902209  9.692310
Ce  7.710437  5.785622  9.692310
Ce  7.708075  9.668266  9.615224
Ce 11.473375  1.935377  9.591583
Ce 11.473375  5.752454  9.591583
Ce 11.578801  9.668266  9.662177
 O  1.884954  1.902466  0.000000
 O  1.884954  5.785366  0.000000
 O  1.884954  9.668266  0.000000
 O  5.767854  1.902466  0.000000
 O  5.767854  5.785366  0.000000
 O  5.767854  9.668266  0.000000
 O  9.650754  1.902466  0.000000
 O  9.650754  5.785366  0.000000
 O  9.650754  9.668266  0.000000
 O  3.826404  3.843916  2.745841
 O  1.884954  1.902466  2.745841
 O  3.826404  7.726816  2.745841
 O  1.884954  5.785366  2.745841
 O  3.826404 11.609716  2.745841
 O  1.884954  9.668266  2.745841
 O  7.709304  3.843916  2.745841
 O  5.767854  1.902466  2.745841
 O  7.709304  7.726816  2.745841
 O  5.767854  5.785366  2.745841
 O  7.709304 11.609716  2.745841
 O  5.767854  9.668266  2.745841
 O 11.592204  3.843916  2.745841
 O  9.650754  1.902466  2.745841
 O 11.592204  7.726816  2.745841
 O  9.650754  5.785366  2.745841
 O 11.592204 11.609716  2.745841
 O  9.650754  9.668266  2.745841
 O  1.881059  1.900519  5.494968
 O  1.881059  5.787313  5.494968
 O  1.891079  9.668266  5.436469
 O  5.768758  1.902374  5.420187
 O  5.768758  5.785457  5.420187
 O  5.759362  9.668266  5.418748
 O  9.648563  1.899971  5.420073
 O  9.648563  5.787861  5.420073
 O  9.648536  9.668266  5.412712
 O  3.813930  3.843916  5.535570
 O  3.820264  7.722174  5.578532
 O  3.820264 11.614358  5.578532
 O  7.708190  3.843916  5.529654
 O  7.707193  7.729368  5.560402
 O  7.707193 11.607164  5.560402
 O 11.602452  3.843916  5.532356
 O 11.597839  7.728621  5.577711
 O 11.597839 11.607910  5.577711
 O  1.882336  1.916206  8.245860
 O  1.882336  5.771625  8.245860
 O  1.890173  9.668266  8.073762
 O  5.727554  1.887580  8.075539
 O  5.727554  5.800252  8.075539
 O  5.748889  9.668266  8.064211
 O  9.692058  1.887277  8.070131
 O  9.692058  5.800554  8.070131
 O  9.678416  9.668266  8.055035
 O  3.867656  3.843916  8.364140
 O  3.817717  7.736523  8.499976
 O  3.817717 11.600008  8.499976
 O  7.707813  3.843916  8.389978
 O  7.710168  7.758528  8.440736
 O  7.710168 11.578004  8.440736
 O 11.545206  3.843916  8.352243
 O 11.603167  7.740081  8.492816
 O 11.603167 11.596451  8.492816
 O  1.881809  2.060039 11.130691
 O  1.881809  5.627793 11.130691
 O  1.880818  9.668266 10.711562
 O  5.589886  1.931944 10.786387
 O  5.589886  5.755887 10.786387
 O  5.773141  9.668266 10.701375
 O  9.841096  1.933837 10.785711
 O  9.841096  5.753995 10.785711
 O  9.639835  9.668266 10.697522
Ir  1.884962  3.843916 11.423617