109
E: -857.76990134 | E_rel_metal 0.7836316599999691: | E_rel_global 0.629608049999888: 
Ce  1.884954  3.843916  1.372921
Ce  1.884954  7.726816  1.372921
Ce  1.884954 11.609716  1.372921
Ce  5.767854  3.843916  1.372921
Ce  5.767854  7.726816  1.372921
Ce  5.767854 11.609716  1.372921
Ce  9.650754  3.843916  1.372921
Ce  9.650754  7.726816  1.372921
Ce  9.650754 11.609716  1.372921
Ce  3.826404  1.902466  4.118502
Ce  3.826404  5.785366  4.118502
Ce  3.826404  9.668266  4.118502
Ce  7.709304  1.902466  4.118502
Ce  7.709304  5.785366  4.118502
Ce  7.709304  9.668266  4.118502
Ce 11.592204  1.902466  4.118502
Ce 11.592204  5.785366  4.118502
Ce 11.592204  9.668266  4.118502
Ce  1.879384  3.832373  6.901856
Ce  1.890388  7.724544  6.885736
Ce  1.878811 11.626440  6.909037
Ce  5.772759  3.844615  6.838804
Ce  5.769271  7.743849  6.867931
Ce  5.769983 11.597939  6.874504
Ce  9.650853  3.830105  6.856471
Ce  9.651163  7.741508  6.859059
Ce  9.653509 11.614889  6.885721
Ce  3.885168  1.946477  9.620334
Ce  3.932295  5.751156  9.610520
Ce  3.842075  9.668923  9.673691
Ce  7.646140  1.909360  9.650503
Ce  7.730211  5.779515  9.610449
Ce  7.724054  9.675830  9.668394
Ce 11.435061  1.938372  9.725435
Ce 11.528485  5.746945  9.594228
Ce 11.600295  9.674389  9.641521
 O  1.884954  1.902466  0.000000
 O  1.884954  5.785366  0.000000
 O  1.884954  9.668266  0.000000
 O  5.767854  1.902466  0.000000
 O  5.767854  5.785366  0.000000
 O  5.767854  9.668266  0.000000
 O  9.650754  1.902466  0.000000
 O  9.650754  5.785366  0.000000
 O  9.650754  9.668266  0.000000
 O  3.826404  3.843916  2.745841
 O  1.884954  1.902466  2.745841
 O  3.826404  7.726816  2.745841
 O  1.884954  5.785366  2.745841
 O  3.826404 11.609716  2.745841
 O  1.884954  9.668266  2.745841
 O  7.709304  3.843916  2.745841
 O  5.767854  1.902466  2.745841
 O  7.709304  7.726816  2.745841
 O  5.767854  5.785366  2.745841
 O  7.709304 11.609716  2.745841
 O  5.767854  9.668266  2.745841
 O 11.592204  3.843916  2.745841
 O  9.650754  1.902466  2.745841
 O 11.592204  7.726816  2.745841
 O  9.650754  5.785366  2.745841
 O 11.592204 11.609716  2.745841
 O  9.650754  9.668266  2.745841
 O  1.870423  1.899225  5.460795
 O  1.888316  5.786947  5.465039
 O  1.891147  9.673279  5.425945
 O  5.774356  1.902966  5.416185
 O  5.761830  5.786574  5.417515
 O  5.762548  9.678139  5.419152
 O  9.656354  1.905432  5.424807
 O  9.650978  5.802465  5.415895
 O  9.648976  9.660696  5.413920
 O  3.817962  3.838588  5.540768
 O  3.827487  7.731369  5.577257
 O  3.823339 11.625068  5.590315
 O  7.711032  3.847583  5.547511
 O  7.702185  7.732868  5.575240
 O  7.712138 11.610104  5.576127
 O 11.595441  3.849280  5.540428
 O 11.604081  7.729800  5.581703
 O 11.589224 11.607854  5.580431
 O  1.952249  1.923426  8.164064
 O  1.894564  5.777600  8.172861
 O  1.895720  9.657173  8.068461
 O  5.775092  1.893976  8.070405
 O  5.787238  5.804456  8.059157
 O  5.754909  9.659142  8.067693
 O  9.597078  1.894214  8.076452
 O  9.624182  5.800574  8.061780
 O  9.657203  9.663676  8.060660
 O  3.908636  3.864420  8.377218
 O  3.839582  7.714050  8.513289
 O  3.835554 11.597000  8.523875
 O  7.695504  3.869668  8.448635
 O  7.713051  7.737221  8.500706
 O  7.688127 11.579040  8.489167
 O 11.522831  3.866792  8.367748
 O 11.591197  7.710732  8.493057
 O 11.595765 11.596591  8.485113
 O  2.014163  2.068882 11.067067
 O  1.904223  5.788364 10.972406
 O  1.894141  9.693524 10.699527
 O  5.669396  1.953963 10.734638
 O  5.795102  5.757597 10.691503
 O  5.788344  9.668906 10.714144
 O  9.358452  1.942271 10.796704
 O  9.673957  5.750505 10.686946
 O  9.674135  9.700281 10.702727
Rh  1.925212  3.926237 11.295020