109
E: -856.94387304 | E_rel_metal 0.6821425399999725: | E_rel_global -0.4029136499999595: 
Ce  1.884954  3.843916  1.372921
Ce  1.884954  7.726816  1.372921
Ce  1.884954 11.609716  1.372921
Ce  5.767854  3.843916  1.372921
Ce  5.767854  7.726816  1.372921
Ce  5.767854 11.609716  1.372921
Ce  9.650754  3.843916  1.372921
Ce  9.650754  7.726816  1.372921
Ce  9.650754 11.609716  1.372921
Ce  3.826404  1.902466  4.118502
Ce  3.826404  5.785366  4.118502
Ce  3.826404  9.668266  4.118502
Ce  7.709304  1.902466  4.118502
Ce  7.709304  5.785366  4.118502
Ce  7.709304  9.668266  4.118502
Ce 11.592204  1.902466  4.118502
Ce 11.592204  5.785366  4.118502
Ce 11.592204  9.668266  4.118502
Ce  1.869033  3.892866  6.856205
Ce  1.887844  7.726757  6.960164
Ce  1.879804 11.602418  6.870854
Ce  5.773430  3.835658  6.820724
Ce  5.764345  7.775316  6.870910
Ce  5.764226 11.587232  6.953371
Ce  9.659356  3.858189  6.775716
Ce  9.660445  7.777093  6.867261
Ce  9.665598 11.567517  6.859768
Ce  3.664803  1.991321  9.533946
Ce  4.065834  5.668075  9.575306
Ce  3.834968  9.670351  9.702983
Ce  7.931707  1.908919  9.497332
Ce  7.723490  5.837351  9.556557
Ce  7.724112  9.676353  9.775400
Ce 11.553463  2.015985  9.647329
Ce 11.364018  5.707225  9.568273
Ce 11.628709  9.684481  9.691638
 O  1.884954  1.902466  0.000000
 O  1.884954  5.785366  0.000000
 O  1.884954  9.668266  0.000000
 O  5.767854  1.902466  0.000000
 O  5.767854  5.785366  0.000000
 O  5.767854  9.668266  0.000000
 O  9.650754  1.902466  0.000000
 O  9.650754  5.785366  0.000000
 O  9.650754  9.668266  0.000000
 O  3.826404  3.843916  2.745841
 O  1.884954  1.902466  2.745841
 O  3.826404  7.726816  2.745841
 O  1.884954  5.785366  2.745841
 O  3.826404 11.609716  2.745841
 O  1.884954  9.668266  2.745841
 O  7.709304  3.843916  2.745841
 O  5.767854  1.902466  2.745841
 O  7.709304  7.726816  2.745841
 O  5.767854  5.785366  2.745841
 O  7.709304 11.609716  2.745841
 O  5.767854  9.668266  2.745841
 O 11.592204  3.843916  2.745841
 O  9.650754  1.902466  2.745841
 O 11.592204  7.726816  2.745841
 O  9.650754  5.785366  2.745841
 O 11.592204 11.609716  2.745841
 O  9.650754  9.668266  2.745841
 O  1.862023  1.932147  5.483711
 O  1.882422  5.796925  5.549089
 O  1.881976  9.659602  5.447140
 O  5.774202  1.967908  5.519476
 O  5.765586  5.764501  5.441793
 O  5.758700  9.625886  5.412656
 O  9.668376  1.920325  5.429041
 O  9.654423  5.796892  5.413392
 O  9.663354  9.650771  5.415446
 O  3.812257  3.857499  5.485530
 O  3.803834  7.714776  5.589585
 O  3.764152 11.631393  5.526758
 O  7.714389  3.850018  5.520094
 O  7.715323  7.724278  5.563602
 O  7.773755 11.612172  5.523856
 O 11.598181  3.867606  5.483899
 O 11.611212  7.721003  5.583560
 O 11.594501 11.602064  5.562955
 O  1.859072  2.014349  8.186171
 O  1.876942  5.724199  8.448646
 O  1.887154  9.675043  8.074738
 O  5.792006  1.975833  8.601710
 O  5.802437  5.729580  8.092922
 O  5.720762  9.566166  8.144251
 O  9.660612  1.919060  8.085197
 O  9.635895  5.782340  8.058519
 O  9.712672  9.682682  8.058952
 O  3.859533  3.838491  8.190526
 O  3.823851  7.650706  8.503290
 O  3.717232  0.019619  8.505359
 O  7.778243  3.842443  8.396964
 O  7.735749  7.727115  8.434020
 O  7.800301 11.640043  8.480418
 O 11.503212  3.851650  8.241096
 O 11.589339  7.703380  8.475598
 O 11.628906  0.041501  8.507157
 O  1.842567  1.645278 10.880335
 O  0.328850  4.061976 10.978292
 O  1.921428  9.437396 10.749415
 O  3.672943  3.849179 10.950797
 O  5.860741  6.018270 10.710315
 O  5.573126 10.068349 10.800497
 O  9.623904  1.868847 10.742160
 O  9.536732  5.957494 10.703096
 O  9.881577  9.710663 10.791191
Ni  1.952457  3.471843 11.439033