109
E: -856.56404413 | E_rel_metal 0.20973380000009456: | E_rel_global -0.21771474000001945: 
Ce  1.884954  3.843916  1.372921
Ce  1.884954  7.726816  1.372921
Ce  1.884954 11.609716  1.372921
Ce  5.767854  3.843916  1.372921
Ce  5.767854  7.726816  1.372921
Ce  5.767854 11.609716  1.372921
Ce  9.650754  3.843916  1.372921
Ce  9.650754  7.726816  1.372921
Ce  9.650754 11.609716  1.372921
Ce  3.826404  1.902466  4.118502
Ce  3.826404  5.785366  4.118502
Ce  3.826404  9.668266  4.118502
Ce  7.709304  1.902466  4.118502
Ce  7.709304  5.785366  4.118502
Ce  7.709304  9.668266  4.118502
Ce 11.592204  1.902466  4.118502
Ce 11.592204  5.785366  4.118502
Ce 11.592204  9.668266  4.118502
Ce  1.884954  3.843916  6.789828
Ce  1.896780  7.740280  6.887506
Ce  1.873127 11.596251  6.887506
Ce  5.768703  3.810885  6.862383
Ce  5.754764  7.746298  6.847410
Ce  5.748708 11.585810  6.903569
Ce  9.649904  3.876946  6.862383
Ce  9.669900  7.750721  6.903569
Ce  9.663844 11.590234  6.847410
Ce  3.614780  1.993207  9.541088
Ce  3.931551  5.646808  9.701709
Ce  3.811920  9.660242  9.653052
Ce  7.868348  1.842915  9.548613
Ce  7.550260  5.844917  9.548613
Ce  7.709304  9.668266  9.674479
Ce 11.487056  2.041024  9.701709
Ce  0.155127  5.694624  9.541088
Ce 11.606688  9.676290  9.653052
 O  1.884954  1.902466  0.000000
 O  1.884954  5.785366  0.000000
 O  1.884954  9.668266  0.000000
 O  5.767854  1.902466  0.000000
 O  5.767854  5.785366  0.000000
 O  5.767854  9.668266  0.000000
 O  9.650754  1.902466  0.000000
 O  9.650754  5.785366  0.000000
 O  9.650754  9.668266  0.000000
 O  3.826404  3.843916  2.745841
 O  1.884954  1.902466  2.745841
 O  3.826404  7.726816  2.745841
 O  1.884954  5.785366  2.745841
 O  3.826404 11.609716  2.745841
 O  1.884954  9.668266  2.745841
 O  7.709304  3.843916  2.745841
 O  5.767854  1.902466  2.745841
 O  7.709304  7.726816  2.745841
 O  5.767854  5.785366  2.745841
 O  7.709304 11.609716  2.745841
 O  5.767854  9.668266  2.745841
 O 11.592204  3.843916  2.745841
 O  9.650754  1.902466  2.745841
 O 11.592204  7.726816  2.745841
 O  9.650754  5.785366  2.745841
 O 11.592204 11.609716  2.745841
 O  9.650754  9.668266  2.745841
 O  1.881070  1.867493  5.457420
 O  1.888838  5.820338  5.457420
 O  1.884954  9.668266  5.431653
 O  5.758848  1.792182  5.515201
 O  5.758536  5.864424  5.434684
 O  5.761010  9.681522  5.434089
 O  9.660071  1.823407  5.434684
 O  9.659760  5.895650  5.515201
 O  9.657597  9.655009  5.434089
 O  3.785765  3.828399  5.439144
 O  3.814745  7.753907  5.590410
 O  3.807283 11.584149  5.598166
 O  7.709304  3.843916  5.438067
 O  7.709275  7.762888  5.592334
 O  7.709332 11.573644  5.592334
 O 11.632843  3.859432  5.439144
 O 11.611325  7.752382  5.598166
 O 11.603863 11.582624  5.590410
 O  1.847502  1.915897  8.148480
 O  1.922406  5.771934  8.148480
 O  1.884954  9.668266  8.086260
 O  5.773969  1.803917  8.546394
 O  5.789436  5.825113  8.180943
 O  5.704994  9.669674  8.087147
 O  9.629172  1.862719  8.180943
 O  9.644639  5.883914  8.546394
 O  9.713614  9.666858  8.087147
 O  3.773502  3.826588  8.251907
 O  3.824227  7.701210  8.577302
 O  3.753980 11.604270  8.489069
 O  7.709304  3.843916  8.598015
 O  7.674962  7.779831  8.437766
 O  7.743645 11.556701  8.437766
 O -0.003594  3.861243  8.251907
 O  0.015928  7.732261  8.489069
 O 11.594381 11.635321  8.577302
 O  1.758622  1.817239 10.908743
 O  2.011286  5.870592 10.908743
 O  1.884954  9.668266 10.717360
 O  3.902489  3.682977 10.966340
 O  5.917500  5.966496 10.812015
 O  5.807907  9.887583 10.716172
 O  9.501108  1.721336 10.812015
 O 11.516118  4.004854 10.966340
 O  9.610700  9.448948 10.716172
Pd  1.884954  3.843916 11.137218