109
E: -858.8102807 | E_rel_metal 1.3444483700000092: | E_rel_global 1.169338689999904: 
Ce  1.884954  3.843916  1.372921
Ce  1.884954  7.726816  1.372921
Ce  1.884954 11.609716  1.372921
Ce  5.767854  3.843916  1.372921
Ce  5.767854  7.726816  1.372921
Ce  5.767854 11.609716  1.372921
Ce  9.650754  3.843916  1.372921
Ce  9.650754  7.726816  1.372921
Ce  9.650754 11.609716  1.372921
Ce  3.826404  1.902466  4.118502
Ce  3.826404  5.785366  4.118502
Ce  3.826404  9.668266  4.118502
Ce  7.709304  1.902466  4.118502
Ce  7.709304  5.785366  4.118502
Ce  7.709304  9.668266  4.118502
Ce 11.592204  1.902466  4.118502
Ce 11.592204  5.785366  4.118502
Ce 11.592204  9.668266  4.118502
Ce  1.883064  3.887133  6.876701
Ce  1.874743  7.732652  6.954610
Ce  1.871066 11.600010  6.890952
Ce  5.770590  3.837136  6.870394
Ce  5.767678  7.762771  6.854033
Ce  5.752800 11.610719  6.903297
Ce  9.654617  3.865246  6.777795
Ce  9.664022  7.774052  6.884655
Ce  9.671182 11.575627  6.859907
Ce  3.612661  1.961995  9.609822
Ce  4.022985  5.740800  9.588370
Ce  3.842745  9.743525  9.662139
Ce  7.864015  1.892600  9.478503
Ce  7.737657  5.820111  9.574038
Ce  7.692200  9.723575  9.684121
Ce 11.485933  2.024315  9.637925
Ce 11.399232  5.697083  9.582262
Ce 11.573161  9.711193  9.744102
 O  1.884954  1.902466  0.000000
 O  1.884954  5.785366  0.000000
 O  1.884954  9.668266  0.000000
 O  5.767854  1.902466  0.000000
 O  5.767854  5.785366  0.000000
 O  5.767854  9.668266  0.000000
 O  9.650754  1.902466  0.000000
 O  9.650754  5.785366  0.000000
 O  9.650754  9.668266  0.000000
 O  3.826404  3.843916  2.745841
 O  1.884954  1.902466  2.745841
 O  3.826404  7.726816  2.745841
 O  1.884954  5.785366  2.745841
 O  3.826404 11.609716  2.745841
 O  1.884954  9.668266  2.745841
 O  7.709304  3.843916  2.745841
 O  5.767854  1.902466  2.745841
 O  7.709304  7.726816  2.745841
 O  5.767854  5.785366  2.745841
 O  7.709304 11.609716  2.745841
 O  5.767854  9.668266  2.745841
 O 11.592204  3.843916  2.745841
 O  9.650754  1.902466  2.745841
 O 11.592204  7.726816  2.745841
 O  9.650754  5.785366  2.745841
 O 11.592204 11.609716  2.745841
 O  9.650754  9.668266  2.745841
 O  1.882892  1.921898  5.465675
 O  1.888271  5.791737  5.503524
 O  1.885345  9.678685  5.431210
 O  5.772824  1.899411  5.541993
 O  5.768372  5.779426  5.424618
 O  5.760941  9.685540  5.429328
 O  9.659252  1.908478  5.421466
 O  9.646681  5.802192  5.412930
 O  9.652658  9.665645  5.412466
 O  3.837746  3.847957  5.519310
 O  3.822352  7.730295  5.577950
 O  3.827548 11.625422  5.542338
 O  7.697257  3.836520  5.521982
 O  7.705333  7.742893  5.565026
 O  7.708660 11.612828  5.548534
 O 11.600962  3.863038  5.487056
 O 11.601235  7.730181  5.590765
 O 11.591402 11.605367  5.555121
 O  1.832969  1.963611  8.182760
 O  1.899692  5.789971  8.286629
 O  1.894274  9.666589  8.074402
 O  5.836510  1.911756  8.406881
 O  5.805057  5.789623  8.052217
 O  5.754435  9.687668  8.066034
 O  9.618314  1.930426  8.072078
 O  9.633888  5.785527  8.055530
 O  9.651850  9.680570  8.052940
 O  3.888076  3.857654  8.303733
 O  3.877446  7.719563  8.524599
 O  3.789794  0.003721  8.374999
 O  7.754661  3.855956  8.392929
 O  7.680009  7.755909  8.457629
 O  7.743469 11.621062  8.375149
 O 11.513600  3.863132  8.225066
 O 11.577056  7.696347  8.491837
 O 11.578342  0.036284  8.468655
 O  1.694554  2.093272 11.009357
 O 11.572470  3.870332 10.995457
 O  2.108657  9.835212 10.783505
 O  2.942797  5.464622 11.627177
 O  5.891977  5.594297 10.695045
 O  5.770022 10.131702 10.703985
 O  9.490125  1.793656 10.721595
 O  9.556824  6.033661 10.688244
 O  9.416178  9.810294 10.781415
Ir  1.839620  4.074866 11.321517