109
E: -853.57104004 | E_rel_metal 1.0604289300000573: | E_rel_global 0.7803193500000134: 
Ce  1.884954  3.843916  1.372921
Ce  1.884954  7.726816  1.372921
Ce  1.884954 11.609716  1.372921
Ce  5.767854  3.843916  1.372921
Ce  5.767854  7.726816  1.372921
Ce  5.767854 11.609716  1.372921
Ce  9.650754  3.843916  1.372921
Ce  9.650754  7.726816  1.372921
Ce  9.650754 11.609716  1.372921
Ce  3.826404  1.902466  4.118502
Ce  3.826404  5.785366  4.118502
Ce  3.826404  9.668266  4.118502
Ce  7.709304  1.902466  4.118502
Ce  7.709304  5.785366  4.118502
Ce  7.709304  9.668266  4.118502
Ce 11.592204  1.902466  4.118502
Ce 11.592204  5.785366  4.118502
Ce 11.592204  9.668266  4.118502
Ce  1.885268  3.855407  6.797148
Ce  1.895249  7.724179  6.920079
Ce  1.868669 11.618602  6.909061
Ce  5.766963  3.797996  6.846792
Ce  5.749198  7.744767  6.858392
Ce  5.760456 11.607618  6.917927
Ce  9.663413  3.877420  6.851039
Ce  9.669894  7.764314  6.892417
Ce  9.664588 11.626451  6.879566
Ce  3.714355  2.043874  9.519308
Ce  4.043792  5.611707  9.725263
Ce  3.798694  9.659306  9.654740
Ce  7.878756  1.896818  9.633808
Ce  7.631817  5.810952  9.482861
Ce  7.679111  9.673853  9.664308
Ce 11.445387  2.066678  9.735960
Ce  0.093357  5.661807  9.558145
Ce 11.563041  9.710669  9.647099
 O  1.884954  1.902466  0.000000
 O  1.884954  5.785366  0.000000
 O  1.884954  9.668266  0.000000
 O  5.767854  1.902466  0.000000
 O  5.767854  5.785366  0.000000
 O  5.767854  9.668266  0.000000
 O  9.650754  1.902466  0.000000
 O  9.650754  5.785366  0.000000
 O  9.650754  9.668266  0.000000
 O  3.826404  3.843916  2.745841
 O  1.884954  1.902466  2.745841
 O  3.826404  7.726816  2.745841
 O  1.884954  5.785366  2.745841
 O  3.826404 11.609716  2.745841
 O  1.884954  9.668266  2.745841
 O  7.709304  3.843916  2.745841
 O  5.767854  1.902466  2.745841
 O  7.709304  7.726816  2.745841
 O  5.767854  5.785366  2.745841
 O  7.709304 11.609716  2.745841
 O  5.767854  9.668266  2.745841
 O 11.592204  3.843916  2.745841
 O  9.650754  1.902466  2.745841
 O 11.592204  7.726816  2.745841
 O  9.650754  5.785366  2.745841
 O 11.592204 11.609716  2.745841
 O  9.650754  9.668266  2.745841
 O  1.875294  1.897319  5.440315
 O  1.892162  5.797196  5.442171
 O  1.886387  9.675649  5.431147
 O  5.786151  1.889475  5.488271
 O  5.763857  5.787366  5.447675
 O  5.761342  9.673385  5.434553
 O  9.647996  1.911386  5.450671
 O  9.650137  5.806905  5.501849
 O  9.650330  9.656896  5.430571
 O  3.852929  3.826955  5.454285
 O  3.826976  7.733352  5.577375
 O  3.826812 11.626863  5.591768
 O  7.712030  3.849570  5.520583
 O  7.705878  7.728530  5.565470
 O  7.714509 11.610378  5.572120
 O 11.566478  3.858468  5.445815
 O 11.600448  7.727322  5.591701
 O 11.581688 11.610150  5.568062
 O  1.906421  1.935411  8.137359
 O  1.892681  5.788999  8.152574
 O  1.903091  9.660539  8.082813
 O  5.717495  1.871913  8.252154
 O  5.817072  5.739485  8.107702
 O  5.732004  9.649719  8.081960
 O  9.645386  1.982941  8.118565
 O  9.633199  5.853537  8.284819
 O  9.682609  9.705193  8.074632
 O  3.787300  3.893657  8.144471
 O  3.864850  7.675970  8.550753
 O  3.790357 11.593534  8.502348
 O  7.706404  3.871811  8.365696
 O  7.685851  7.759038  8.402969
 O  7.715989 11.588740  8.440927
 O -0.000392  3.874299  8.136254
 O 11.612991  7.748113  8.496839
 O 11.597511 -0.000118  8.463079
 O  1.832111  1.851456 10.930757
 O  2.067580  5.845236 10.938701
 O  1.827384  9.694644 10.699777
 O  4.769025  3.614420 10.555017
 O  6.025514  6.296390 10.688680
 O  5.754592  9.996792 10.692990
 O  9.790201  1.251764 10.716775
 O 10.608206  4.186903 10.539047
 O  9.562990  9.310210 10.674129
Au  1.931107  3.848161 11.237695