109
E: -858.82155992 | E_rel_metal 1.3331691500000034: | E_rel_global 1.1580594699998983: 
Ce  1.884954  3.843916  1.372921
Ce  1.884954  7.726816  1.372921
Ce  1.884954 11.609716  1.372921
Ce  5.767854  3.843916  1.372921
Ce  5.767854  7.726816  1.372921
Ce  5.767854 11.609716  1.372921
Ce  9.650754  3.843916  1.372921
Ce  9.650754  7.726816  1.372921
Ce  9.650754 11.609716  1.372921
Ce  3.826404  1.902466  4.118502
Ce  3.826404  5.785366  4.118502
Ce  3.826404  9.668266  4.118502
Ce  7.709304  1.902466  4.118502
Ce  7.709304  5.785366  4.118502
Ce  7.709304  9.668266  4.118502
Ce 11.592204  1.902466  4.118502
Ce 11.592204  5.785366  4.118502
Ce 11.592204  9.668266  4.118502
Ce  1.876441  3.885950  6.876009
Ce  1.881688  7.730488  6.950974
Ce  1.880371 11.601472  6.888234
Ce  5.772409  3.838283  6.860362
Ce  5.766046  7.776729  6.866862
Ce  5.749517 11.595656  6.917132
Ce  9.656381  3.862367  6.785102
Ce  9.660775  7.759088  6.875115
Ce  9.668713 11.585709  6.848134
Ce  3.621397  1.968859  9.588959
Ce  4.017099  5.740281  9.577024
Ce  3.816414  9.728653  9.724787
Ce  7.862958  1.888029  9.478235
Ce  7.728870  5.815444  9.574113
Ce  7.747283  9.729447  9.692619
Ce 11.489483  2.019702  9.656665
Ce 11.393781  5.692796  9.597283
Ce 11.563094  9.703625  9.676955
 O  1.884954  1.902466  0.000000
 O  1.884954  5.785366  0.000000
 O  1.884954  9.668266  0.000000
 O  5.767854  1.902466  0.000000
 O  5.767854  5.785366  0.000000
 O  5.767854  9.668266  0.000000
 O  9.650754  1.902466  0.000000
 O  9.650754  5.785366  0.000000
 O  9.650754  9.668266  0.000000
 O  3.826404  3.843916  2.745841
 O  1.884954  1.902466  2.745841
 O  3.826404  7.726816  2.745841
 O  1.884954  5.785366  2.745841
 O  3.826404 11.609716  2.745841
 O  1.884954  9.668266  2.745841
 O  7.709304  3.843916  2.745841
 O  5.767854  1.902466  2.745841
 O  7.709304  7.726816  2.745841
 O  5.767854  5.785366  2.745841
 O  7.709304 11.609716  2.745841
 O  5.767854  9.668266  2.745841
 O 11.592204  3.843916  2.745841
 O  9.650754  1.902466  2.745841
 O 11.592204  7.726816  2.745841
 O  9.650754  5.785366  2.745841
 O 11.592204 11.609716  2.745841
 O  9.650754  9.668266  2.745841
 O  1.881804  1.921016  5.462734
 O  1.884851  5.791968  5.504120
 O  1.887974  9.677723  5.427286
 O  5.772940  1.900013  5.542136
 O  5.768005  5.771231  5.422254
 O  5.760148  9.684709  5.425637
 O  9.658697  1.908142  5.425505
 O  9.648479  5.801135  5.414112
 O  9.651576  9.665207  5.414369
 O  3.832216  3.848015  5.516977
 O  3.822507  7.730113  5.578669
 O  3.827156 11.623450  5.542082
 O  7.701519  3.838352  5.522759
 O  7.707708  7.739860  5.569209
 O  7.709854 11.613421  5.546531
 O 11.599453  3.862803  5.487994
 O 11.600699  7.728695  5.590580
 O 11.590669 11.608314  5.554382
 O  1.820251  1.961395  8.179236
 O  1.892008  5.788551  8.289366
 O  1.845134  9.669123  8.062789
 O  5.840728  1.901338  8.409814
 O  5.808361  5.792801  8.049788
 O  5.786531  9.690342  8.060658
 O  9.629004  1.929925  8.076253
 O  9.635282  5.780816  8.059531
 O  9.677927  9.673529  8.051516
 O  3.887100  3.859505  8.290035
 O  3.872110  7.711292  8.514412
 O  3.776098  0.006928  8.377035
 O  7.749987  3.852607  8.392008
 O  7.699279  7.760419  8.472176
 O  7.772303 11.616094  8.370954
 O 11.513077  3.861026  8.234945
 O 11.566488  7.699250  8.499218
 O 11.570512  0.024039  8.480141
 O  1.716539  2.099327 11.007764
 O 11.576686  3.867183 11.003345
 O  1.682047  9.756209 10.778710
 O  2.941126  5.480509 11.625679
 O  5.880487  5.587273 10.692746
 O  5.981280 10.153123 10.736235
 O  9.484329  1.796572 10.726089
 O  9.545326  6.015781 10.695541
 O  9.632322  9.800596 10.741481
Ir  1.846803  4.081308 11.323507