109
E: -858.33182357 | E_rel_metal 0.22170943000003263: | E_rel_global 0.06768581999995149: 
Ce  1.884954  3.843916  1.372921
Ce  1.884954  7.726816  1.372921
Ce  1.884954 11.609716  1.372921
Ce  5.767854  3.843916  1.372921
Ce  5.767854  7.726816  1.372921
Ce  5.767854 11.609716  1.372921
Ce  9.650754  3.843916  1.372921
Ce  9.650754  7.726816  1.372921
Ce  9.650754 11.609716  1.372921
Ce  3.826404  1.902466  4.118502
Ce  3.826404  5.785366  4.118502
Ce  3.826404  9.668266  4.118502
Ce  7.709304  1.902466  4.118502
Ce  7.709304  5.785366  4.118502
Ce  7.709304  9.668266  4.118502
Ce 11.592204  1.902466  4.118502
Ce 11.592204  5.785366  4.118502
Ce 11.592204  9.668266  4.118502
Ce  1.881136  3.850965  6.806506
Ce  1.896458  7.740443  6.888646
Ce  1.865410 11.606564  6.889127
Ce  5.760583  3.798595  6.862696
Ce  5.743925  7.755098  6.848480
Ce  5.751648 11.621516  6.929142
Ce  9.660754  3.862039  6.870782
Ce  9.671193  7.749137  6.905287
Ce  9.664095 11.616731  6.871004
Ce  3.614113  2.026049  9.532965
Ce  3.919013  5.638834  9.705289
Ce  3.799389  9.666904  9.637917
Ce  7.893137  1.860023  9.621056
Ce  7.572225  5.826312  9.476365
Ce  7.691839  9.677709  9.657203
Ce 11.535763  2.049049  9.747691
Ce  0.200976  5.685997  9.560280
Ce 11.581380  9.693284  9.628375
 O  1.884954  1.902466  0.000000
 O  1.884954  5.785366  0.000000
 O  1.884954  9.668266  0.000000
 O  5.767854  1.902466  0.000000
 O  5.767854  5.785366  0.000000
 O  5.767854  9.668266  0.000000
 O  9.650754  1.902466  0.000000
 O  9.650754  5.785366  0.000000
 O  9.650754  9.668266  0.000000
 O  3.826404  3.843916  2.745841
 O  1.884954  1.902466  2.745841
 O  3.826404  7.726816  2.745841
 O  1.884954  5.785366  2.745841
 O  3.826404 11.609716  2.745841
 O  1.884954  9.668266  2.745841
 O  7.709304  3.843916  2.745841
 O  5.767854  1.902466  2.745841
 O  7.709304  7.726816  2.745841
 O  5.767854  5.785366  2.745841
 O  7.709304 11.609716  2.745841
 O  5.767854  9.668266  2.745841
 O 11.592204  3.843916  2.745841
 O  9.650754  1.902466  2.745841
 O 11.592204  7.726816  2.745841
 O  9.650754  5.785366  2.745841
 O 11.592204 11.609716  2.745841
 O  9.650754  9.668266  2.745841
 O  1.876783  1.897151  5.431841
 O  1.888277  5.796621  5.435523
 O  1.888272  9.676704  5.422067
 O  5.784108  1.889910  5.505081
 O  5.762939  5.789860  5.437971
 O  5.759849  9.677259  5.431189
 O  9.649856  1.912203  5.446740
 O  9.648879  5.803588  5.531361
 O  9.650268  9.654716  5.431188
 O  3.840707  3.829458  5.467463
 O  3.822685  7.737220  5.565972
 O  3.826936 11.626345  5.586936
 O  7.709913  3.847824  5.533347
 O  7.710387  7.727448  5.567325
 O  7.710948 11.612873  5.571155
 O 11.576638  3.859034  5.460267
 O 11.594300  7.727330  5.576003
 O 11.583832 11.606077  5.558270
 O  1.869892  1.926766  8.101395
 O  1.928645  5.788785  8.113586
 O  1.888704  9.660310  8.066202
 O  5.709525  1.883169  8.317825
 O  5.799995  5.763603  8.091121
 O  5.725988  9.671198  8.075374
 O  9.646616  1.950653  8.102758
 O  9.622353  5.825487  8.405755
 O  9.678761  9.677097  8.065547
 O  3.836671  3.866996  8.170534
 O  3.850509  7.716532  8.509769
 O  3.763583 11.588661  8.475430
 O  7.696852  3.863732  8.415542
 O  7.667367  7.774726  8.403037
 O  7.726903 11.566953  8.426291
 O 11.590226  3.893488  8.166709
 O 11.627631  7.746412  8.452938
 O 11.588985 11.613097  8.465063
 O  1.844044  1.822213 10.900348
 O  2.035233  5.929157 10.883111
 O  1.854791  9.697970 10.686690
 O  3.977010  3.719886 10.922666
 O  5.980425  6.007674 10.745063
 O  5.782072  9.939928 10.694518
 O  9.763301  1.507786 10.784142
 O 11.534321  4.031358 10.949502
 O  9.590981  9.382792 10.678019
Rh  1.932168  3.871531 11.018716