109
E: -857.31396775 | E_rel_metal 0.2545284600000741: | E_rel_global -0.08844836000002942: 
Ce  1.884954  3.843916  1.372921
Ce  1.884954  7.726816  1.372921
Ce  1.884954 11.609716  1.372921
Ce  5.767854  3.843916  1.372921
Ce  5.767854  7.726816  1.372921
Ce  5.767854 11.609716  1.372921
Ce  9.650754  3.843916  1.372921
Ce  9.650754  7.726816  1.372921
Ce  9.650754 11.609716  1.372921
Ce  3.826404  1.902466  4.118502
Ce  3.826404  5.785366  4.118502
Ce  3.826404  9.668266  4.118502
Ce  7.709304  1.902466  4.118502
Ce  7.709304  5.785366  4.118502
Ce  7.709304  9.668266  4.118502
Ce 11.592204  1.902466  4.118502
Ce 11.592204  5.785366  4.118502
Ce 11.592204  9.668266  4.118502
Ce  1.903339  3.829349  6.820845
Ce  1.899885  7.750316  6.894114
Ce  1.884737 11.599010  6.910018
Ce  5.751442  3.807224  6.869662
Ce  5.753208  7.740293  6.852396
Ce  5.748799 11.591003  6.905512
Ce  9.662951  3.873964  6.830856
Ce  9.674105  7.768933  6.913103
Ce  9.683472 11.578070  6.864981
Ce  3.624857  1.967184  9.641556
Ce  3.898337  5.662363  9.695490
Ce  3.870408  9.695653  9.642879
Ce  7.854665  1.854003  9.492335
Ce  7.571097  5.838755  9.503545
Ce  7.702231  9.665686  9.686209
Ce 11.496931  2.053423  9.660251
Ce  0.118694  5.727193  9.495595
Ce 11.629706  9.695313  9.739953
 O  1.884954  1.902466  0.000000
 O  1.884954  5.785366  0.000000
 O  1.884954  9.668266  0.000000
 O  5.767854  1.902466  0.000000
 O  5.767854  5.785366  0.000000
 O  5.767854  9.668266  0.000000
 O  9.650754  1.902466  0.000000
 O  9.650754  5.785366  0.000000
 O  9.650754  9.668266  0.000000
 O  3.826404  3.843916  2.745841
 O  1.884954  1.902466  2.745841
 O  3.826404  7.726816  2.745841
 O  1.884954  5.785366  2.745841
 O  3.826404 11.609716  2.745841
 O  1.884954  9.668266  2.745841
 O  7.709304  3.843916  2.745841
 O  5.767854  1.902466  2.745841
 O  7.709304  7.726816  2.745841
 O  5.767854  5.785366  2.745841
 O  7.709304 11.609716  2.745841
 O  5.767854  9.668266  2.745841
 O 11.592204  3.843916  2.745841
 O  9.650754  1.902466  2.745841
 O 11.592204  7.726816  2.745841
 O  9.650754  5.785366  2.745841
 O 11.592204 11.609716  2.745841
 O  9.650754  9.668266  2.745841
 O  1.887681  1.896937  5.447487
 O  1.892632  5.784609  5.443328
 O  1.889987  9.670700  5.423728
 O  5.776560  1.889977  5.534461
 O  5.767103  5.772792  5.446764
 O  5.763023  9.672847  5.433757
 O  9.653102  1.918643  5.439595
 O  9.651781  5.794090  5.524850
 O  9.654252  9.653876  5.427527
 O  3.850798  3.827727  5.481886
 O  3.831885  7.727924  5.563677
 O  3.834682 11.614098  5.532398
 O  7.709052  3.846793  5.545656
 O  7.711074  7.720892  5.555472
 O  7.715438 11.609985  5.551460
 O 11.583369  3.853890  5.462925
 O 11.598110  7.726631  5.565323
 O 11.591107 11.603409  5.558335
 O  1.821767  1.925254  8.150166
 O  1.923891  5.760292  8.130515
 O  1.902487  9.657594  8.068646
 O  5.853478  1.885729  8.389583
 O  5.815921  5.739583  8.104170
 O  5.776913  9.650979  8.064605
 O  9.612879  1.954465  8.088818
 O  9.623040  5.812851  8.401268
 O  9.661949  9.668636  8.060688
 O  3.856670  3.844216  8.209550
 O  3.881385  7.672393  8.507847
 O  3.828496 11.591370  8.345182
 O  7.727127  3.855877  8.446916
 O  7.672353  7.735436  8.393055
 O  7.774248 11.595432  8.398732
 O 11.573687  3.878203  8.160891
 O 11.634031  7.706015  8.409616
 O 11.554080  0.028293  8.485603
 O  1.612657  1.908475 11.003207
 O  1.931532  5.982642 10.883757
 O  2.144974  9.842146 10.759079
 O  3.820195  3.878565 11.056735
 O  5.957775  6.024770 10.743234
 O  5.825076 10.071003 10.710616
 O  9.481252  1.655108 10.730123
 O 11.400062  4.048372 10.915722
 O  9.437454  9.274959 10.750194
Pt  1.790847  3.941042 11.065232