109
E: -859.03858612 | E_rel_metal 1.1161429500000395: | E_rel_global 0.9410332699999344: 
Ce  1.884954  3.843916  1.372921
Ce  1.884954  7.726816  1.372921
Ce  1.884954 11.609716  1.372921
Ce  5.767854  3.843916  1.372921
Ce  5.767854  7.726816  1.372921
Ce  5.767854 11.609716  1.372921
Ce  9.650754  3.843916  1.372921
Ce  9.650754  7.726816  1.372921
Ce  9.650754 11.609716  1.372921
Ce  3.826404  1.902466  4.118502
Ce  3.826404  5.785366  4.118502
Ce  3.826404  9.668266  4.118502
Ce  7.709304  1.902466  4.118502
Ce  7.709304  5.785366  4.118502
Ce  7.709304  9.668266  4.118502
Ce 11.592204  1.902466  4.118502
Ce 11.592204  5.785366  4.118502
Ce 11.592204  9.668266  4.118502
Ce  1.864105  3.883948  6.876809
Ce  1.895627  7.706915  6.946184
Ce  1.872151 11.594227  6.871902
Ce  5.772534  3.832694  6.829111
Ce  5.763004  7.753610  6.889888
Ce  5.762964 11.573746  6.918690
Ce  9.658755  3.852581  6.817684
Ce  9.647788  7.768121  6.864202
Ce  9.665293 11.569283  6.867867
Ce  3.677121  1.990109  9.506223
Ce  4.050910  5.646244  9.619259
Ce  3.825641  9.692064  9.689096
Ce  7.868788  1.906982  9.496889
Ce  7.727228  5.823515  9.571321
Ce  7.728189  9.701795  9.759478
Ce 11.519815  1.955988  9.703079
Ce 11.419725  5.759823  9.590156
Ce 11.625047  9.699754  9.662900
 O  1.884954  1.902466  0.000000
 O  1.884954  5.785366  0.000000
 O  1.884954  9.668266  0.000000
 O  5.767854  1.902466  0.000000
 O  5.767854  5.785366  0.000000
 O  5.767854  9.668266  0.000000
 O  9.650754  1.902466  0.000000
 O  9.650754  5.785366  0.000000
 O  9.650754  9.668266  0.000000
 O  3.826404  3.843916  2.745841
 O  1.884954  1.902466  2.745841
 O  3.826404  7.726816  2.745841
 O  1.884954  5.785366  2.745841
 O  3.826404 11.609716  2.745841
 O  1.884954  9.668266  2.745841
 O  7.709304  3.843916  2.745841
 O  5.767854  1.902466  2.745841
 O  7.709304  7.726816  2.745841
 O  5.767854  5.785366  2.745841
 O  7.709304 11.609716  2.745841
 O  5.767854  9.668266  2.745841
 O 11.592204  3.843916  2.745841
 O  9.650754  1.902466  2.745841
 O 11.592204  7.726816  2.745841
 O  9.650754  5.785366  2.745841
 O 11.592204 11.609716  2.745841
 O  9.650754  9.668266  2.745841
 O  1.875134  1.910930  5.456084
 O  1.888632  5.790606  5.500779
 O  1.890310  9.672784  5.430408
 O  5.775108  1.893814  5.544157
 O  5.768642  5.771054  5.444723
 O  5.764331  9.679615  5.436137
 O  9.658598  1.909867  5.426397
 O  9.647559  5.787709  5.409973
 O  9.648258  9.661923  5.409503
 O  3.824986  3.844859  5.486554
 O  3.829800  7.726427  5.586664
 O  3.832761 11.618095  5.553179
 O  7.706250  3.835999  5.521007
 O  7.693724  7.734292  5.563818
 O  7.706578 11.607464  5.555878
 O 11.597639  3.860441  5.520333
 O 11.606201  7.726337  5.583977
 O 11.590145 11.601249  5.542483
 O  1.887153  1.951662  8.156946
 O  1.881473  5.770599  8.289660
 O  1.902424  9.645313  8.068969
 O  5.775590  1.903742  8.428436
 O  5.785769  5.734475  8.089894
 O  5.717327  9.666407  8.071469
 O  9.607158  1.894330  8.080337
 O  9.620518  5.801406  8.048140
 O  9.685157  9.661710  8.049948
 O  3.858098  3.840866  8.191389
 O  3.862557  7.667093  8.543618
 O  3.774804 11.635665  8.413097
 O  7.724819  3.849016  8.384838
 O  7.688251  7.739797  8.444716
 O  7.726226 11.615573  8.398588
 O 11.500710  3.872132  8.338375
 O 11.587737  7.705157  8.485691
 O 11.618824 11.625993  8.417701
 O  1.960291  2.084657 10.995510
 O  0.984629  5.494658 11.572075
 O  1.913182  9.691400 10.746420
 O  3.960429  3.683621 10.947291
 O  5.888903  6.007162 10.712648
 O  5.585295 10.080298 10.760772
 O  9.406754  2.028477 10.799280
 O  9.571505  5.847078 10.696813
 O  9.874636  9.865546 10.761501
Ir  2.027556  4.046820 11.314127