109
E: -857.59764191 | E_rel_metal 0.9558910900000228: | E_rel_global 0.8018674799999417: 
Ce  1.884954  3.843916  1.372921
Ce  1.884954  7.726816  1.372921
Ce  1.884954 11.609716  1.372921
Ce  5.767854  3.843916  1.372921
Ce  5.767854  7.726816  1.372921
Ce  5.767854 11.609716  1.372921
Ce  9.650754  3.843916  1.372921
Ce  9.650754  7.726816  1.372921
Ce  9.650754 11.609716  1.372921
Ce  3.826404  1.902466  4.118502
Ce  3.826404  5.785366  4.118502
Ce  3.826404  9.668266  4.118502
Ce  7.709304  1.902466  4.118502
Ce  7.709304  5.785366  4.118502
Ce  7.709304  9.668266  4.118502
Ce 11.592204  1.902466  4.118502
Ce 11.592204  5.785366  4.118502
Ce 11.592204  9.668266  4.118502
Ce  1.882923  3.843916  6.888576
Ce  1.884632  7.726240  6.900675
Ce  1.884632 11.610291  6.900675
Ce  5.770503  3.843916  6.827537
Ce  5.771956  7.756823  6.883698
Ce  5.771956 11.579708  6.883698
Ce  9.651353  3.843916  6.830185
Ce  9.646930  7.758020  6.886365
Ce  9.646930 11.578512  6.886365
Ce  3.930007  1.934948  9.605420
Ce  3.930007  5.752883  9.605420
Ce  3.800969  9.668266  9.708222
Ce  7.715823  1.901182  9.595980
Ce  7.715823  5.786650  9.595980
Ce  7.697261  9.668266  9.778477
Ce 11.495660  1.934138  9.606701
Ce 11.495660  5.753693  9.606701
Ce 11.602846  9.668266  9.717100
 O  1.884954  1.902466  0.000000
 O  1.884954  5.785366  0.000000
 O  1.884954  9.668266  0.000000
 O  5.767854  1.902466  0.000000
 O  5.767854  5.785366  0.000000
 O  5.767854  9.668266  0.000000
 O  9.650754  1.902466  0.000000
 O  9.650754  5.785366  0.000000
 O  9.650754  9.668266  0.000000
 O  3.826404  3.843916  2.745841
 O  1.884954  1.902466  2.745841
 O  3.826404  7.726816  2.745841
 O  1.884954  5.785366  2.745841
 O  3.826404 11.609716  2.745841
 O  1.884954  9.668266  2.745841
 O  7.709304  3.843916  2.745841
 O  5.767854  1.902466  2.745841
 O  7.709304  7.726816  2.745841
 O  5.767854  5.785366  2.745841
 O  7.709304 11.609716  2.745841
 O  5.767854  9.668266  2.745841
 O 11.592204  3.843916  2.745841
 O  9.650754  1.902466  2.745841
 O 11.592204  7.726816  2.745841
 O  9.650754  5.785366  2.745841
 O 11.592204 11.609716  2.745841
 O  9.650754  9.668266  2.745841
 O  1.884902  1.902413  5.462519
 O  1.884902  5.785418  5.462519
 O  1.889871  9.668266  5.428083
 O  5.767217  1.907863  5.416845
 O  5.767217  5.779968  5.416845
 O  5.765052  9.668266  5.416083
 O  9.655444  1.906798  5.420028
 O  9.655444  5.781033  5.420028
 O  9.646963  9.668266  5.412465
 O  3.816354  3.843916  5.542914
 O  3.823905  7.725501  5.582324
 O  3.823905 11.611030  5.582324
 O  7.711354  3.843916  5.547300
 O  7.709756  7.729380  5.574446
 O  7.709756 11.607152  5.574446
 O 11.602160  3.843916  5.543847
 O 11.595944  7.731089  5.588546
 O 11.595944 11.605442  5.588546
 O  1.872286  1.934729  8.176100
 O  1.872286  5.753102  8.176100
 O  1.884805  9.668266  8.069709
 O  5.784702  1.903034  8.066582
 O  5.784702  5.784797  8.066582
 O  5.725105  9.668266  8.064379
 O  9.641410  1.904456  8.068580
 O  9.641410  5.783376  8.068580
 O  9.690491  9.668266  8.057392
 O  3.901228  3.843916  8.382138
 O  3.819777  7.681870  8.500955
 O  3.819777  0.005962  8.500955
 O  7.715089  3.843916  8.450541
 O  7.711420  7.705176  8.478137
 O  7.711420 -0.017345  8.478137
 O 11.513053  3.843916  8.388559
 O 11.592405  7.686445  8.512239
 O 11.592405  0.001387  8.512239
 O  1.898660  1.985143 10.979051
 O  1.898660  5.702688 10.979051
 O  1.881479  9.668266 10.761865
 O  5.782176  1.929829 10.693017
 O  5.782176  5.758002 10.693017
 O  5.551469  9.668266 10.801992
 O  9.646410  1.927483 10.698046
 O  9.646410  5.760348 10.698046
 O  9.846263  9.668266 10.799836
Rh  1.893500  3.843916 11.259111