109
E: -857.46180652 | E_rel_metal 0.1066896900000529: | E_rel_global -0.23628713000005064: 
Ce  1.884954  3.843916  1.372921
Ce  1.884954  7.726816  1.372921
Ce  1.884954 11.609716  1.372921
Ce  5.767854  3.843916  1.372921
Ce  5.767854  7.726816  1.372921
Ce  5.767854 11.609716  1.372921
Ce  9.650754  3.843916  1.372921
Ce  9.650754  7.726816  1.372921
Ce  9.650754 11.609716  1.372921
Ce  3.826404  1.902466  4.118502
Ce  3.826404  5.785366  4.118502
Ce  3.826404  9.668266  4.118502
Ce  7.709304  1.902466  4.118502
Ce  7.709304  5.785366  4.118502
Ce  7.709304  9.668266  4.118502
Ce 11.592204  1.902466  4.118502
Ce 11.592204  5.785366  4.118502
Ce 11.592204  9.668266  4.118502
Ce  1.891798  3.857061  6.815305
Ce  1.909642  7.736633  6.893154
Ce  1.865606 11.605917  6.880273
Ce  5.760042  3.815367  6.879006
Ce  5.747448  7.749309  6.856780
Ce  5.759587 11.620506  6.921138
Ce  9.663960  3.858012  6.858561
Ce  9.673436  7.753588  6.897135
Ce  9.661700 11.609996  6.867310
Ce  3.625574  2.000624  9.525147
Ce  3.962872  5.665237  9.790629
Ce  3.812318  9.657104  9.618335
Ce  7.877475  1.860987  9.615021
Ce  7.623764  5.815074  9.484504
Ce  7.706985  9.672859  9.653045
Ce 11.491187  1.995980  9.711007
Ce  0.166487  5.690154  9.545561
Ce 11.591259  9.677998  9.634412
 O  1.884954  1.902466  0.000000
 O  1.884954  5.785366  0.000000
 O  1.884954  9.668266  0.000000
 O  5.767854  1.902466  0.000000
 O  5.767854  5.785366  0.000000
 O  5.767854  9.668266  0.000000
 O  9.650754  1.902466  0.000000
 O  9.650754  5.785366  0.000000
 O  9.650754  9.668266  0.000000
 O  3.826404  3.843916  2.745841
 O  1.884954  1.902466  2.745841
 O  3.826404  7.726816  2.745841
 O  1.884954  5.785366  2.745841
 O  3.826404 11.609716  2.745841
 O  1.884954  9.668266  2.745841
 O  7.709304  3.843916  2.745841
 O  5.767854  1.902466  2.745841
 O  7.709304  7.726816  2.745841
 O  5.767854  5.785366  2.745841
 O  7.709304 11.609716  2.745841
 O  5.767854  9.668266  2.745841
 O 11.592204  3.843916  2.745841
 O  9.650754  1.902466  2.745841
 O 11.592204  7.726816  2.745841
 O  9.650754  5.785366  2.745841
 O 11.592204 11.609716  2.745841
 O  9.650754  9.668266  2.745841
 O  1.878292  1.901078  5.435677
 O  1.892639  5.796341  5.440439
 O  1.890087  9.679332  5.420374
 O  5.784578  1.891680  5.516218
 O  5.761599  5.787848  5.441202
 O  5.762406  9.682190  5.429923
 O  9.651268  1.916055  5.442025
 O  9.651449  5.800748  5.524067
 O  9.650200  9.654915  5.431072
 O  3.844896  3.833558  5.476915
 O  3.825178  7.735985  5.556527
 O  3.827393 11.629275  5.584418
 O  7.709263  3.849283  5.531258
 O  7.714364  7.725926  5.563490
 O  7.716149 11.615338  5.565011
 O 11.583191  3.860146  5.462664
 O 11.595825  7.728131  5.575618
 O 11.583452 11.606550  5.557446
 O  1.865279  1.923577  8.117886
 O  1.897290  5.788398  8.129314
 O  1.873773  9.671341  8.058029
 O  5.708748  1.873001  8.347237
 O  5.847856  5.774141  8.096995
 O  5.752362  9.685377  8.071078
 O  9.648811  1.938854  8.098312
 O  9.664894  5.814885  8.388756
 O  9.685786  9.680548  8.064053
 O  3.837540  3.839362  8.197502
 O  3.860787  7.757629  8.449121
 O  3.762232 11.589094  8.468745
 O  7.723994  3.848165  8.392147
 O  7.693925  7.782625  8.404101
 O  7.735361 11.568765  8.422213
 O 11.593892  3.873546  8.176662
 O 11.627853  7.745756  8.456673
 O 11.586055 11.609648  8.464382
 O  1.794745  1.749096 10.908803
 O  1.876858  5.837098 10.983400
 O  1.879929  9.616330 10.677514
 O  3.866926  3.581890 11.036755
 O  6.151731  5.897525 10.837127
 O  5.789396  9.887499 10.693205
 O  9.748081  1.448257 10.771045
 O 11.450940  3.989033 10.944201
 O  9.616509  9.354638 10.673248
Pt  1.836523  3.791500 11.079864