109
E: -854.54204177 | E_rel_metal 1.0928936200000408: | E_rel_global 0.3162576199999876: 
Ce  1.884954  3.843916  1.372921
Ce  1.884954  7.726816  1.372921
Ce  1.884954 11.609716  1.372921
Ce  5.767854  3.843916  1.372921
Ce  5.767854  7.726816  1.372921
Ce  5.767854 11.609716  1.372921
Ce  9.650754  3.843916  1.372921
Ce  9.650754  7.726816  1.372921
Ce  9.650754 11.609716  1.372921
Ce  3.826404  1.902466  4.118502
Ce  3.826404  5.785366  4.118502
Ce  3.826404  9.668266  4.118502
Ce  7.709304  1.902466  4.118502
Ce  7.709304  5.785366  4.118502
Ce  7.709304  9.668266  4.118502
Ce 11.592204  1.902466  4.118502
Ce 11.592204  5.785366  4.118502
Ce 11.592204  9.668266  4.118502
Ce  1.887047  3.840489  6.781222
Ce  1.907448  7.759044  6.908835
Ce  1.872541 11.581967  6.905363
Ce  5.761278  3.808330  6.841510
Ce  5.747499  7.767792  6.870873
Ce  5.747844 11.560784  6.927764
Ce  9.662718  3.871933  6.844363
Ce  9.667268  7.767625  6.920193
Ce  9.669485 11.573195  6.862133
Ce  3.635211  1.981084  9.533237
Ce  3.920327  5.670855  9.639454
Ce  3.831620  9.719877  9.787052
Ce  7.844588  1.827924  9.496735
Ce  7.571909  5.834215  9.481431
Ce  7.695747  9.699863  9.788466
Ce 11.506329  2.024294  9.656095
Ce  0.152630  5.706143  9.529093
Ce 11.589442  9.652364  9.731830
 O  1.884954  1.902466  0.000000
 O  1.884954  5.785366  0.000000
 O  1.884954  9.668266  0.000000
 O  5.767854  1.902466  0.000000
 O  5.767854  5.785366  0.000000
 O  5.767854  9.668266  0.000000
 O  9.650754  1.902466  0.000000
 O  9.650754  5.785366  0.000000
 O  9.650754  9.668266  0.000000
 O  3.826404  3.843916  2.745841
 O  1.884954  1.902466  2.745841
 O  3.826404  7.726816  2.745841
 O  1.884954  5.785366  2.745841
 O  3.826404 11.609716  2.745841
 O  1.884954  9.668266  2.745841
 O  7.709304  3.843916  2.745841
 O  5.767854  1.902466  2.745841
 O  7.709304  7.726816  2.745841
 O  5.767854  5.785366  2.745841
 O  7.709304 11.609716  2.745841
 O  5.767854  9.668266  2.745841
 O 11.592204  3.843916  2.745841
 O  9.650754  1.902466  2.745841
 O 11.592204  7.726816  2.745841
 O  9.650754  5.785366  2.745841
 O 11.592204 11.609716  2.745841
 O  9.650754  9.668266  2.745841
 O  1.882757  1.900777  5.442836
 O  1.888809  5.784167  5.444043
 O  1.890454  9.670559  5.421061
 O  5.773988  1.892226  5.546522
 O  5.767517  5.765961  5.445427
 O  5.762370  9.680117  5.428479
 O  9.651458  1.923420  5.443904
 O  9.650438  5.789802  5.528993
 O  9.648946  9.652936  5.420946
 O  3.843125  3.830592  5.470790
 O  3.828011  7.731114  5.559290
 O  3.826271 11.607782  5.553055
 O  7.711707  3.845109  5.540633
 O  7.708898  7.722266  5.555949
 O  7.709868 11.609699  5.543971
 O 11.578751  3.854843  5.467595
 O 11.595098  7.727715  5.569413
 O 11.587659 11.605127  5.558769
 O  1.844478  1.954668  8.146727
 O  1.927481  5.723374  8.139602
 O  1.862461  9.670382  8.054405
 O  5.790761  1.894751  8.437265
 O  5.804060  5.721444  8.095579
 O  5.738325  9.657174  8.056138
 O  9.622429  1.957985  8.099801
 O  9.634128  5.786168  8.416781
 O  9.707448  9.666822  8.049861
 O  3.842696  3.813915  8.182678
 O  3.852795  7.642145  8.491286
 O  3.759076  0.033194  8.386725
 O  7.712697  3.834496  8.435427
 O  7.670980  7.711838  8.390820
 O  7.767016 11.622377  8.349487
 O 11.586941  3.867407  8.183102
 O  0.004614  7.668573  8.419364
 O 11.557565  0.041240  8.508560
 O  1.779361  1.909077 10.851944
 O  2.006931  5.814665 10.842215
 O  1.701563  9.706167 10.820129
 O  3.842352  3.715942 10.882536
 O  5.933092  6.052535 10.721926
 O  5.793805 10.411526 10.736574
 O  9.495762  1.662120 10.725651
 O 11.591121  3.990890 10.891595
 O  9.804767  9.221144 10.777194
Cu  1.895146  3.858133 11.183743