E_rel_global,ncoord,mos,cum_IE_N,Ce3-ONN_sepd,Ce3-ONN_shared,sum(d-MO),min(d-MO),mean(d-MO),max(d-MO),std(d-MO),sum(d-MCe3),min(d-MCe3),mean(d-MCe3),max(d-MCe3),std(d-MCe3),sum(d-O[M]Ce3),min(d-O[M]Ce3),mean(d-O[M]Ce3),max(d-O[M]Ce3),std(d-O[M]Ce3),sum(d-Ce3_Ce3),min(d-Ce3_Ce3),mean(d-Ce3_Ce3),max(d-Ce3_Ce3),std(d-Ce3_Ce3),plot_label
-0.3429768200001035,4,2,18.56,2,0,8.0,2.0,2.0,2.0,0.0,35.7,1.5811388300841898,6.2,6.2,0.0,18.4,2.2,2.3,2.4,0.076,3.0,4.0,4.0,4.0,0.0,"M: Pt; Coord: 4; OS: 2; IDs: 31_32; mean(d-Ce3Ce3): 4.0; Ce3-ONN: (2,0)<br>E (tot): -857.568; E (met): 0.0; E (glob): -0.343<br>Dir: /calcs/final_sampling/pt/4o_coord/0ce3/pos_00/sec-gamma/"
-0.3428967000000966,4,2,18.56,3,0,8.0,2.0,2.0,2.0,0.0,37.8,1.5811388300841898,7.2,8.3,1.485,18.4,2.2,2.3,2.4,0.053,3.0,3.8,3.8,3.8,0.0,"M: Pt; Coord: 4; OS: 2; IDs: 32_33; mean(d-Ce3Ce3): 3.8; Ce3-ONN: (3,0)<br>E (tot): -857.568; E (met): 0.0; E (glob): -0.343<br>Dir: /calcs/final_sampling/pt/4o_coord/2ce3/pos_32_33/sec-gamma/"
-0.3354131100001041,4,2,18.56,3,0,8.0,2.0,2.0,2.0,0.0,35.7,1.5811388300841898,6.2,6.2,0.0,18.4,2.2,2.3,2.4,0.053,3.0,5.6,5.6,5.6,0.0,"M: Pt; Coord: 4; OS: 2; IDs: 32_36; mean(d-Ce3Ce3): 5.6; Ce3-ONN: (3,0)<br>E (tot): -857.561; E (met): 0.008; E (glob): -0.335<br>Dir: /calcs/final_sampling/pt/4o_coord/2ce3/pos_32_36/sec-gamma/"
-0.3345166400000607,4,2,18.56,3,0,8.0,2.0,2.0,2.0,0.0,37.8,1.5811388300841898,7.2,8.3,1.485,18.4,2.2,2.3,2.4,0.053,3.0,3.8,3.8,3.8,0.0,"M: Pt; Coord: 4; OS: 2; IDs: 31_33; mean(d-Ce3Ce3): 3.8; Ce3-ONN: (3,0)<br>E (tot): -857.56; E (met): 0.008; E (glob): -0.335<br>Dir: /calcs/final_sampling/pt/4o_coord/1ce3/pos_33/sec-gamma/"
-0.3309537500000488,4,2,18.56,3,0,8.0,2.0,2.0,2.0,0.0,35.8,1.5811388300841898,6.2,6.3,0.071,18.4,2.2,2.3,2.4,0.053,3.0,5.3,5.3,5.3,0.0,"M: Pt; Coord: 4; OS: 2; IDs: 30_32; mean(d-Ce3Ce3): 5.3; Ce3-ONN: (3,0)<br>E (tot): -857.556; E (met): 0.012; E (glob): -0.331<br>Dir: /calcs/final_sampling/pt/4o_coord/2ce3/pos_30_32/sec-gamma/"
-0.3304579000000558,4,2,18.56,3,0,8.0,2.0,2.0,2.0,0.0,35.8,1.5811388300841898,6.2,6.3,0.071,18.4,2.2,2.3,2.4,0.053,3.0,5.3,5.3,5.3,0.0,"M: Pt; Coord: 4; OS: 2; IDs: 31_36; mean(d-Ce3Ce3): 5.3; Ce3-ONN: (3,0)<br>E (tot): -857.556; E (met): 0.013; E (glob): -0.33<br>Dir: /calcs/final_sampling/pt/4o_coord/2ce3/pos_31_36/sec-gamma/"
-0.3276455800000803,4,2,18.56,3,0,8.0,2.0,2.0,2.0,0.0,35.7,1.5811388300841898,6.2,6.2,0.0,18.4,2.2,2.3,2.4,0.053,3.0,5.6,5.6,5.6,0.0,"M: Pt; Coord: 4; OS: 2; IDs: 30_31; mean(d-Ce3Ce3): 5.6; Ce3-ONN: (3,0)<br>E (tot): -857.553; E (met): 0.015; E (glob): -0.328<br>Dir: /calcs/final_sampling/pt/4o_coord/1ce3/pos_30/sec-gamma/"
-0.2370997600000919,4,2,18.56,4,0,8.1,2.0,2.0,2.1,0.05,32.5,0.7071067811865475,4.6,6.1,2.121,18.3,2.2,2.3,2.4,0.083,3.0,5.5,5.5,5.5,0.0,"M: Pt; Coord: 4; OS: 2; IDs: 32_34; mean(d-Ce3Ce3): 5.5; Ce3-ONN: (4,0)<br>E (tot): -857.463; E (met): 0.106; E (glob): -0.237<br>Dir: /calcs/final_sampling/pt/4o_coord/2ce3/pos_32_34/sec-gamma/"
-0.2362871300000506,4,2,18.56,4,0,8.0,2.0,2.0,2.0,0.0,32.5,0.7071067811865475,4.6,6.1,2.121,18.3,2.2,2.3,2.4,0.083,3.0,5.5,5.5,5.5,0.0,"M: Pt; Coord: 4; OS: 2; IDs: 29_31; mean(d-Ce3Ce3): 5.5; Ce3-ONN: (4,0)<br>E (tot): -857.462; E (met): 0.107; E (glob): -0.236<br>Dir: /calcs/final_sampling/pt/4o_coord/1ce3/pos_29/sec-gamma/"
-0.2196279600000252,4,2,18.56,5,0,8.1,2.0,2.0,2.1,0.05,34.6,0.7071067811865475,5.6,8.2,3.606,18.5,2.2,2.3,2.5,0.099,3.0,5.5,5.5,5.5,0.0,"M: Pt; Coord: 4; OS: 2; IDs: 29_33; mean(d-Ce3Ce3): 5.5; Ce3-ONN: (5,0)<br>E (tot): -857.445; E (met): 0.123; E (glob): -0.22<br>Dir: /calcs/final_sampling/pt/4o_coord/2ce3/pos_29_33/sec-gamma/"
-0.2176716400000486,4,2,18.56,5,0,8.1,2.0,2.0,2.1,0.05,34.7,0.7071067811865475,5.7,8.2,3.536,18.4,2.2,2.3,2.4,0.076,3.0,5.5,5.5,5.5,0.0,"M: Pt; Coord: 4; OS: 2; IDs: 33_34; mean(d-Ce3Ce3): 5.5; Ce3-ONN: (5,0)<br>E (tot): -857.443; E (met): 0.125; E (glob): -0.218<br>Dir: /calcs/final_sampling/pt/4o_coord/2ce3/pos_33_34/sec-gamma/"
-0.2144742200000564,4,2,18.56,4,0,8.1,2.0,2.0,2.1,0.05,34.6,0.7071067811865475,5.6,8.2,3.606,18.4,2.2,2.3,2.4,0.093,3.0,5.7,5.7,5.7,0.0,"M: Pt; Coord: 4; OS: 2; IDs: 28_33; mean(d-Ce3Ce3): 5.7; Ce3-ONN: (4,0)<br>E (tot): -857.44; E (met): 0.129; E (glob): -0.214<br>Dir: /calcs/final_sampling/pt/4o_coord/2ce3/pos_28_33/sec-gamma/"
-0.2081472400000166,4,2,18.56,3,0,8.1,2.0,2.0,2.1,0.05,32.7,0.7071067811865475,4.7,6.3,2.263,18.3,2.2,2.3,2.4,0.064,3.0,5.5,5.5,5.5,0.0,"M: Pt; Coord: 4; OS: 2; IDs: 31_35; mean(d-Ce3Ce3): 5.5; Ce3-ONN: (3,0)<br>E (tot): -857.434; E (met): 0.135; E (glob): -0.208<br>Dir: /calcs/final_sampling/pt/4o_coord/2ce3/pos_31_35/sec-gamma/"
-0.205982830000039,4,2,18.56,3,0,8.2,2.0,2.0,2.1,0.058,32.7,0.7071067811865475,4.7,6.3,2.263,18.4,2.2,2.3,2.4,0.076,3.0,5.5,5.5,5.5,0.0,"M: Pt; Coord: 4; OS: 2; IDs: 28_32; mean(d-Ce3Ce3): 5.5; Ce3-ONN: (3,0)<br>E (tot): -857.432; E (met): 0.137; E (glob): -0.206<br>Dir: /calcs/final_sampling/pt/4o_coord/2ce3/pos_28_32/sec-gamma/"
-0.1936047300000609,4,2,18.56,5,0,8.1,2.0,2.0,2.1,0.05,32.6,0.7071067811865475,4.6,6.2,2.192,18.4,2.2,2.3,2.4,0.076,3.0,5.6,5.6,5.6,0.0,"M: Pt; Coord: 4; OS: 2; IDs: 29_36; mean(d-Ce3Ce3): 5.6; Ce3-ONN: (5,0)<br>E (tot): -857.419; E (met): 0.149; E (glob): -0.194<br>Dir: /calcs/final_sampling/pt/4o_coord/2ce3/pos_29_36/sec-gamma/"
-0.1874521400001185,4,2,18.56,4,0,8.1,2.0,2.0,2.1,0.05,32.5,0.7071067811865475,4.6,6.2,2.263,18.5,2.2,2.3,2.4,0.083,3.0,5.3,5.3,5.3,0.0,"M: Pt; Coord: 4; OS: 2; IDs: 30_35; mean(d-Ce3Ce3): 5.3; Ce3-ONN: (4,0)<br>E (tot): -857.413; E (met): 0.156; E (glob): -0.187<br>Dir: /calcs/final_sampling/pt/4o_coord/2ce3/pos_30_35/sec-gamma/"
-0.1637542400001166,4,2,18.56,3,0,8.2,2.0,2.0,2.1,0.058,32.6,0.7071067811865475,4.6,6.2,2.192,18.4,2.2,2.3,2.4,0.093,3.0,4.2,4.2,4.2,0.0,"M: Pt; Coord: 4; OS: 2; IDs: 32_35; mean(d-Ce3Ce3): 4.2; Ce3-ONN: (3,0)<br>E (tot): -857.389; E (met): 0.179; E (glob): -0.164<br>Dir: /calcs/final_sampling/pt/4o_coord/2ce3/pos_32_35/sec-gamma/"
-0.1629433100000596,4,2,18.56,5,0,8.1,2.0,2.0,2.1,0.05,32.6,0.7071067811865475,4.6,6.2,2.192,18.4,2.2,2.3,2.4,0.076,3.0,4.0,4.0,4.0,0.0,"M: Pt; Coord: 4; OS: 2; IDs: 34_36; mean(d-Ce3Ce3): 4.0; Ce3-ONN: (5,0)<br>E (tot): -857.388; E (met): 0.18; E (glob): -0.163<br>Dir: /calcs/final_sampling/pt/4o_coord/2ce3/pos_34_36/sec-gamma/"
-0.159761450000019,4,2,18.56,4,0,8.2,2.0,2.0,2.1,0.058,32.6,0.7071067811865475,4.6,6.2,2.192,18.4,2.2,2.3,2.4,0.093,3.0,4.0,4.0,4.0,0.0,"M: Pt; Coord: 4; OS: 2; IDs: 35_36; mean(d-Ce3Ce3): 4.0; Ce3-ONN: (4,0)<br>E (tot): -857.385; E (met): 0.183; E (glob): -0.16<br>Dir: /calcs/final_sampling/pt/4o_coord/2ce3/pos_35_36/sec-gamma/"
-0.1108303500000147,4,2,18.56,5,0,8.1,2.0,2.0,2.1,0.05,32.6,0.7071067811865475,4.6,6.2,2.192,18.5,2.2,2.3,2.5,0.099,3.0,4.0,4.0,4.0,0.0,"M: Pt; Coord: 4; OS: 2; IDs: 29_30; mean(d-Ce3Ce3): 4.0; Ce3-ONN: (5,0)<br>E (tot): -857.336; E (met): 0.232; E (glob): -0.111<br>Dir: /calcs/final_sampling/pt/4o_coord/2ce3/pos_29_30/sec-gamma/"
-0.0884483600000294,4,2,18.56,4,0,8.1,2.0,2.0,2.1,0.05,32.5,0.7071067811865475,4.6,6.2,2.263,18.4,2.2,2.3,2.4,0.093,3.0,5.4,5.4,5.4,0.0,"M: Pt; Coord: 4; OS: 2; IDs: 28_36; mean(d-Ce3Ce3): 5.4; Ce3-ONN: (4,0)<br>E (tot): -857.314; E (met): 0.255; E (glob): -0.088<br>Dir: /calcs/final_sampling/pt/4o_coord/2ce3/pos_28_36/sec-gamma/"
-0.0839477200000828,4,2,18.56,3,0,8.2,2.0,2.0,2.1,0.058,32.6,0.7071067811865475,4.6,6.2,2.192,18.4,2.2,2.3,2.4,0.093,3.0,4.2,4.2,4.2,0.0,"M: Pt; Coord: 4; OS: 2; IDs: 28_31; mean(d-Ce3Ce3): 4.2; Ce3-ONN: (3,0)<br>E (tot): -857.309; E (met): 0.259; E (glob): -0.084<br>Dir: /calcs/final_sampling/pt/4o_coord/2ce3/pos_28_31/sec-gamma/"
-0.0639306500000884,4,2,18.56,4,0,8.2,2.0,2.0,2.1,0.058,34.6,0.7071067811865475,5.6,8.2,3.606,18.5,2.2,2.3,2.4,0.083,3.0,5.7,5.7,5.7,0.0,"M: Pt; Coord: 4; OS: 2; IDs: 33_35; mean(d-Ce3Ce3): 5.7; Ce3-ONN: (4,0)<br>E (tot): -857.289; E (met): 0.279; E (glob): -0.064<br>Dir: /calcs/final_sampling/pt/4o_coord/2ce3/pos_33_35/sec-gamma/"
-0.0423226500000737,4,2,18.56,6,0,8.3,2.0,2.1,2.1,0.05,29.5,0.7071067811865475,3.1,3.1,0.0,18.4,2.2,2.3,2.4,0.107,3.0,5.5,5.5,5.5,0.0,"M: Pt; Coord: 4; OS: 2; IDs: 29_34; mean(d-Ce3Ce3): 5.5; Ce3-ONN: (6,0)<br>E (tot): -857.268; E (met): 0.301; E (glob): -0.042<br>Dir: /calcs/final_sampling/pt/4o_coord/2ce3/pos_29_34/sec-gamma/"
-0.0020953200000803,4,2,18.56,3,1,8.3,2.0,2.1,2.1,0.05,29.4,0.7071067811865475,3.0,3.1,0.071,18.4,2.2,2.3,2.4,0.093,3.0,3.7,3.7,3.7,0.0,"M: Pt; Coord: 4; OS: 2; IDs: 28_29; mean(d-Ce3Ce3): 3.7; Ce3-ONN: (3,1)<br>E (tot): -857.228; E (met): 0.341; E (glob): -0.002<br>Dir: /calcs/final_sampling/pt/4o_coord/2ce3/pos_28_29/sec-gamma/"
0.014090739999915,4,2,18.56,4,0,8.1,2.0,2.0,2.1,0.05,32.6,0.7071067811865475,4.6,6.2,2.192,18.4,2.2,2.3,2.4,0.093,3.0,3.9,3.9,3.9,0.0,"M: Pt; Coord: 4; OS: 2; IDs: 28_30; mean(d-Ce3Ce3): 3.9; Ce3-ONN: (4,0)<br>E (tot): -857.211; E (met): 0.357; E (glob): 0.014<br>Dir: /calcs/final_sampling/pt/4o_coord/2ce3/pos_28_30/sec-gamma/"
0.0188351399999646,4,2,18.56,3,1,8.2,2.0,2.0,2.1,0.058,29.4,0.7071067811865475,3.0,3.1,0.071,18.4,2.2,2.3,2.4,0.076,3.0,3.8,3.8,3.8,0.0,"M: Pt; Coord: 4; OS: 2; IDs: 29_35; mean(d-Ce3Ce3): 3.8; Ce3-ONN: (3,1)<br>E (tot): -857.207; E (met): 0.362; E (glob): 0.019<br>Dir: /calcs/final_sampling/pt/4o_coord/2ce3/pos_29_35/sec-gamma/"
0.0277656599998863,2,1,8.9587,2,0,27.1,1.9,1.9,1.9,0.0,38.2,0.7071067811865475,3.3,3.3,0.0,56.4,2.4,2.4,2.6,0.1,3.0,4.718085106382979,4.718085106382979,4.718085106382979,0.0,"M: Pt; Coord: 2; OS: 1; IDs: 35; mean(d-Ce3Ce3): 4.718; Ce3-ONN: (2,0)<br>E (tot): -857.198; E (met): 0.371; E (glob): 0.028<br>Dir: /calcs/final_sampling/pt/2o_coord/2ce3/pos_32_35/sec-gamma/"
0.0279191199999786,2,1,8.9587,2,0,27.1,1.9,1.9,1.9,0.0,38.2,0.7071067811865475,3.3,3.3,0.0,56.4,2.4,2.4,2.6,0.1,3.0,4.718085106382979,4.718085106382979,4.718085106382979,0.0,"M: Pt; Coord: 2; OS: 1; IDs: 29; mean(d-Ce3Ce3): 4.718; Ce3-ONN: (2,0)<br>E (tot): -857.198; E (met): 0.371; E (glob): 0.028<br>Dir: /calcs/final_sampling/pt/2o_coord/2ce3/pos_29_30/sec-gamma/"
0.0281403899999759,2,1,8.9587,2,0,27.1,1.9,1.9,1.9,0.0,38.2,0.7071067811865475,3.3,3.3,0.0,56.4,2.4,2.4,2.6,0.1,3.0,4.718085106382979,4.718085106382979,4.718085106382979,0.0,"M: Pt; Coord: 2; OS: 1; IDs: 34; mean(d-Ce3Ce3): 4.718; Ce3-ONN: (2,0)<br>E (tot): -857.197; E (met): 0.371; E (glob): 0.028<br>Dir: /calcs/final_sampling/pt/2o_coord/1ce3/pos_34/sec-gamma/"
0.0286610899999004,2,1,8.9587,2,0,27.1,1.9,1.9,1.9,0.0,38.2,0.7071067811865475,3.3,3.3,0.0,56.3,2.4,2.4,2.5,0.05,3.0,4.718085106382979,4.718085106382979,4.718085106382979,0.0,"M: Pt; Coord: 2; OS: 1; IDs: 28; mean(d-Ce3Ce3): 4.718; Ce3-ONN: (2,0)<br>E (tot): -857.197; E (met): 0.372; E (glob): 0.029<br>Dir: /calcs/final_sampling/pt/2o_coord/2ce3/pos_28_31/sec-gamma/"
0.074041179999881,4,2,18.56,3,1,8.2,2.0,2.0,2.1,0.058,29.5,0.7071067811865475,3.1,3.1,0.0,18.3,2.2,2.3,2.4,0.083,3.0,3.7,3.7,3.7,0.0,"M: Pt; Coord: 4; OS: 2; IDs: 34_35; mean(d-Ce3Ce3): 3.7; Ce3-ONN: (3,1)<br>E (tot): -857.151; E (met): 0.417; E (glob): 0.074<br>Dir: /calcs/final_sampling/pt/4o_coord/2ce3/pos_34_35/sec-gamma/"
0.0778388499999209,2,2,18.56,4,0,27.1,1.9,1.9,1.9,0.0,29.9,0.7071067811865475,3.3,3.3,0.0,56.9,2.5,2.6,2.7,0.096,3.0,5.8,5.8,5.8,0.0,"M: Pt; Coord: 2; OS: 2; IDs: 29_34; mean(d-Ce3Ce3): 5.8; Ce3-ONN: (4,0)<br>E (tot): -857.148; E (met): 0.421; E (glob): 0.078<br>Dir: /calcs/final_sampling/pt/2o_coord/2ce3/pos_29_34/sec-gamma/"
0.0827515399998901,4,2,18.56,5,0,8.1,2.0,2.0,2.1,0.05,32.7,0.7071067811865475,4.7,6.2,2.121,18.4,2.2,2.3,2.4,0.076,3.0,5.6,5.6,5.6,0.0,"M: Pt; Coord: 4; OS: 2; IDs: 30_34; mean(d-Ce3Ce3): 5.6; Ce3-ONN: (5,0)<br>E (tot): -857.143; E (met): 0.426; E (glob): 0.083<br>Dir: /calcs/final_sampling/pt/4o_coord/2ce3/pos_30_34/sec-gamma/"
0.0956388099999685,4,2,18.56,3,1,8.2,2.0,2.0,2.1,0.058,29.4,0.7071067811865475,3.0,3.1,0.071,18.4,2.2,2.3,2.4,0.076,3.0,3.8,3.8,3.8,0.0,"M: Pt; Coord: 4; OS: 2; IDs: 28_34; mean(d-Ce3Ce3): 3.8; Ce3-ONN: (3,1)<br>E (tot): -857.13; E (met): 0.439; E (glob): 0.096<br>Dir: /calcs/final_sampling/pt/4o_coord/2ce3/pos_28_34/sec-gamma/"
0.0970044799998959,2,2,18.56,4,0,27.1,1.9,1.9,1.9,0.0,29.9,0.7071067811865475,3.3,3.3,0.0,56.8,2.5,2.6,2.6,0.058,3.0,3.8,3.8,3.8,0.0,"M: Pt; Coord: 2; OS: 2; IDs: 34_35; mean(d-Ce3Ce3): 3.8; Ce3-ONN: (4,0)<br>E (tot): -857.129; E (met): 0.44; E (glob): 0.097<br>Dir: /calcs/final_sampling/pt/2o_coord/2ce3/pos_34_35/sec-gamma/"
0.1057120999998915,2,1,8.9587,2,0,27.1,1.9,1.9,1.9,0.0,41.2,1.5811388300841898,6.3,6.3,0.0,56.2,2.4,2.4,2.4,0.0,3.0,4.718085106382979,4.718085106382979,4.718085106382979,0.0,"M: Pt; Coord: 2; OS: 1; IDs: 32; mean(d-Ce3Ce3): 4.718; Ce3-ONN: (2,0)<br>E (tot): -857.12; E (met): 0.449; E (glob): 0.106<br>Dir: /calcs/final_sampling/pt/2o_coord/2ce3/pos_32_33/sec-gamma/"
0.107754019999902,2,1,8.9587,2,0,27.1,1.9,1.9,1.9,0.0,41.2,1.5811388300841898,6.3,6.3,0.0,56.2,2.4,2.4,2.4,0.0,3.0,4.718085106382979,4.718085106382979,4.718085106382979,0.0,"M: Pt; Coord: 2; OS: 1; IDs: 31; mean(d-Ce3Ce3): 4.718; Ce3-ONN: (2,0)<br>E (tot): -857.118; E (met): 0.451; E (glob): 0.108<br>Dir: /calcs/final_sampling/pt/2o_coord/2ce3/pos_31_34/sec-gamma/"
0.1215082999999594,4,2,18.56,2,1,8.1,2.0,2.0,2.1,0.05,32.8,0.7071067811865475,4.8,6.3,2.192,18.6,2.2,2.3,2.5,0.116,3.0,3.6,3.6,3.6,0.0,"M: Pt; Coord: 4; OS: 2; IDs: 31_34; mean(d-Ce3Ce3): 3.6; Ce3-ONN: (2,1)<br>E (tot): -857.104; E (met): 0.464; E (glob): 0.122<br>Dir: /calcs/final_sampling/pt/4o_coord/2ce3/pos_31_34/sec-gamma/"
0.1275880199999619,2,2,18.56,4,0,27.1,1.9,1.9,1.9,0.0,30.1,0.7071067811865475,3.4,3.4,0.0,57.0,2.5,2.6,2.7,0.115,3.0,3.8,3.8,3.8,0.0,"M: Pt; Coord: 2; OS: 2; IDs: 28_29; mean(d-Ce3Ce3): 3.8; Ce3-ONN: (4,0)<br>E (tot): -857.098; E (met): 0.471; E (glob): 0.128<br>Dir: /calcs/final_sampling/pt/2o_coord/2ce3/pos_28_29/sec-gamma/"
0.1676215799999454,2,1,8.9587,2,0,27.1,1.9,1.9,1.9,0.0,41.2,1.5811388300841898,6.3,6.3,0.0,56.2,2.4,2.4,2.4,0.0,3.0,4.718085106382979,4.718085106382979,4.718085106382979,0.0,"M: Pt; Coord: 2; OS: 1; IDs: 30; mean(d-Ce3Ce3): 4.718; Ce3-ONN: (2,0)<br>E (tot): -857.058; E (met): 0.511; E (glob): 0.168<br>Dir: /calcs/final_sampling/pt/2o_coord/2ce3/pos_30_35/sec-gamma/"
0.1711190799999258,2,1,8.9587,2,0,27.1,1.9,1.9,1.9,0.0,43.2,2.121320343559643,8.3,8.3,0.0,56.3,2.4,2.4,2.5,0.05,3.0,4.718085106382979,4.718085106382979,4.718085106382979,0.0,"M: Pt; Coord: 2; OS: 1; IDs: 33; mean(d-Ce3Ce3): 4.718; Ce3-ONN: (2,0)<br>E (tot): -857.054; E (met): 0.514; E (glob): 0.171<br>Dir: /calcs/final_sampling/pt/2o_coord/2ce3/pos_28_33/sec-gamma/"
0.178166709999914,2,2,18.56,4,0,27.1,1.9,1.9,1.9,0.0,29.9,0.7071067811865475,3.3,3.3,0.0,56.8,2.5,2.6,2.6,0.058,3.0,5.8,5.8,5.8,0.0,"M: Pt; Coord: 2; OS: 2; IDs: 28_35; mean(d-Ce3Ce3): 5.8; Ce3-ONN: (4,0)<br>E (tot): -857.047; E (met): 0.521; E (glob): 0.178<br>Dir: /calcs/final_sampling/pt/2o_coord/2ce3/pos_28_35/sec-gamma/"
0.180653179999922,4,2,18.56,4,0,8.2,2.0,2.0,2.1,0.058,29.3,0.7071067811865475,3.0,3.0,0.0,18.2,2.2,2.3,2.4,0.089,3.0,5.2,5.2,5.2,0.0,"M: Pt; Coord: 4; OS: 2; IDs: 28_35; mean(d-Ce3Ce3): 5.2; Ce3-ONN: (4,0)<br>E (tot): -857.045; E (met): 0.524; E (glob): 0.181<br>Dir: /calcs/final_sampling/pt/4o_coord/2ce3/pos_28_35/sec-gamma/"
0.2001881399999092,2,1,8.9587,2,0,27.1,1.9,1.9,1.9,0.0,41.2,1.5811388300841898,6.3,6.3,0.0,56.2,2.4,2.4,2.4,0.0,3.0,4.718085106382979,4.718085106382979,4.718085106382979,0.0,"M: Pt; Coord: 2; OS: 1; IDs: 36; mean(d-Ce3Ce3): 4.718; Ce3-ONN: (2,0)<br>E (tot): -857.025; E (met): 0.543; E (glob): 0.2<br>Dir: /calcs/final_sampling/pt/2o_coord/1ce3/pos_36/sec-gamma/"
0.2005881399999225,2,2,18.56,4,0,27.1,1.9,1.9,1.9,0.0,32.9,0.7071067811865475,4.8,6.3,2.121,56.7,2.5,2.5,2.6,0.05,3.0,5.3,5.3,5.3,0.0,"M: Pt; Coord: 2; OS: 2; IDs: 29_31; mean(d-Ce3Ce3): 5.3; Ce3-ONN: (4,0)<br>E (tot): -857.025; E (met): 0.544; E (glob): 0.201<br>Dir: /calcs/final_sampling/pt/2o_coord/2ce3/pos_29_31/sec-gamma/"
0.2218363799998997,2,2,18.56,4,0,27.1,1.9,1.9,1.9,0.0,32.9,0.7071067811865475,4.8,6.3,2.121,57.0,2.5,2.6,2.7,0.082,3.0,5.3,5.3,5.3,0.0,"M: Pt; Coord: 2; OS: 2; IDs: 32_34; mean(d-Ce3Ce3): 5.3; Ce3-ONN: (4,0)<br>E (tot): -857.004; E (met): 0.565; E (glob): 0.222<br>Dir: /calcs/final_sampling/pt/2o_coord/2ce3/pos_32_34/sec-gamma/"
0.224612749999892,2,2,18.56,4,0,27.1,1.9,1.9,1.9,0.0,32.9,0.7071067811865475,4.8,6.3,2.121,57.0,2.5,2.6,2.7,0.082,3.0,5.3,5.3,5.3,0.0,"M: Pt; Coord: 2; OS: 2; IDs: 31_35; mean(d-Ce3Ce3): 5.3; Ce3-ONN: (4,0)<br>E (tot): -857.001; E (met): 0.568; E (glob): 0.225<br>Dir: /calcs/final_sampling/pt/2o_coord/2ce3/pos_31_35/sec-gamma/"
0.2450439399999595,4,2,18.56,2,1,8.0,2.0,2.0,2.0,0.0,37.8,1.5811388300841898,7.2,8.3,1.485,18.4,2.2,2.3,2.4,0.076,3.0,3.9,3.9,3.9,0.0,"M: Pt; Coord: 4; OS: 2; IDs: 30_33; mean(d-Ce3Ce3): 3.9; Ce3-ONN: (2,1)<br>E (tot): -856.98; E (met): 0.588; E (glob): 0.245<br>Dir: /calcs/final_sampling/pt/4o_coord/2ce3/pos_30_33/sec-gamma/"
0.2485935399998879,4,2,18.56,2,1,8.1,2.0,2.0,2.1,0.05,32.9,0.7071067811865475,4.8,6.4,2.263,18.6,2.2,2.3,2.5,0.116,3.0,3.6,3.6,3.6,0.0,"M: Pt; Coord: 4; OS: 2; IDs: 29_32; mean(d-Ce3Ce3): 3.6; Ce3-ONN: (2,1)<br>E (tot): -856.977; E (met): 0.592; E (glob): 0.249<br>Dir: /calcs/final_sampling/pt/4o_coord/2ce3/pos_29_32/sec-gamma/"
0.2774985499999047,2,0,0.0,0,0,27.3,2.0,2.0,2.0,0.0,46.6,3.0,5.246666666666667,5.954814814814815,0.0,56.2,2.4,2.4,2.4,0.0,3.0,4.718085106382979,4.718085106382979,4.718085106382979,0.0,"M: Pt; Coord: 2; OS: 0; IDs: 0; mean(d-Ce3Ce3): 4.718; Ce3-ONN: (0,0)<br>E (tot): -856.948; E (met): 0.62; E (glob): 0.277<br>Dir: /calcs/final_sampling/pt/2o_coord/0ce3/pos_00/sec-gamma/"
0.3183859199999688,2,2,18.56,4,0,27.1,1.9,1.9,1.9,0.0,32.9,0.7071067811865475,4.8,6.3,2.121,56.7,2.5,2.5,2.6,0.05,3.0,5.7,5.7,5.7,0.0,"M: Pt; Coord: 2; OS: 2; IDs: 28_36; mean(d-Ce3Ce3): 5.7; Ce3-ONN: (4,0)<br>E (tot): -856.907; E (met): 0.661; E (glob): 0.318<br>Dir: /calcs/final_sampling/pt/2o_coord/2ce3/pos_28_36/sec-gamma/"
0.336848199999963,4,2,18.56,2,1,8.0,2.0,2.0,2.0,0.0,35.8,1.5811388300841898,6.2,6.3,0.071,18.4,2.2,2.3,2.4,0.076,3.0,3.8,3.8,3.8,0.0,"M: Pt; Coord: 4; OS: 2; IDs: 30_36; mean(d-Ce3Ce3): 3.8; Ce3-ONN: (2,1)<br>E (tot): -856.889; E (met): 0.68; E (glob): 0.337<br>Dir: /calcs/final_sampling/pt/4o_coord/2ce3/pos_30_36/sec-gamma/"
0.3459524299998975,2,2,18.56,4,0,27.1,1.9,1.9,1.9,0.0,34.9,0.7071067811865475,5.8,8.3,3.536,56.9,2.5,2.6,2.6,0.05,3.0,5.3,5.3,5.3,0.0,"M: Pt; Coord: 2; OS: 2; IDs: 29_33; mean(d-Ce3Ce3): 5.3; Ce3-ONN: (4,0)<br>E (tot): -856.88; E (met): 0.689; E (glob): 0.346<br>Dir: /calcs/final_sampling/pt/2o_coord/2ce3/pos_29_33/sec-gamma/"
0.3505332299998827,2,2,18.56,4,0,27.1,1.9,1.9,1.9,0.0,33.0,0.7071067811865475,4.8,6.3,2.051,57.0,2.5,2.6,2.7,0.082,3.0,5.7,5.7,5.7,0.0,"M: Pt; Coord: 2; OS: 2; IDs: 29_36; mean(d-Ce3Ce3): 5.7; Ce3-ONN: (4,0)<br>E (tot): -856.875; E (met): 0.694; E (glob): 0.351<br>Dir: /calcs/final_sampling/pt/2o_coord/2ce3/pos_29_36/sec-gamma/"
0.3528004499999042,4,2,18.56,2,1,8.0,2.0,2.0,2.0,0.0,37.8,1.5811388300841898,7.2,8.3,1.485,18.5,2.2,2.3,2.4,0.064,3.0,3.9,3.9,3.9,0.0,"M: Pt; Coord: 4; OS: 2; IDs: 33_36; mean(d-Ce3Ce3): 3.9; Ce3-ONN: (2,1)<br>E (tot): -856.873; E (met): 0.696; E (glob): 0.353<br>Dir: /calcs/final_sampling/pt/4o_coord/2ce3/pos_33_36/sec-gamma/"
0.3554342699999324,2,2,18.56,4,0,27.1,1.9,1.9,1.9,0.0,35.0,0.7071067811865475,5.9,8.3,3.465,56.9,2.5,2.6,2.7,0.096,3.0,5.3,5.3,5.3,0.0,"M: Pt; Coord: 2; OS: 2; IDs: 33_35; mean(d-Ce3Ce3): 5.3; Ce3-ONN: (4,0)<br>E (tot): -856.87; E (met): 0.698; E (glob): 0.355<br>Dir: /calcs/final_sampling/pt/2o_coord/2ce3/pos_33_35/sec-gamma/"
0.3685397099999363,2,2,18.56,2,1,27.0,1.8,1.8,1.9,0.071,30.1,0.7071067811865475,3.4,3.4,0.0,57.0,2.6,2.6,2.6,0.0,3.0,4.2,4.2,4.2,0.0,"M: Pt; Coord: 2; OS: 2; IDs: 28_34; mean(d-Ce3Ce3): 4.2; Ce3-ONN: (2,1)<br>E (tot): -856.857; E (met): 0.712; E (glob): 0.369<br>Dir: /calcs/final_sampling/pt/2o_coord/2ce3/pos_28_34/sec-gamma/"
0.3810704299999088,2,2,18.56,4,0,27.1,1.9,1.9,1.9,0.0,32.9,0.7071067811865475,4.8,6.3,2.121,56.9,2.5,2.6,2.7,0.096,3.0,3.9,3.9,3.9,0.0,"M: Pt; Coord: 2; OS: 2; IDs: 35_36; mean(d-Ce3Ce3): 3.9; Ce3-ONN: (4,0)<br>E (tot): -856.844; E (met): 0.724; E (glob): 0.381<br>Dir: /calcs/final_sampling/pt/2o_coord/2ce3/pos_35_36/sec-gamma/"
0.3886291899999605,2,2,18.56,4,0,27.1,1.9,1.9,1.9,0.0,35.9,1.5811388300841898,6.3,6.3,0.0,57.0,2.6,2.6,2.6,0.0,3.0,3.9,3.9,3.9,0.0,"M: Pt; Coord: 2; OS: 2; IDs: 31_32; mean(d-Ce3Ce3): 3.9; Ce3-ONN: (4,0)<br>E (tot): -856.837; E (met): 0.732; E (glob): 0.389<br>Dir: /calcs/final_sampling/pt/2o_coord/2ce3/pos_31_32/sec-gamma/"
0.4572309599999471,2,2,18.56,4,0,27.1,1.9,1.9,1.9,0.0,35.0,0.7071067811865475,5.9,8.3,3.465,56.7,2.5,2.5,2.6,0.05,3.0,5.3,5.3,5.3,0.0,"M: Pt; Coord: 2; OS: 2; IDs: 33_34; mean(d-Ce3Ce3): 5.3; Ce3-ONN: (4,0)<br>E (tot): -856.768; E (met): 0.8; E (glob): 0.457<br>Dir: /calcs/final_sampling/pt/2o_coord/2ce3/pos_33_34/sec-gamma/"
0.4580205399998931,2,2,18.56,4,0,27.1,1.9,1.9,1.9,0.0,33.0,0.7071067811865475,4.8,6.3,2.051,56.7,2.5,2.5,2.6,0.05,3.0,5.6,5.6,5.6,0.0,"M: Pt; Coord: 2; OS: 2; IDs: 30_34; mean(d-Ce3Ce3): 5.6; Ce3-ONN: (4,0)<br>E (tot): -856.767; E (met): 0.801; E (glob): 0.458<br>Dir: /calcs/final_sampling/pt/2o_coord/2ce3/pos_30_34/sec-gamma/"
0.5379936599999837,3,2,18.56,3,0,17.6,1.9,2.0,2.0,0.058,32.6,0.7071067811865475,4.6,6.1,2.051,46.6,2.2,2.3,2.5,0.11,3.0,5.4,5.4,5.4,0.0,"M: Pt; Coord: 3; OS: 2; IDs: 29_31; mean(d-Ce3Ce3): 5.4; Ce3-ONN: (3,0)<br>E (tot): -856.688; E (met): 0.881; E (glob): 0.538<br>Dir: /calcs/final_sampling/pt/3o2_coord/2ce3/pos_29_31/sec-gamma/"
0.572192399999949,3,2,18.56,3,0,17.6,1.9,2.0,2.0,0.058,35.7,1.5811388300841898,6.2,6.2,0.0,46.6,2.3,2.3,2.4,0.055,3.0,5.7,5.7,5.7,0.0,"M: Pt; Coord: 3; OS: 2; IDs: 30_31; mean(d-Ce3Ce3): 5.7; Ce3-ONN: (3,0)<br>E (tot): -856.653; E (met): 0.915; E (glob): 0.572<br>Dir: /calcs/final_sampling/pt/3o2_coord/2ce3/pos_30_31/sec-gamma/"
0.5788186899999346,3,2,18.56,3,0,17.6,1.9,2.0,2.0,0.058,35.7,1.5811388300841898,6.2,6.2,0.0,46.6,2.3,2.3,2.4,0.055,3.0,5.3,5.3,5.3,0.0,"M: Pt; Coord: 3; OS: 2; IDs: 31_36; mean(d-Ce3Ce3): 5.3; Ce3-ONN: (3,0)<br>E (tot): -856.647; E (met): 0.922; E (glob): 0.579<br>Dir: /calcs/final_sampling/pt/3o2_coord/2ce3/pos_31_36/sec-gamma/"
0.5903869499999246,3,2,18.56,3,0,17.6,1.9,2.0,2.0,0.058,37.8,1.5811388300841898,7.2,8.3,1.485,46.6,2.3,2.3,2.4,0.055,3.0,3.9,3.9,3.9,0.0,"M: Pt; Coord: 3; OS: 2; IDs: 31_33; mean(d-Ce3Ce3): 3.9; Ce3-ONN: (3,0)<br>E (tot): -856.635; E (met): 0.933; E (glob): 0.59<br>Dir: /calcs/final_sampling/pt/3o2_coord/2ce3/pos_31_33/sec-gamma/"
0.7057436299999154,3,2,18.56,4,0,17.6,1.9,2.0,2.1,0.1,29.8,0.7071067811865475,3.2,3.3,0.071,46.6,2.2,2.3,2.5,0.13,3.0,5.6,5.6,5.6,0.0,"M: Pt; Coord: 3; OS: 2; IDs: 29_34; mean(d-Ce3Ce3): 5.6; Ce3-ONN: (4,0)<br>E (tot): -856.52; E (met): 1.049; E (glob): 0.706<br>Dir: /calcs/final_sampling/pt/3o2_coord/2ce3/pos_29_34/sec-gamma/"
0.7223841599999332,3,2,18.56,4,0,17.6,1.9,2.0,2.0,0.058,32.8,0.7071067811865475,4.8,6.2,2.051,46.6,2.2,2.3,2.5,0.114,3.0,5.5,5.5,5.5,0.0,"M: Pt; Coord: 3; OS: 2; IDs: 30_34; mean(d-Ce3Ce3): 5.5; Ce3-ONN: (4,0)<br>E (tot): -856.503; E (met): 1.065; E (glob): 0.722<br>Dir: /calcs/final_sampling/pt/3o2_coord/2ce3/pos_30_34/sec-gamma/"
0.7449798299999202,3,2,18.56,4,0,17.6,1.9,2.0,2.0,0.058,32.8,0.7071067811865475,4.8,6.2,2.051,46.6,2.2,2.3,2.5,0.114,3.0,3.9,3.9,3.9,0.0,"M: Pt; Coord: 3; OS: 2; IDs: 34_36; mean(d-Ce3Ce3): 3.9; Ce3-ONN: (4,0)<br>E (tot): -856.481; E (met): 1.088; E (glob): 0.745<br>Dir: /calcs/final_sampling/pt/3o2_coord/2ce3/pos_34_36/sec-gamma/"
0.7607996999998932,3,2,18.56,3,0,17.6,1.8,2.0,2.1,0.153,32.8,0.7071067811865475,4.8,6.2,2.051,46.6,2.2,2.3,2.4,0.089,3.0,5.1,5.1,5.1,0.0,"M: Pt; Coord: 3; OS: 2; IDs: 31_35; mean(d-Ce3Ce3): 5.1; Ce3-ONN: (3,0)<br>E (tot): -856.465; E (met): 1.104; E (glob): 0.761<br>Dir: /calcs/final_sampling/pt/3o2_coord/2ce3/pos_31_35/sec-gamma/"
0.7757777299999589,3,2,18.56,4,0,17.6,1.9,2.0,2.0,0.058,34.8,0.7071067811865475,5.8,8.3,3.606,46.6,2.2,2.3,2.5,0.11,3.0,5.4,5.4,5.4,0.0,"M: Pt; Coord: 3; OS: 2; IDs: 29_33; mean(d-Ce3Ce3): 5.4; Ce3-ONN: (4,0)<br>E (tot): -856.45; E (met): 1.119; E (glob): 0.776<br>Dir: /calcs/final_sampling/pt/3o2_coord/2ce3/pos_29_33/sec-gamma/"
0.7883976999999049,3,2,18.56,4,0,17.6,1.9,2.0,2.0,0.058,32.8,0.7071067811865475,4.8,6.3,2.192,46.6,2.2,2.3,2.5,0.11,3.0,5.8,5.8,5.8,0.0,"M: Pt; Coord: 3; OS: 2; IDs: 29_36; mean(d-Ce3Ce3): 5.8; Ce3-ONN: (4,0)<br>E (tot): -856.437; E (met): 1.131; E (glob): 0.788<br>Dir: /calcs/final_sampling/pt/3o2_coord/2ce3/pos_29_36/sec-gamma/"
0.7963579499999014,3,2,18.56,3,0,17.6,1.9,2.0,2.0,0.058,37.6,1.5811388300841898,7.2,8.2,1.485,46.6,2.3,2.3,2.4,0.045,3.0,4.3,4.3,4.3,0.0,"M: Pt; Coord: 3; OS: 2; IDs: 33_36; mean(d-Ce3Ce3): 4.3; Ce3-ONN: (3,0)<br>E (tot): -856.429; E (met): 1.139; E (glob): 0.796<br>Dir: /calcs/final_sampling/pt/3o2_coord/2ce3/pos_33_36/sec-gamma/"
0.7972063199999866,3,2,18.56,2,1,17.6,1.9,2.0,2.0,0.058,30.0,0.7071067811865475,3.4,3.4,0.071,46.6,2.2,2.3,2.4,0.084,3.0,3.8,3.8,3.8,0.0,"M: Pt; Coord: 3; OS: 2; IDs: 28_34; mean(d-Ce3Ce3): 3.8; Ce3-ONN: (2,1)<br>E (tot): -856.428; E (met): 1.14; E (glob): 0.797<br>Dir: /calcs/final_sampling/pt/3o2_coord/2ce3/pos_28_34/sec-gamma/"
0.8019137799999498,3,2,18.56,4,0,17.6,1.9,2.0,2.0,0.058,32.8,0.7071067811865475,4.8,6.3,2.192,46.6,2.2,2.3,2.5,0.11,3.0,4.0,4.0,4.0,0.0,"M: Pt; Coord: 3; OS: 2; IDs: 29_30; mean(d-Ce3Ce3): 4.0; Ce3-ONN: (4,0)<br>E (tot): -856.424; E (met): 1.145; E (glob): 0.802<br>Dir: /calcs/final_sampling/pt/3o2_coord/2ce3/pos_29_30/sec-gamma/"
0.8426739299999326,3,2,18.56,3,0,17.6,1.9,2.0,2.0,0.058,35.8,1.5811388300841898,6.2,6.3,0.071,46.6,2.2,2.3,2.4,0.084,3.0,3.9,3.9,3.9,0.0,"M: Pt; Coord: 3; OS: 2; IDs: 31_32; mean(d-Ce3Ce3): 3.9; Ce3-ONN: (3,0)<br>E (tot): -856.383; E (met): 1.186; E (glob): 0.843<br>Dir: /calcs/final_sampling/pt/3o2_coord/2ce3/pos_31_32/sec-gamma/"
0.8647678699999233,3,2,18.56,3,0,17.6,1.9,2.0,2.1,0.1,34.7,0.7071067811865475,5.7,8.2,3.536,46.4,2.2,2.3,2.4,0.071,3.0,5.7,5.7,5.7,0.0,"M: Pt; Coord: 3; OS: 2; IDs: 28_33; mean(d-Ce3Ce3): 5.7; Ce3-ONN: (3,0)<br>E (tot): -856.361; E (met): 1.208; E (glob): 0.865<br>Dir: /calcs/final_sampling/pt/3o2_coord/2ce3/pos_28_33/sec-gamma/"
0.8698294699998996,3,2,18.56,4,0,17.6,1.9,2.0,2.0,0.058,34.8,0.7071067811865475,5.8,8.2,3.465,46.6,2.2,2.3,2.5,0.114,3.0,5.4,5.4,5.4,0.0,"M: Pt; Coord: 3; OS: 2; IDs: 33_34; mean(d-Ce3Ce3): 5.4; Ce3-ONN: (4,0)<br>E (tot): -856.356; E (met): 1.213; E (glob): 0.87<br>Dir: /calcs/final_sampling/pt/3o2_coord/2ce3/pos_33_34/sec-gamma/"
0.9003437599999415,3,2,18.56,3,0,17.6,1.9,2.0,2.1,0.1,32.7,0.7071067811865475,4.7,6.2,2.121,46.4,2.2,2.3,2.4,0.071,3.0,5.3,5.3,5.3,0.0,"M: Pt; Coord: 3; OS: 2; IDs: 28_36; mean(d-Ce3Ce3): 5.3; Ce3-ONN: (3,0)<br>E (tot): -856.325; E (met): 1.243; E (glob): 0.9<br>Dir: /calcs/final_sampling/pt/3o2_coord/2ce3/pos_28_36/sec-gamma/"
0.9103565299999444,3,2,18.56,1,1,17.6,1.9,2.0,2.0,0.058,32.9,0.7071067811865475,4.8,6.3,2.121,46.6,2.2,2.3,2.5,0.11,3.0,3.6,3.6,3.6,0.0,"M: Pt; Coord: 3; OS: 2; IDs: 31_34; mean(d-Ce3Ce3): 3.6; Ce3-ONN: (1,1)<br>E (tot): -856.315; E (met): 1.253; E (glob): 0.91<br>Dir: /calcs/final_sampling/pt/3o2_coord/2ce3/pos_31_34/sec-gamma/"
0.9591452099999742,3,2,18.56,4,0,17.6,1.9,2.0,2.1,0.1,32.8,0.7071067811865475,4.8,6.2,2.051,46.6,2.2,2.3,2.5,0.13,3.0,5.4,5.4,5.4,0.0,"M: Pt; Coord: 3; OS: 2; IDs: 32_34; mean(d-Ce3Ce3): 5.4; Ce3-ONN: (4,0)<br>E (tot): -856.266; E (met): 1.302; E (glob): 0.959<br>Dir: /calcs/final_sampling/pt/3o2_coord/2ce3/pos_32_34/sec-gamma/"
1.0467994499999804,3,0,0.0,0,0,18.4,2.0,2.3,2.8,0.462,46.6,3.0,5.246666666666667,5.954814814814815,0.0,36.9,2.2,2.3,2.4,0.082,3.0,4.718085106382979,4.718085106382979,4.718085106382979,0.0,"M: Pt; Coord: 3; OS: 0; IDs: 0; mean(d-Ce3Ce3): 4.718; Ce3-ONN: (0,0)<br>E (tot): -856.179; E (met): 1.39; E (glob): 1.047<br>Dir: /calcs/final_sampling/pt/3o2_coord/0ce3/pos_00/sec-gamma/"
1.0680922699999655,3,1,8.9587,1,0,17.8,2.0,2.1,2.1,0.058,41.2,1.5811388300841898,6.3,6.3,0.0,37.0,2.2,2.3,2.4,0.075,3.0,4.718085106382979,4.718085106382979,4.718085106382979,0.0,"M: Pt; Coord: 3; OS: 1; IDs: 31; mean(d-Ce3Ce3): 4.718; Ce3-ONN: (1,0)<br>E (tot): -856.157; E (met): 1.411; E (glob): 1.068<br>Dir: /calcs/final_sampling/pt/3o2_coord/1ce3/pos_35/sec-gamma/"
1.0725304899999628,3,2,18.56,4,0,17.6,1.8,2.0,2.1,0.153,35.8,1.5811388300841898,6.2,6.3,0.071,46.6,2.2,2.3,2.5,0.11,3.0,5.4,5.4,5.4,0.0,"M: Pt; Coord: 3; OS: 2; IDs: 32_36; mean(d-Ce3Ce3): 5.4; Ce3-ONN: (4,0)<br>E (tot): -856.153; E (met): 1.416; E (glob): 1.073<br>Dir: /calcs/final_sampling/pt/3o2_coord/2ce3/pos_32_36/sec-gamma/"
1.1139623599999595,3,1,8.9587,2,0,17.8,2.0,2.0,2.1,0.058,43.2,2.121320343559643,8.3,8.3,0.0,37.1,2.3,2.3,2.3,0.0,3.0,4.718085106382979,4.718085106382979,4.718085106382979,0.0,"M: Pt; Coord: 3; OS: 1; IDs: 33; mean(d-Ce3Ce3): 4.718; Ce3-ONN: (2,0)<br>E (tot): -856.112; E (met): 1.457; E (glob): 1.114<br>Dir: /calcs/final_sampling/pt/3o2_coord/2ce3/pos_33_35/sec-gamma/"
1.1196882899998857,3,1,8.9587,2,0,17.8,2.0,2.0,2.1,0.058,41.2,1.5811388300841898,6.2,6.2,0.0,37.1,2.3,2.3,2.3,0.0,3.0,4.718085106382979,4.718085106382979,4.718085106382979,0.0,"M: Pt; Coord: 3; OS: 1; IDs: 30; mean(d-Ce3Ce3): 4.718; Ce3-ONN: (2,0)<br>E (tot): -856.106; E (met): 1.463; E (glob): 1.12<br>Dir: /calcs/final_sampling/pt/3o2_coord/2ce3/pos_30_35/sec-gamma/"
1.1307746299999053,3,2,18.56,4,0,17.6,1.8,2.0,2.1,0.153,29.9,0.7071067811865475,3.3,3.3,0.0,46.6,2.2,2.3,2.4,0.11,3.0,3.8,3.8,3.8,0.0,"M: Pt; Coord: 3; OS: 2; IDs: 34_35; mean(d-Ce3Ce3): 3.8; Ce3-ONN: (4,0)<br>E (tot): -856.095; E (met): 1.474; E (glob): 1.131<br>Dir: /calcs/final_sampling/pt/3o2_coord/2ce3/pos_34_35/sec-gamma/"
1.131671859999983,3,2,18.56,3,0,17.6,1.9,2.0,2.1,0.1,32.7,0.7071067811865475,4.7,6.2,2.121,46.4,2.2,2.3,2.4,0.071,3.0,3.9,3.9,3.9,0.0,"M: Pt; Coord: 3; OS: 2; IDs: 28_30; mean(d-Ce3Ce3): 3.9; Ce3-ONN: (3,0)<br>E (tot): -856.094; E (met): 1.475; E (glob): 1.132<br>Dir: /calcs/final_sampling/pt/3o2_coord/2ce3/pos_28_30/sec-gamma/"
1.1731833399999232,3,2,18.56,4,0,17.4,1.8,1.9,2.0,0.115,37.9,1.5811388300841898,7.3,8.3,1.414,46.6,2.2,2.3,2.5,0.11,3.0,3.8,3.8,3.8,0.0,"M: Pt; Coord: 3; OS: 2; IDs: 32_33; mean(d-Ce3Ce3): 3.8; Ce3-ONN: (4,0)<br>E (tot): -856.052; E (met): 1.516; E (glob): 1.173<br>Dir: /calcs/final_sampling/pt/3o2_coord/2ce3/pos_32_33/sec-gamma/"
1.1886689899998828,3,1,8.9587,2,0,18.0,2.0,2.1,2.2,0.1,38.2,0.7071067811865475,3.2,3.2,0.0,37.1,2.2,2.3,2.4,0.063,3.0,4.718085106382979,4.718085106382979,4.718085106382979,0.0,"M: Pt; Coord: 3; OS: 1; IDs: 29; mean(d-Ce3Ce3): 4.718; Ce3-ONN: (2,0)<br>E (tot): -856.037; E (met): 1.532; E (glob): 1.189<br>Dir: /calcs/final_sampling/pt/3o2_coord/2ce3/pos_29_32/sec-gamma/"
1.199493699999948,3,1,8.9587,2,0,17.8,2.0,2.0,2.1,0.058,38.0,0.7071067811865475,3.0,3.0,0.0,37.0,2.2,2.3,2.4,0.098,3.0,4.718085106382979,4.718085106382979,4.718085106382979,0.0,"M: Pt; Coord: 3; OS: 1; IDs: 28; mean(d-Ce3Ce3): 4.718; Ce3-ONN: (2,0)<br>E (tot): -856.026; E (met): 1.542; E (glob): 1.199<br>Dir: /calcs/final_sampling/pt/3o2_coord/1ce3/pos_28/sec-gamma/"
1.2262265999999045,3,2,18.56,4,0,17.4,1.8,1.9,2.0,0.115,35.8,1.5811388300841898,6.2,6.3,0.071,46.6,2.2,2.3,2.5,0.11,3.0,5.4,5.4,5.4,0.0,"M: Pt; Coord: 3; OS: 2; IDs: 30_32; mean(d-Ce3Ce3): 5.4; Ce3-ONN: (4,0)<br>E (tot): -855.999; E (met): 1.569; E (glob): 1.226<br>Dir: /calcs/final_sampling/pt/3o2_coord/2ce3/pos_30_32/sec-gamma/"
1.2566173599999502,3,2,18.56,2,1,17.6,1.9,2.0,2.0,0.058,29.6,0.7071067811865475,3.2,3.4,0.354,37.7,2.3,2.4,2.6,0.126,3.0,3.7,3.7,3.7,0.0,"M: Pt; Coord: 3; OS: 2; IDs: 28_29; mean(d-Ce3Ce3): 3.7; Ce3-ONN: (2,1)<br>E (tot): -855.969; E (met): 1.6; E (glob): 1.257<br>Dir: /calcs/final_sampling/pt/3o2_coord/2ce3/pos_28_29/sec-gamma/"
1.2569359299999403,3,2,18.56,3,0,17.6,1.9,2.0,2.0,0.058,32.6,0.7071067811865475,4.6,6.3,2.333,37.9,2.2,2.4,2.9,0.25,3.0,4.2,4.2,4.2,0.0,"M: Pt; Coord: 3; OS: 2; IDs: 28_31; mean(d-Ce3Ce3): 4.2; Ce3-ONN: (3,0)<br>E (tot): -855.969; E (met): 1.6; E (glob): 1.257<br>Dir: /calcs/final_sampling/pt/3o2_coord/2ce3/pos_28_31/sec-gamma/"
1.3038150699999278,3,1,8.9587,3,0,18.0,2.0,2.1,2.2,0.1,38.2,0.7071067811865475,3.2,3.2,0.0,37.1,2.2,2.3,2.5,0.126,3.0,4.718085106382979,4.718085106382979,4.718085106382979,0.0,"M: Pt; Coord: 3; OS: 1; IDs: 34; mean(d-Ce3Ce3): 4.718; Ce3-ONN: (3,0)<br>E (tot): -855.922; E (met): 1.647; E (glob): 1.304<br>Dir: /calcs/final_sampling/pt/3o2_coord/1ce3/pos_34/sec-gamma/"
1.3215243999999302,3,2,18.56,4,0,17.6,1.9,2.0,2.0,0.058,29.6,0.7071067811865475,3.2,3.4,0.354,37.8,2.2,2.4,2.8,0.214,3.0,5.4,5.4,5.4,0.0,"M: Pt; Coord: 3; OS: 2; IDs: 28_35; mean(d-Ce3Ce3): 5.4; Ce3-ONN: (4,0)<br>E (tot): -855.904; E (met): 1.665; E (glob): 1.322<br>Dir: /calcs/final_sampling/pt/3o2_coord/2ce3/pos_28_35/sec-gamma/"
1.3378389399999833,3,1,8.9587,2,0,18.0,2.0,2.1,2.2,0.1,38.2,0.7071067811865475,3.3,3.3,0.0,37.0,2.2,2.3,2.4,0.075,3.0,4.718085106382979,4.718085106382979,4.718085106382979,0.0,"M: Pt; Coord: 3; OS: 1; IDs: 35; mean(d-Ce3Ce3): 4.718; Ce3-ONN: (2,0)<br>E (tot): -855.888; E (met): 1.681; E (glob): 1.338<br>Dir: /calcs/final_sampling/pt/3o2_coord/2ce3/pos_35_36/sec-gamma/"
1.3877902499999664,3,1,8.9587,2,0,18.0,2.0,2.1,2.2,0.1,41.2,1.5811388300841898,6.3,6.3,0.0,37.1,2.2,2.3,2.4,0.063,3.0,4.718085106382979,4.718085106382979,4.718085106382979,0.0,"M: Pt; Coord: 3; OS: 1; IDs: 32; mean(d-Ce3Ce3): 4.718; Ce3-ONN: (2,0)<br>E (tot): -855.838; E (met): 1.731; E (glob): 1.388<br>Dir: /calcs/final_sampling/pt/3o2_coord/2ce3/pos_32_35/sec-gamma/"
1.4282603399999516,3,2,18.56,2,1,17.6,1.9,2.0,2.0,0.058,35.7,1.5811388300841898,6.2,6.2,0.0,46.4,2.2,2.3,2.4,0.071,3.0,3.9,3.9,3.9,0.0,"M: Pt; Coord: 3; OS: 2; IDs: 30_36; mean(d-Ce3Ce3): 3.9; Ce3-ONN: (2,1)<br>E (tot): -855.797; E (met): 1.771; E (glob): 1.428<br>Dir: /calcs/final_sampling/pt/3o2_coord/2ce3/pos_30_36/sec-gamma/"
1.451553709999985,3,2,18.56,4,0,17.6,1.9,2.0,2.0,0.058,32.6,0.7071067811865475,4.6,6.4,2.475,37.8,2.3,2.4,2.8,0.204,3.0,5.7,5.7,5.7,0.0,"M: Pt; Coord: 3; OS: 2; IDs: 28_32; mean(d-Ce3Ce3): 5.7; Ce3-ONN: (4,0)<br>E (tot): -855.774; E (met): 1.795; E (glob): 1.452<br>Dir: /calcs/final_sampling/pt/3o2_coord/2ce3/pos_28_32/sec-gamma/"
1.4757092699999248,3,2,18.56,2,1,17.6,1.9,2.0,2.0,0.058,37.9,1.5811388300841898,7.3,8.3,1.414,46.4,2.2,2.3,2.4,0.071,3.0,3.9,3.9,3.9,0.0,"M: Pt; Coord: 3; OS: 2; IDs: 30_33; mean(d-Ce3Ce3): 3.9; Ce3-ONN: (2,1)<br>E (tot): -855.75; E (met): 1.819; E (glob): 1.476<br>Dir: /calcs/final_sampling/pt/3o2_coord/2ce3/pos_30_33/sec-gamma/"
