109
E: -857.26784204 | E_rel_metal 0.3006541700000298: | E_rel_global -0.042322650000073736: 
Ce  1.884954  3.843916  1.372921
Ce  1.884954  7.726816  1.372921
Ce  1.884954 11.609716  1.372921
Ce  5.767854  3.843916  1.372921
Ce  5.767854  7.726816  1.372921
Ce  5.767854 11.609716  1.372921
Ce  9.650754  3.843916  1.372921
Ce  9.650754  7.726816  1.372921
Ce  9.650754 11.609716  1.372921
Ce  3.826404  1.902466  4.118502
Ce  3.826404  5.785366  4.118502
Ce  3.826404  9.668266  4.118502
Ce  7.709304  1.902466  4.118502
Ce  7.709304  5.785366  4.118502
Ce  7.709304  9.668266  4.118502
Ce 11.592204  1.902466  4.118502
Ce 11.592204  5.785366  4.118502
Ce 11.592204  9.668266  4.118502
Ce  1.889778  3.845641  6.830170
Ce  1.913437  7.728204  6.888389
Ce  1.862315 11.613337  6.889885
Ce  5.751078  3.834692  6.862721
Ce  5.750825  7.744579  6.864817
Ce  5.750296 11.596341  6.904200
Ce  9.675528  3.852858  6.860343
Ce  9.672106  7.741854  6.900666
Ce  9.671974 11.594991  6.862381
Ce  3.600803  2.004224  9.569493
Ce  3.970975  5.673383  9.784043
Ce  3.817600  9.665265  9.613926
Ce  7.794270  1.873763  9.512388
Ce  7.634270  5.813200  9.506833
Ce  7.711307  9.672053  9.671245
Ce 11.456947  2.016106  9.782786
Ce  0.180437  5.685354  9.564095
Ce 11.610677  9.676203  9.609219
 O  1.884954  1.902466  0.000000
 O  1.884954  5.785366  0.000000
 O  1.884954  9.668266  0.000000
 O  5.767854  1.902466  0.000000
 O  5.767854  5.785366  0.000000
 O  5.767854  9.668266  0.000000
 O  9.650754  1.902466  0.000000
 O  9.650754  5.785366  0.000000
 O  9.650754  9.668266  0.000000
 O  3.826404  3.843916  2.745841
 O  1.884954  1.902466  2.745841
 O  3.826404  7.726816  2.745841
 O  1.884954  5.785366  2.745841
 O  3.826404 11.609716  2.745841
 O  1.884954  9.668266  2.745841
 O  7.709304  3.843916  2.745841
 O  5.767854  1.902466  2.745841
 O  7.709304  7.726816  2.745841
 O  5.767854  5.785366  2.745841
 O  7.709304 11.609716  2.745841
 O  5.767854  9.668266  2.745841
 O 11.592204  3.843916  2.745841
 O  9.650754  1.902466  2.745841
 O 11.592204  7.726816  2.745841
 O  9.650754  5.785366  2.745841
 O 11.592204 11.609716  2.745841
 O  9.650754  9.668266  2.745841
 O  1.879112  1.898774  5.439071
 O  1.893579  5.793853  5.439409
 O  1.890338  9.675086  5.420418
 O  5.776215  1.889687  5.535343
 O  5.761901  5.781686  5.444363
 O  5.762315  9.681678  5.432257
 O  9.656708  1.906903  5.442644
 O  9.648181  5.792435  5.525034
 O  9.651792  9.655372  5.427409
 O  3.842730  3.834285  5.471529
 O  3.833256  7.732335  5.554393
 O  3.826944 11.623275  5.578296
 O  7.708326  3.842596  5.527489
 O  7.713148  7.724045  5.565133
 O  7.707823 11.610669  5.561310
 O 11.581794  3.857779  5.464775
 O 11.593536  7.723083  5.573600
 O 11.587446 11.605223  5.550295
 O  1.873188  1.916808  8.124517
 O  1.910971  5.778692  8.125041
 O  1.882463  9.666470  8.056612
 O  5.776563  1.869791  8.401168
 O  5.858509  5.770486  8.098141
 O  5.764748  9.680632  8.069158
 O  9.575222  1.916123  8.101319
 O  9.651545  5.810575  8.388733
 O  9.671364  9.661356  8.058388
 O  3.855285  3.816844  8.191358
 O  3.865917  7.763642  8.436088
 O  3.789467 11.593860  8.453718
 O  7.714854  3.842687  8.388430
 O  7.698977  7.774200  8.425113
 O  7.731018 11.564061  8.429393
 O 11.581246  3.870250  8.179918
 O 11.628898  7.738347  8.454691
 O 11.568503 11.579146  8.438719
 O  1.877768  1.794881 10.976243
 O  1.902536  5.892809 10.980327
 O  1.891632  9.670360 10.673383
 O  3.918922  3.617555 11.032025
 O  6.158246  5.940985 10.840477
 O  5.791313  9.887591 10.693993
 O  9.267468  1.730439 10.844086
 O 11.499171  4.076515 11.021287
 O  9.628503  9.482303 10.691402
Pt  1.886494  3.844930 11.113959