109
E: -857.20661458 | E_rel_metal 0.4194009999999935: | E_rel_global -0.6656551899999386: 
Ce  1.884954  3.843916  1.372921
Ce  1.884954  7.726816  1.372921
Ce  1.884954 11.609716  1.372921
Ce  5.767854  3.843916  1.372921
Ce  5.767854  7.726816  1.372921
Ce  5.767854 11.609716  1.372921
Ce  9.650754  3.843916  1.372921
Ce  9.650754  7.726816  1.372921
Ce  9.650754 11.609716  1.372921
Ce  3.826404  1.902466  4.118502
Ce  3.826404  5.785366  4.118502
Ce  3.826404  9.668266  4.118502
Ce  7.709304  1.902466  4.118502
Ce  7.709304  5.785366  4.118502
Ce  7.709304  9.668266  4.118502
Ce 11.592204  1.902466  4.118502
Ce 11.592204  5.785366  4.118502
Ce 11.592204  9.668266  4.118502
Ce  1.883842  3.873320  6.842185
Ce  1.896620  7.716873  6.906583
Ce  1.872069 11.612928  6.872604
Ce  5.749826  3.835712  6.863200
Ce  5.743029  7.743586  6.861974
Ce  5.752683 11.598650  6.904982
Ce  9.676105  3.878272  6.856946
Ce  9.674869  7.742810  6.902169
Ce  9.666835 11.596502  6.850976
Ce  3.615764  1.979205  9.548796
Ce  3.939798  5.626954  9.822045
Ce  3.804871  9.652519  9.607935
Ce  7.846598  1.872376  9.502987
Ce  7.617085  5.824859  9.492921
Ce  7.699939  9.665582  9.666085
Ce 11.517000  2.030050  9.704812
Ce  0.168023  5.693672  9.674166
Ce 11.592985  9.659158  9.602509
 O  1.884954  1.902466  0.000000
 O  1.884954  5.785366  0.000000
 O  1.884954  9.668266  0.000000
 O  5.767854  1.902466  0.000000
 O  5.767854  5.785366  0.000000
 O  5.767854  9.668266  0.000000
 O  9.650754  1.902466  0.000000
 O  9.650754  5.785366  0.000000
 O  9.650754  9.668266  0.000000
 O  3.826404  3.843916  2.745841
 O  1.884954  1.902466  2.745841
 O  3.826404  7.726816  2.745841
 O  1.884954  5.785366  2.745841
 O  3.826404 11.609716  2.745841
 O  1.884954  9.668266  2.745841
 O  7.709304  3.843916  2.745841
 O  5.767854  1.902466  2.745841
 O  7.709304  7.726816  2.745841
 O  5.767854  5.785366  2.745841
 O  7.709304 11.609716  2.745841
 O  5.767854  9.668266  2.745841
 O 11.592204  3.843916  2.745841
 O  9.650754  1.902466  2.745841
 O 11.592204  7.726816  2.745841
 O  9.650754  5.785366  2.745841
 O 11.592204 11.609716  2.745841
 O  9.650754  9.668266  2.745841
 O  1.882788  1.901479  5.437568
 O  1.889706  5.795668  5.441652
 O  1.890460  9.682322  5.422052
 O  5.777123  1.893183  5.538842
 O  5.759637  5.783311  5.443196
 O  5.762232  9.683039  5.431824
 O  9.653692  1.910548  5.435136
 O  9.653116  5.798682  5.510525
 O  9.649518  9.662337  5.423339
 O  3.841976  3.839398  5.476757
 O  3.825690  7.734681  5.557457
 O  3.830860 11.625544  5.573417
 O  7.709191  3.849952  5.533800
 O  7.706854  7.723857  5.561370
 O  7.708244 11.613869  5.566779
 O 11.582903  3.859280  5.472950
 O 11.593121  7.726207  5.560598
 O 11.585585 11.606972  5.560582
 O  1.848236  1.919757  8.125222
 O  1.927883  5.783859  8.131898
 O  1.875994  9.691968  8.060265
 O  5.804730  1.859190  8.412843
 O  5.854140  5.765450  8.091542
 O  5.754496  9.689141  8.070053
 O  9.603363  1.921901  8.094378
 O  9.579244  5.821180  8.327322
 O  9.665265  9.688006  8.057718
 O  3.854684  3.796031  8.194202
 O  3.860816  7.761268  8.463242
 O  3.786519 11.595198  8.431376
 O  7.715765  3.824658  8.408756
 O  7.672327  7.796931  8.411970
 O  7.746075 11.577472  8.435991
 O 11.558052  3.835477  8.206680
 O 11.607588  7.780327  8.403567
 O 11.559158 11.629906  8.498830
 O  1.788706  1.772751 10.868055
 O  1.994253  5.548980 11.060623
 O  1.865051  9.552801 10.672078
 O  3.785071  3.533711 11.007250
 O  6.157901  5.898637 10.850643
 O  5.778831  9.885445 10.691350
 O  9.436887  1.714599 10.760017
 O  0.027165  3.759562 11.024180
 O  9.608948  9.372746 10.677136
Ni  1.896049  3.671576 11.126054