109
E: -857.55275339 | E_rel_metal 1.000779609999995: | E_rel_global 0.8467559999999139: 
Ce  1.884954  3.843916  1.372921
Ce  1.884954  7.726816  1.372921
Ce  1.884954 11.609716  1.372921
Ce  5.767854  3.843916  1.372921
Ce  5.767854  7.726816  1.372921
Ce  5.767854 11.609716  1.372921
Ce  9.650754  3.843916  1.372921
Ce  9.650754  7.726816  1.372921
Ce  9.650754 11.609716  1.372921
Ce  3.826404  1.902466  4.118502
Ce  3.826404  5.785366  4.118502
Ce  3.826404  9.668266  4.118502
Ce  7.709304  1.902466  4.118502
Ce  7.709304  5.785366  4.118502
Ce  7.709304  9.668266  4.118502
Ce 11.592204  1.902466  4.118502
Ce 11.592204  5.785366  4.118502
Ce 11.592204  9.668266  4.118502
Ce  1.871287  3.895684  6.866313
Ce  1.896352  7.730436  6.975596
Ce  1.871694 11.599667  6.879722
Ce  5.770606  3.848398  6.853281
Ce  5.749758  7.753221  6.884124
Ce  5.756309 11.578476  6.906153
Ce  9.648659  3.858131  6.790067
Ce  9.654839  7.769361  6.859021
Ce  9.667350 11.583747  6.855294
Ce  3.680668  1.985071  9.492964
Ce  4.097230  5.677944  9.664573
Ce  3.811652  9.680615  9.705870
Ce  7.887647  1.893836  9.495694
Ce  7.760751  5.864814  9.605549
Ce  7.727672  9.718118  9.695401
Ce 11.515393  2.021719  9.651166
Ce 11.396523  5.712342  9.554918
Ce 11.561069  9.675983  9.683452
 O  1.884954  1.902466  0.000000
 O  1.884954  5.785366  0.000000
 O  1.884954  9.668266  0.000000
 O  5.767854  1.902466  0.000000
 O  5.767854  5.785366  0.000000
 O  5.767854  9.668266  0.000000
 O  9.650754  1.902466  0.000000
 O  9.650754  5.785366  0.000000
 O  9.650754  9.668266  0.000000
 O  3.826404  3.843916  2.745841
 O  1.884954  1.902466  2.745841
 O  3.826404  7.726816  2.745841
 O  1.884954  5.785366  2.745841
 O  3.826404 11.609716  2.745841
 O  1.884954  9.668266  2.745841
 O  7.709304  3.843916  2.745841
 O  5.767854  1.902466  2.745841
 O  7.709304  7.726816  2.745841
 O  5.767854  5.785366  2.745841
 O  7.709304 11.609716  2.745841
 O  5.767854  9.668266  2.745841
 O 11.592204  3.843916  2.745841
 O  9.650754  1.902466  2.745841
 O 11.592204  7.726816  2.745841
 O  9.650754  5.785366  2.745841
 O 11.592204 11.609716  2.745841
 O  9.650754  9.668266  2.745841
 O  1.874510  1.920400  5.458595
 O  1.885682  5.795422  5.532180
 O  1.891342  9.677242  5.434925
 O  5.774517  1.894416  5.549891
 O  5.765718  5.771173  5.444286
 O  5.759061  9.685119  5.430311
 O  9.651323  1.907171  5.429223
 O  9.646700  5.797727  5.414160
 O  9.649640  9.668858  5.413056
 O  3.832834  3.848035  5.486327
 O  3.822260  7.724665  5.562605
 O  3.825054 11.623848  5.550792
 O  7.701915  3.838407  5.523351
 O  7.699460  7.735411  5.550721
 O  7.708816 11.610271  5.552052
 O 11.590521  3.861381  5.486667
 O 11.603421  7.732702  5.571577
 O 11.587625 11.608378  5.557976
 O  1.849518  1.981511  8.153129
 O  1.813822  5.763205  8.378123
 O  1.835061  9.694199  8.071028
 O  5.802651  1.903645  8.450919
 O  5.838900  5.741272  8.092520
 O  5.779961  9.689229  8.063379
 O  9.630645  1.918655  8.084813
 O  9.635605  5.781549  8.056546
 O  9.676560  9.689856  8.051610
 O  3.852239  3.821746  8.197146
 O  3.855077  7.713470  8.423242
 O  3.776309  0.010507  8.390602
 O  7.759118  3.833034  8.433694
 O  7.717704  7.777326  8.423915
 O  7.758406 11.629309  8.387615
 O 11.503096  3.839396  8.238476
 O 11.545965  7.723550  8.453218
 O 11.584442  0.035197  8.498731
 O  1.823349  1.540030 10.849007
 O  0.189416  3.955796 11.057121
 O  1.672844  9.362890 10.762985
 O  3.904946  3.601980 11.082704
 O  6.074636  6.059230 10.789413
 O  5.967859 10.138116 10.731528
 O  9.543261  1.852226 10.735880
 O  9.662302  6.044497 10.709927
 O  9.622637  9.790869 10.737457
Rh  1.989713  3.420443 11.390897