109
E: -856.02602569 | E_rel_metal 1.5424705200000517: | E_rel_global 1.1994936999999481: 
Ce  1.884954  3.843916  1.372921
Ce  1.884954  7.726816  1.372921
Ce  1.884954 11.609716  1.372921
Ce  5.767854  3.843916  1.372921
Ce  5.767854  7.726816  1.372921
Ce  5.767854 11.609716  1.372921
Ce  9.650754  3.843916  1.372921
Ce  9.650754  7.726816  1.372921
Ce  9.650754 11.609716  1.372921
Ce  3.826404  1.902466  4.118502
Ce  3.826404  5.785366  4.118502
Ce  3.826404  9.668266  4.118502
Ce  7.709304  1.902466  4.118502
Ce  7.709304  5.785366  4.118502
Ce  7.709304  9.668266  4.118502
Ce 11.592204  1.902466  4.118502
Ce 11.592204  5.785366  4.118502
Ce 11.592204  9.668266  4.118502
Ce  1.880462  3.869451  6.892351
Ce  1.887170  7.693947  6.948891
Ce  1.885708 11.618264  6.887070
Ce  5.765527  3.819564  6.859542
Ce  5.761802  7.734461  6.858462
Ce  5.752118 11.592854  6.910110
Ce  9.656584  3.855479  6.798386
Ce  9.662392  7.748747  6.860409
Ce  9.673417 11.580555  6.856784
Ce  3.649857  1.990571  9.641451
Ce  4.049250  5.644741  9.631340
Ce  3.847967  9.675268  9.613395
Ce  7.865239  1.879540  9.487924
Ce  7.724019  5.868540  9.602115
Ce  7.743124  9.679226  9.676828
Ce 11.499708  2.043888  9.703929
Ce 11.382975  5.684467  9.608152
Ce 11.604939  9.688469  9.634902
 O  1.884954  1.902466  0.000000
 O  1.884954  5.785366  0.000000
 O  1.884954  9.668266  0.000000
 O  5.767854  1.902466  0.000000
 O  5.767854  5.785366  0.000000
 O  5.767854  9.668266  0.000000
 O  9.650754  1.902466  0.000000
 O  9.650754  5.785366  0.000000
 O  9.650754  9.668266  0.000000
 O  3.826404  3.843916  2.745841
 O  1.884954  1.902466  2.745841
 O  3.826404  7.726816  2.745841
 O  1.884954  5.785366  2.745841
 O  3.826404 11.609716  2.745841
 O  1.884954  9.668266  2.745841
 O  7.709304  3.843916  2.745841
 O  5.767854  1.902466  2.745841
 O  7.709304  7.726816  2.745841
 O  5.767854  5.785366  2.745841
 O  7.709304 11.609716  2.745841
 O  5.767854  9.668266  2.745841
 O 11.592204  3.843916  2.745841
 O  9.650754  1.902466  2.745841
 O 11.592204  7.726816  2.745841
 O  9.650754  5.785366  2.745841
 O 11.592204 11.609716  2.745841
 O  9.650754  9.668266  2.745841
 O  1.883647  1.901001  5.452044
 O  1.889003  5.789797  5.504726
 O  1.889111  9.677610  5.426194
 O  5.777257  1.886867  5.528529
 O  5.766958  5.779784  5.439463
 O  5.764335  9.679407  5.434149
 O  9.653023  1.903601  5.427265
 O  9.648444  5.800701  5.413508
 O  9.650432  9.663032  5.414484
 O  3.839512  3.839814  5.489606
 O  3.825300  7.726045  5.576981
 O  3.835866 11.620263  5.558328
 O  7.702505  3.836029  5.528432
 O  7.701852  7.730098  5.554718
 O  7.714993 11.609902  5.566994
 O 11.594225  3.854720  5.485397
 O 11.603231  7.722793  5.586906
 O 11.587741 11.606396  5.566048
 O  1.834917  1.936218  8.140817
 O  1.879551  5.786609  8.296102
 O  1.863016  9.659292  8.064680
 O  5.850531  1.874153  8.366720
 O  5.807165  5.743445  8.086090
 O  5.760170  9.653907  8.068489
 O  9.613058  1.905393  8.079455
 O  9.632166  5.784542  8.055997
 O  9.699780  9.663282  8.056303
 O  3.869145  3.849447  8.200440
 O  3.860447  7.711285  8.496539
 O  3.801862 11.568173  8.397597
 O  7.750150  3.851962  8.455314
 O  7.709847  7.780803  8.416168
 O  7.758627 11.560891  8.425438
 O 11.502416  3.847518  8.229768
 O 11.580005  7.727739  8.497887
 O 11.577404 11.632095  8.509555
 O  1.669386  1.793385 10.937172
 O 11.510524  3.962702 11.004831
 O  1.940857  9.593822 10.686707
 O  3.882020  3.956113 11.060357
 O  5.898470  6.146810 10.696552
 O  5.820640 10.016423 10.669978
 O  9.467928  1.767578 10.745384
 O  9.534328  6.161314 10.682511
 O  9.659842  9.760437 10.695630
Pt  1.867696  3.926410 11.117119