109
E: -856.58342454 | E_rel_metal 0.19035339000004114: | E_rel_global -0.23709515000007286: 
Ce  1.884954  3.843916  1.372921
Ce  1.884954  7.726816  1.372921
Ce  1.884954 11.609716  1.372921
Ce  5.767854  3.843916  1.372921
Ce  5.767854  7.726816  1.372921
Ce  5.767854 11.609716  1.372921
Ce  9.650754  3.843916  1.372921
Ce  9.650754  7.726816  1.372921
Ce  9.650754 11.609716  1.372921
Ce  3.826404  1.902466  4.118502
Ce  3.826404  5.785366  4.118502
Ce  3.826404  9.668266  4.118502
Ce  7.709304  1.902466  4.118502
Ce  7.709304  5.785366  4.118502
Ce  7.709304  9.668266  4.118502
Ce 11.592204  1.902466  4.118502
Ce 11.592204  5.785366  4.118502
Ce 11.592204  9.668266  4.118502
Ce  1.885169  3.842489  6.802497
Ce  1.903160  7.751738  6.892009
Ce  1.856889 11.597883  6.911424
Ce  5.759710  3.820234  6.843008
Ce  5.751989  7.753543  6.853577
Ce  5.751536 11.591127  6.908763
Ce  9.669617  3.857928  6.857113
Ce  9.673109  7.764759  6.915356
Ce  9.683481 11.586638  6.880472
Ce  3.627458  2.012773  9.546235
Ce  3.953095  5.692128  9.659740
Ce  3.850959  9.696309  9.676157
Ce  7.809664  1.883882  9.510192
Ce  7.590538  5.841813  9.498678
Ce  7.686801  9.673196  9.694507
Ce 11.486356  2.045324  9.757300
Ce  0.173912  5.715681  9.528548
Ce 11.621784  9.690894  9.704327
 O  1.884954  1.902466  0.000000
 O  1.884954  5.785366  0.000000
 O  1.884954  9.668266  0.000000
 O  5.767854  1.902466  0.000000
 O  5.767854  5.785366  0.000000
 O  5.767854  9.668266  0.000000
 O  9.650754  1.902466  0.000000
 O  9.650754  5.785366  0.000000
 O  9.650754  9.668266  0.000000
 O  3.826404  3.843916  2.745841
 O  1.884954  1.902466  2.745841
 O  3.826404  7.726816  2.745841
 O  1.884954  5.785366  2.745841
 O  3.826404 11.609716  2.745841
 O  1.884954  9.668266  2.745841
 O  7.709304  3.843916  2.745841
 O  5.767854  1.902466  2.745841
 O  7.709304  7.726816  2.745841
 O  5.767854  5.785366  2.745841
 O  7.709304 11.609716  2.745841
 O  5.767854  9.668266  2.745841
 O 11.592204  3.843916  2.745841
 O  9.650754  1.902466  2.745841
 O 11.592204  7.726816  2.745841
 O  9.650754  5.785366  2.745841
 O 11.592204 11.609716  2.745841
 O  9.650754  9.668266  2.745841
 O  1.881079  1.899851  5.442393
 O  1.892225  5.791061  5.439511
 O  1.886800  9.668074  5.421148
 O  5.776014  1.889392  5.534371
 O  5.766589  5.774100  5.445946
 O  5.762647  9.677689  5.435861
 O  9.657583  1.920180  5.446376
 O  9.646726  5.787905  5.543340
 O  9.653654  9.653188  5.428853
 O  3.843284  3.830994  5.470652
 O  3.832618  7.730313  5.558309
 O  3.828869 11.611692  5.567043
 O  7.706971  3.841695  5.529540
 O  7.707855  7.720589  5.553770
 O  7.707648 11.609899  5.558543
 O 11.581649  3.858138  5.463993
 O 11.592230  7.722279  5.566543
 O 11.589201 11.603354  5.543961
 O  1.888930  1.947125  8.136559
 O  1.947083  5.760266  8.128220
 O  1.940997  9.656306  8.062745
 O  5.782079  1.906606  8.393100
 O  5.807064  5.744274  8.098802
 O  5.747086  9.668135  8.069945
 O  9.577202  1.947474  8.105913
 O  9.638947  5.821627  8.458813
 O  9.631141  9.657571  8.061346
 O  3.848936  3.846858  8.187861
 O  3.890524  7.683141  8.491388
 O  3.808436 11.648145  8.434367
 O  7.695440  3.872570  8.399486
 O  7.660705  7.737636  8.389892
 O  7.725012 11.599093  8.418521
 O 11.588021  3.897372  8.173339
 O  0.003370  7.702206  8.415802
 O 11.570034 11.627019  8.399016
 O  1.930682  1.904805 10.957443
 O  2.063013  5.970379 10.862219
 O  2.111724  9.789860 10.771767
 O  3.999270  3.769804 10.912550
 O  5.975800  6.098663 10.731584
 O  5.803582 10.036754 10.727387
 O  9.303291  1.812998 10.834928
 O 11.600668  4.135352 10.995659
 O  9.439673  9.365017 10.755891
Pd  1.979274  3.938601 11.130610