109
E: -853.71766791 | E_rel_metal 0.9138010599999689: | E_rel_global 0.6336914799999249: 
Ce  1.884954  3.843916  1.372921
Ce  1.884954  7.726816  1.372921
Ce  1.884954 11.609716  1.372921
Ce  5.767854  3.843916  1.372921
Ce  5.767854  7.726816  1.372921
Ce  5.767854 11.609716  1.372921
Ce  9.650754  3.843916  1.372921
Ce  9.650754  7.726816  1.372921
Ce  9.650754 11.609716  1.372921
Ce  3.826404  1.902466  4.118502
Ce  3.826404  5.785366  4.118502
Ce  3.826404  9.668266  4.118502
Ce  7.709304  1.902466  4.118502
Ce  7.709304  5.785366  4.118502
Ce  7.709304  9.668266  4.118502
Ce 11.592204  1.902466  4.118502
Ce 11.592204  5.785366  4.118502
Ce 11.592204  9.668266  4.118502
Ce  1.878401  3.877042  6.839648
Ce  1.898794  7.728612  6.911283
Ce  1.865769 11.603590  6.870543
Ce  5.749616  3.840036  6.850612
Ce  5.742499  7.761468  6.874643
Ce  5.754879 11.572311  6.901526
Ce  9.670910  3.885561  6.847436
Ce  9.670025  7.767292  6.909348
Ce  9.657715 11.578008  6.853632
Ce  3.659224  1.947507  9.501597
Ce  3.960138  5.684815  9.772355
Ce  3.784436  9.667744  9.656051
Ce  7.842439  1.859452  9.483372
Ce  7.611951  5.840119  9.480915
Ce  7.693330  9.669929  9.748622
Ce 11.468820  1.986190  9.651103
Ce  0.107384  5.745057  9.628472
Ce 11.598462  9.637011  9.655963
 O  1.884954  1.902466  0.000000
 O  1.884954  5.785366  0.000000
 O  1.884954  9.668266  0.000000
 O  5.767854  1.902466  0.000000
 O  5.767854  5.785366  0.000000
 O  5.767854  9.668266  0.000000
 O  9.650754  1.902466  0.000000
 O  9.650754  5.785366  0.000000
 O  9.650754  9.668266  0.000000
 O  3.826404  3.843916  2.745841
 O  1.884954  1.902466  2.745841
 O  3.826404  7.726816  2.745841
 O  1.884954  5.785366  2.745841
 O  3.826404 11.609716  2.745841
 O  1.884954  9.668266  2.745841
 O  7.709304  3.843916  2.745841
 O  5.767854  1.902466  2.745841
 O  7.709304  7.726816  2.745841
 O  5.767854  5.785366  2.745841
 O  7.709304 11.609716  2.745841
 O  5.767854  9.668266  2.745841
 O 11.592204  3.843916  2.745841
 O  9.650754  1.902466  2.745841
 O 11.592204  7.726816  2.745841
 O  9.650754  5.785366  2.745841
 O 11.592204 11.609716  2.745841
 O  9.650754  9.668266  2.745841
 O  1.877059  1.906173  5.452264
 O  1.887806  5.784379  5.449836
 O  1.888699  9.683258  5.423907
 O  5.774586  1.893723  5.548877
 O  5.760484  5.774228  5.443812
 O  5.760956  9.684986  5.429574
 O  9.647854  1.916123  5.442009
 O  9.650053  5.796997  5.514035
 O  9.650423  9.661501  5.422217
 O  3.840964  3.839350  5.484500
 O  3.826185  7.733272  5.554178
 O  3.824977 11.622014  5.551712
 O  7.708593  3.849576  5.536456
 O  7.702268  7.729297  5.551648
 O  7.707343 11.608202  5.549193
 O 11.578920  3.858958  5.484450
 O 11.598418  7.723484  5.545565
 O 11.584535 11.607441  5.558488
 O  1.847383  1.941181  8.162418
 O  1.916018  5.764613  8.160056
 O  1.874291  9.701609  8.060457
 O  5.777125  1.876482  8.445438
 O  5.842523  5.749247  8.092089
 O  5.729220  9.692357  8.065429
 O  9.613019  1.939309  8.099139
 O  9.591683  5.812084  8.342500
 O  9.671471  9.699504  8.055922
 O  3.844172  3.790983  8.214073
 O  3.857574  7.735857  8.447261
 O  3.771251 -0.009095  8.399195
 O  7.712724  3.819597  8.411332
 O  7.670619  7.768750  8.389685
 O  7.734382 11.618777  8.390706
 O 11.557869  3.829338  8.230585
 O -0.028597  7.760003  8.355357
 O 11.558107  0.017848  8.496587
 O  1.775903  1.677707 10.900638
 O  1.980207  5.708363 11.127065
 O  1.862797  9.514385 10.716328
 O  3.898285  3.521899 11.045926
 O  6.122279  5.992437 10.819875
 O  5.544441 10.010563 10.750040
 O  9.465415  1.606366 10.725999
 O 11.517909  3.793946 11.066986
 O  9.833508  9.218499 10.725246
Au  1.878833  3.698722 11.235899