module gitlab.com/icicleworks/khronos

go 1.17

require (
	github.com/davecgh/go-spew v1.1.1
	github.com/gagliardetto/binary v0.6.1
	github.com/gagliardetto/gofuzz v1.2.2
	github.com/gagliardetto/solana-go v1.2.0
	github.com/gagliardetto/treeout v0.1.4
	github.com/go-co-op/gocron v1.12.0
	github.com/stretchr/testify v1.7.0
	github.com/test-go/testify v1.1.4
	golang.org/x/net v0.0.0-20210510120150-4163338589ed
)

require (
	contrib.go.opencensus.io/exporter/stackdriver v0.13.4 // indirect
	filippo.io/edwards25519 v1.0.0-rc.1 // indirect
	github.com/GeertJohan/go.rice v1.0.0 // indirect
	github.com/andres-erbsen/clock v0.0.0-20160526145045-9e14626cd129 // indirect
	github.com/aybabtme/rgbterm v0.0.0-20170906152045-cc83f3b3ce59 // indirect
	github.com/blendle/zapdriver v1.3.1 // indirect
	github.com/buger/jsonparser v1.1.1 // indirect
	github.com/daaku/go.zipexe v1.0.0 // indirect
	github.com/dfuse-io/logging v0.0.0-20210109005628-b97a57253f70 // indirect
	github.com/fatih/color v1.9.0 // indirect
	github.com/golang/groupcache v0.0.0-20200121045136-8c9f03a8e57e // indirect
	github.com/gorilla/rpc v1.2.0 // indirect
	github.com/gorilla/websocket v1.4.2 // indirect
	github.com/json-iterator/go v1.1.11 // indirect
	github.com/klauspost/compress v1.13.6 // indirect
	github.com/logrusorgru/aurora v2.0.3+incompatible // indirect
	github.com/mattn/go-colorable v0.1.4 // indirect
	github.com/mattn/go-isatty v0.0.11 // indirect
	github.com/mitchellh/go-testing-interface v1.14.1 // indirect
	github.com/modern-go/concurrent v0.0.0-20180306012644-bacd9c7ef1dd // indirect
	github.com/modern-go/reflect2 v1.0.1 // indirect
	github.com/mostynb/zstdpool-freelist v0.0.0-20201229113212-927304c0c3b1 // indirect
	github.com/mr-tron/base58 v1.2.0 // indirect
	github.com/pmezard/go-difflib v1.0.0 // indirect
	github.com/robfig/cron/v3 v3.0.1 // indirect
	github.com/teris-io/shortid v0.0.0-20201117134242-e59966efd125 // indirect
	github.com/tidwall/gjson v1.9.3 // indirect
	github.com/tidwall/match v1.1.1 // indirect
	github.com/tidwall/pretty v1.2.0 // indirect
	go.opencensus.io v0.22.5 // indirect
	go.uber.org/atomic v1.7.0 // indirect
	go.uber.org/multierr v1.6.0 // indirect
	go.uber.org/ratelimit v0.2.0 // indirect
	go.uber.org/zap v1.16.0 // indirect
	golang.org/x/crypto v0.0.0-20210513164829-c07d793c2f9a // indirect
	golang.org/x/sync v0.0.0-20210220032951-036812b2e83c // indirect
	golang.org/x/sys v0.0.0-20210514084401-e8d321eab015 // indirect
	golang.org/x/term v0.0.0-20201210144234-2321bbc49cbf // indirect
	gopkg.in/yaml.v3 v3.0.0-20210107192922-496545a6307b // indirect
)
