today,username,Location,_Location_latitude,_Location_longitude,_Location_altitude,_Location_precision,Type_of_Pole,Type_of_Structure,Number_of_HT_circuits,Circuit_mix,Line_pole_Cut_pole,Whether_muffed_or_not,Conductor_type,Switching_point_or_not,Whether_transformer_point_or_n,Transformer_Capacity,Line_branching_status_of_the_pole_point,Take_a_picture,__version__,meta/instanceID,_uuid,_submission_time
2017-12-22,45011,8.4644675 76.94251322 -97.0 4.0,8.4644675,76.94251322,-97.0,4.0,ug_cable_route,not_applicable,1,ht,not_applicable,not_applicable,ug_cable,rmu,no,n/a,2,1513916719226.jpg,vm9QcaVf7PkpEH4DGALVqt,uuid:cb70aa7b-afd0-443f-85af-1b61c751c9a3,cb70aa7b-afd0-443f-85af-1b61c751c9a3,2017-12-22T11:16:56
2017-12-22,45011,8.4642998 76.94281228 -91.0 5.0,8.4642998,76.94281228,-91.0,5.0,ug_cable_route,double_pole,1,ht,not_applicable,not_applicable,ug_cable,rmu,yes,100,1,1513916851962.jpg,vm9QcaVf7PkpEH4DGALVqt,uuid:1d351fdd-f50e-46dc-86de-ae840b878e8a,1d351fdd-f50e-46dc-86de-ae840b878e8a,2017-12-22T13:04:48
2017-12-22,45011,8.4702434 76.94091995 -123.0 5.0,8.4702434,76.94091995,-123.0,5.0,ug_cable_route,not_applicable,3,ht,not_applicable,not_applicable,ug_cable,rmu,yes,250,2,1513918009586.jpg,vm9QcaVf7PkpEH4DGALVqt,uuid:740660fd-9ed8-46c1-a808-5de958534bea,740660fd-9ed8-46c1-a808-5de958534bea,2017-12-22T13:05:08
2017-12-22,45011,8.47081688 76.94500771 -92.0 5.0,8.47081688,76.94500771,-92.0,5.0,ug_cable_route,not_applicable,3,ht,not_applicable,not_applicable,ug_cable,rmu,yes,250,2,1513918350066.jpg,vm9QcaVf7PkpEH4DGALVqt,uuid:63d67425-341e-48db-8403-ee08bdc34565,63d67425-341e-48db-8403-ee08bdc34565,2017-12-22T13:06:10
2017-12-22,45011,8.47126288 76.9482069 -61.0 5.0,8.47126288,76.9482069,-61.0,5.0,ug_cable_route,double_pole,1,ht,lp,not_applicable,ug_cable,na,no,n/a,2,n/a,vm9QcaVf7PkpEH4DGALVqt,uuid:0d7777f3-5b3e-43dd-b30f-e0f47c492823,0d7777f3-5b3e-43dd-b30f-e0f47c492823,2017-12-22T13:06:17
2017-12-22,45011,8.4603057 76.95045497 -84.0 5.0,8.4603057,76.95045497,-84.0,5.0,ug_cable_route,not_applicable,3,ht,not_applicable,not_applicable,ug_cable,rmu,yes,500,2,1513921481745.jpg,vm9QcaVf7PkpEH4DGALVqt,uuid:bc51e26a-99ee-4535-a355-ea37c6fdeeb9,bc51e26a-99ee-4535-a355-ea37c6fdeeb9,2017-12-22T13:06:48
2017-12-22,45011,8.46758164 76.94811629 -103.0 5.0,8.46758164,76.94811629,-103.0,5.0,ug_cable_route,not_applicable,4,ht,not_applicable,not_applicable,ug_cable,rmu,yes,500,2,1513920362000.jpg,vm9QcaVf7PkpEH4DGALVqt,uuid:e0ae87a7-1327-4019-804a-73c7b2d34dcb,e0ae87a7-1327-4019-804a-73c7b2d34dcb,2017-12-22T13:07:09
2017-12-21,45011,8.45778653 76.94355662 -84.0 5.0,8.45778653,76.94355662,-84.0,5.0,ug_cable_route,not_applicable,1,ht,not_applicable,not_applicable,ug_cable,rmu,no,n/a,1,n/a,vm9QcaVf7PkpEH4DGALVqt,uuid:169aef7a-20ec-440b-ad2b-790f8b93967f,169aef7a-20ec-440b-ad2b-790f8b93967f,2017-12-22T13:07:16
2017-12-22,45011,8.47295902 76.94790144 -79.0 5.0,8.47295902,76.94790144,-79.0,5.0,ug_cable_route,not_applicable,3,ht,not_applicable,not_applicable,ug_cable,rmu,no,n/a,2,n/a,vm9QcaVf7PkpEH4DGALVqt,uuid:220f9a5a-1ce1-432f-be61-6823a9162853,220f9a5a-1ce1-432f-be61-6823a9162853,2017-12-22T13:07:21
2017-12-22,45011,8.47446408 76.94722109 -32.0 5.0,8.47446408,76.94722109,-32.0,5.0,ug_cable_route,not_applicable,4,ht,not_applicable,not_applicable,ug_cable,rmu,yes,500,2,1513918731023.jpg,vm9QcaVf7PkpEH4DGALVqt,uuid:7ae51500-a995-4242-84f5-e04d592dc2c5,7ae51500-a995-4242-84f5-e04d592dc2c5,2017-12-22T13:07:41
2017-12-22,45011,8.4606042 76.94637374 -81.0 5.0,8.4606042,76.94637374,-81.0,5.0,psc,single_pole,1,ht___lt,cp,not_applicable,raccoon,na,no,n/a,2,n/a,vm9QcaVf7PkpEH4DGALVqt,uuid:e1c9d1d1-baa6-4661-99ab-6c59e8daf643,e1c9d1d1-baa6-4661-99ab-6c59e8daf643,2017-12-22T13:07:47
2017-12-22,45011,8.46670534 76.95064849 -99.0 5.0,8.46670534,76.95064849,-99.0,5.0,ug_cable_route,four_pole,1,ht,not_applicable,not_applicable,ug_cable,ab,yes,250,1,1513921234583.jpg,vm9QcaVf7PkpEH4DGALVqt,uuid:10ad7aaa-6434-4dee-8912-5329e1932f83,10ad7aaa-6434-4dee-8912-5329e1932f83,2017-12-22T13:08:12
