<svg width="48" height="48" viewBox="0 0 48 48" fill="none" xmlns="http://www.w3.org/2000/svg">
<path d="M35.09 10L24 2L12.91 10L0 2V38L12.91 46L24 38L35.09 46L48 38V2L35.09 10ZM14 14.146L22 8.374V34.51L14 40.28V14.146ZM26 8.374L34 14.146V40.282L26 34.512V8.374ZM4 9.184L12 14.142V40.73L4 35.772V9.184ZM44 35.774L36 40.732V14.142L44 9.184V35.774Z" fill="white"/>
</svg>
