main.c:159:5:main	16	static,ignoring_inline_asm
main.c:265:6:LoraMacProcessNotify	8	static
main.c:271:13:LORA_HasJoined	8	static
main.c:279:13:Send	80	static
main.c:409:13:LORA_RxData	16	static
main.c:481:13:OnTxTimerEvent	16	static
main.c:489:13:LoraStartTx	16	static
main.c:512:13:LORA_ConfirmClass	16	static
main.c:524:13:LORA_TxNeeded	8	static
main.c:537:9:LORA_GetBatteryLevel	24	static
main.c:563:6:tamp_interruptFunction	8	static
main.c:574:13:GPIO_Init	48	static
main.c:604:13:OnTimerLedEvent	16	static
