EESchema Schematic File Version 4
LIBS:ULPLoRa-HATv1.0-cache
EELAYER 26 0
EELAYER END
$Descr A4 11693 8268
encoding utf-8
Sheet 1 1
Title "ULPLoRa-HAT"
Date "25/09/2019"
Rev "1.0"
Comp "ICFOSS"
Comment1 ""
Comment2 ""
Comment3 ""
Comment4 ""
$EndDescr
Text Notes 2000 2300 2    60   ~ 0
PULL UP Pins
Text Notes 6200 3850 0    59   ~ 0
Delays\n
Text Label 8950 2000 0    39   ~ 0
10
Text Label 8950 1900 0    39   ~ 0
11
Text Label 8950 1800 0    39   ~ 0
12
Text Label 8950 1700 0    39   ~ 0
13
Text Label 8950 1600 0    39   ~ 0
A0
Text Label 8950 1500 0    39   ~ 0
A1
Text Label 8950 1400 0    39   ~ 0
A2
Text Label 8950 1200 0    39   ~ 0
3V3
Text Label 8950 1100 0    39   ~ 0
RST
Text Label 8950 1000 0    39   ~ 0
GND
Text Label 8950 1300 0    39   ~ 0
A3
Text Label 8750 2000 2    39   ~ 0
9
Text Label 8750 1900 2    39   ~ 0
8
Text Label 8750 1800 2    39   ~ 0
7
Text Label 8750 1700 2    39   ~ 0
6
Text Label 8750 1600 2    39   ~ 0
5
Text Label 8750 1500 2    39   ~ 0
4
Text Label 8750 1400 2    39   ~ 0
3
Text Label 8750 1300 2    39   ~ 0
2
Text Label 8750 1200 2    39   ~ 0
GND
Text Label 8750 1100 2    39   ~ 0
RST
Text Label 8750 1000 2    39   ~ 0
RXD
Text Label 8750 900  2    39   ~ 0
TXD
Text Notes 10300 650  2    59   ~ 0
Connectors to ULPLoRa
Text Label 10450 1050 0    39   ~ 0
ISO_GND
Text Label 10450 1150 0    39   ~ 0
SCL
Text Label 10450 1250 0    39   ~ 0
SDA
Text Label 2700 1550 0    39   ~ 0
GND
Text Label 2700 900  0    39   ~ 0
ISO_GND
Text Notes 1400 650  0    39   ~ 0
Ground Isolation using MOSFET
Wire Notes Line
	500  1900 4700 1900
Wire Notes Line
	3450 500  3450 3900
Wire Notes Line
	500  3900 4700 3900
Wire Wire Line
	9100 2000 8950 2000
Wire Wire Line
	9100 1900 8950 1900
Wire Wire Line
	9100 1800 8950 1800
Wire Wire Line
	9100 1700 8950 1700
Wire Wire Line
	9100 1600 8950 1600
Wire Wire Line
	9100 1500 8950 1500
Wire Wire Line
	9100 1400 8950 1400
Wire Wire Line
	9100 1200 8950 1200
Wire Wire Line
	9100 1300 8950 1300
Wire Wire Line
	8600 900  8750 900 
Wire Wire Line
	8600 1000 8750 1000
Wire Wire Line
	8600 1300 8750 1300
Wire Wire Line
	8600 1400 8750 1400
Wire Wire Line
	8600 1500 8750 1500
Wire Wire Line
	8600 1600 8750 1600
Wire Wire Line
	8600 2000 8750 2000
Wire Wire Line
	8600 1700 8750 1700
Wire Wire Line
	8600 1800 8750 1800
Wire Wire Line
	8600 1900 8750 1900
Wire Wire Line
	2550 1450 2550 1550
Wire Wire Line
	2550 1550 2700 1550
Wire Wire Line
	2550 1050 2550 900 
Text Label 9050 900  2    39   ~ 0
BAT
Wire Wire Line
	8950 900  9100 900 
Text Label 8750 2750 0    39   ~ 0
LED-GND
Text Label 8900 2650 0    39   ~ 0
LED
Text Label 8950 2450 0    39   ~ 0
VO
Text Label 8800 2850 0    39   ~ 0
V-LED
Wire Wire Line
	10450 950  10750 950 
Wire Wire Line
	10450 1050 10750 1050
Wire Wire Line
	10450 1150 10750 1150
Wire Wire Line
	10450 1250 10750 1250
Text Label 8800 2550 0    39   ~ 0
S-GND
$Comp
L Device:Jumper JP1
U 1 1 5DAC831B
P 1300 1250
F 0 "JP1" H 1300 1514 50  0000 C CNN
F 1 "GND-SW" H 1300 1423 50  0000 C CNN
F 2 "Connector_PinSocket_2.54mm:PinSocket_1x02_P2.54mm_Vertical" H 1300 1250 50  0001 C CNN
F 3 "~" H 1300 1250 50  0001 C CNN
	1    1300 1250
	1    0    0    -1  
$EndComp
Wire Wire Line
	1000 1250 800  1250
Text Label 800  1250 0    39   ~ 0
7
Text Label 1700 1250 0    39   ~ 0
GATE
Wire Wire Line
	1600 1250 1950 1250
Wire Wire Line
	2550 900  2700 900 
$Comp
L Connector:Conn_01x05_Male J5
U 1 1 5DAEAD0C
P 9450 2550
F 0 "J5" H 9650 2250 50  0000 C CNN
F 1 "I/O Ports" H 9650 2900 50  0000 C CNN
F 2 "Connector_PinSocket_2.54mm:PinSocket_1x05_P2.54mm_Vertical" H 9450 2550 50  0001 C CNN
F 3 "~" H 9450 2550 50  0001 C CNN
	1    9450 2550
	1    0    0    -1  
$EndComp
Wire Wire Line
	9650 2350 9850 2350
Wire Wire Line
	9650 2450 9850 2450
Wire Wire Line
	9650 2550 9850 2550
Wire Wire Line
	9650 2650 9850 2650
Wire Wire Line
	9650 2750 9850 2750
Text Label 9800 2650 0    39   ~ 0
A1
Text Label 9800 2550 0    39   ~ 0
A0
Text Label 9800 2450 0    39   ~ 0
8
Text Label 9800 2350 0    39   ~ 0
7
$Comp
L Connector:Conn_01x12_Male J2
U 1 1 5DB91F24
P 8400 1400
F 0 "J2" H 8600 700 50  0000 C CNN
F 1 "LH_Connector" H 8550 2050 50  0000 C CNN
F 2 "Connector_PinSocket_2.54mm:PinSocket_1x12_P2.54mm_Vertical" H 8400 1400 50  0001 C CNN
F 3 "~" H 8400 1400 50  0001 C CNN
	1    8400 1400
	1    0    0    -1  
$EndComp
$Comp
L Connector:Conn_01x12_Male J4
U 1 1 5DB92476
P 9300 1500
F 0 "J4" H 9273 1380 50  0000 R CNN
F 1 "RH_Connector" H 9700 750 50  0000 R CNN
F 2 "Connector_PinSocket_2.54mm:PinSocket_1x12_P2.54mm_Vertical" H 9300 1500 50  0001 C CNN
F 3 "~" H 9300 1500 50  0001 C CNN
	1    9300 1500
	-1   0    0    1   
$EndComp
$Comp
L Connector:Conn_01x04_Male J6
U 1 1 5DB92DC8
P 10950 1150
F 0 "J6" H 10922 1030 50  0000 R CNN
F 1 "I2C" H 11250 800 50  0000 R CNN
F 2 "Connector_PinSocket_2.54mm:PinSocket_1x04_P2.54mm_Vertical" H 10950 1150 50  0001 C CNN
F 3 "~" H 10950 1150 50  0001 C CNN
	1    10950 1150
	-1   0    0    1   
$EndComp
$Comp
L Connector:Conn_01x06_Male J1
U 1 1 5DB93235
P 8400 2550
F 0 "J1" H 8750 2200 50  0000 C CNN
F 1 "Dust Sensor" H 8750 2900 50  0000 C CNN
F 2 "Connector_PinSocket_2.54mm:PinSocket_1x06_P2.54mm_Vertical" H 8400 2550 50  0001 C CNN
F 3 "~" H 8400 2550 50  0001 C CNN
	1    8400 2550
	1    0    0    -1  
$EndComp
NoConn ~ 8750 900 
NoConn ~ 8750 1000
NoConn ~ 8750 1300
NoConn ~ 8750 1400
NoConn ~ 8750 1500
NoConn ~ 8750 1600
NoConn ~ 8750 1700
NoConn ~ 8750 2000
NoConn ~ 8950 2000
NoConn ~ 8950 1900
NoConn ~ 8950 1800
NoConn ~ 8950 1700
NoConn ~ 8950 1300
NoConn ~ 8950 900 
$Comp
L Device:R R4
U 1 1 5D83A804
P 2100 1250
F 0 "R4" V 2200 1250 50  0000 C CNN
F 1 "150" V 2000 1250 50  0000 C CNN
F 2 "Resistor_SMD:R_0603_1608Metric" V 2030 1250 50  0001 C CNN
F 3 "~" H 2100 1250 50  0001 C CNN
	1    2100 1250
	0    1    1    0   
$EndComp
Text Notes 3950 650  0    59   ~ 0
RESET\n
$Comp
L Connector:Conn_01x02_Male J7
U 1 1 5D850467
P 3800 1000
F 0 "J7" H 3906 1178 50  0000 C CNN
F 1 "RESET" H 3906 1087 50  0000 C CNN
F 2 "Connector_PinSocket_2.54mm:PinSocket_1x02_P2.54mm_Vertical" H 3800 1000 50  0001 C CNN
F 3 "~" H 3800 1000 50  0001 C CNN
	1    3800 1000
	1    0    0    -1  
$EndComp
Wire Wire Line
	4000 1000 4150 1000
Wire Wire Line
	4000 1100 4150 1100
Text Label 4150 1000 0    60   ~ 0
RST
Text Label 4150 1100 0    60   ~ 0
GND
Text Notes 8850 3400 2    60   ~ 0
Nano Timer
$Comp
L Device:R R12
U 1 1 5D895DC5
P 5800 4100
F 0 "R12" V 5800 3800 50  0000 L CNN
F 1 "54.9K" V 5700 4000 50  0000 L CNN
F 2 "Resistor_SMD:R_0603_1608Metric" V 5730 4100 50  0001 C CNN
F 3 "~" H 5800 4100 50  0001 C CNN
	1    5800 4100
	0    1    1    0   
$EndComp
$Comp
L Switch:SW_DIP_x04 SW1
U 1 1 5D89B724
P 7200 4850
F 0 "SW1" H 7200 5317 50  0000 C CNN
F 1 "SW_DIP_x04" H 7200 5226 50  0000 C CNN
F 2 "Button_Switch_SMD:SW_DIP_SPSTx04_Slide_Omron_A6H-4101_W6.15mm_P1.27mm" H 7200 4850 50  0001 C CNN
F 3 "" H 7200 4850 50  0001 C CNN
	1    7200 4850
	1    0    0    -1  
$EndComp
$Comp
L Device:R R13
U 1 1 5D8A6727
P 5800 4250
F 0 "R13" V 5800 3950 50  0000 L CNN
F 1 "196K" V 5900 4150 50  0000 L CNN
F 2 "Resistor_SMD:R_0603_1608Metric" V 5730 4250 50  0001 C CNN
F 3 "~" H 5800 4250 50  0001 C CNN
	1    5800 4250
	0    1    1    0   
$EndComp
$Comp
L Device:R R14
U 1 1 5D8A835F
P 5800 4550
F 0 "R14" V 5800 4250 50  0000 L CNN
F 1 "107K" V 5700 4450 50  0000 L CNN
F 2 "Resistor_SMD:R_0603_1608Metric" V 5730 4550 50  0001 C CNN
F 3 "~" H 5800 4550 50  0001 C CNN
	1    5800 4550
	0    1    1    0   
$EndComp
$Comp
L Device:R R15
U 1 1 5D8A9FAF
P 5800 4700
F 0 "R15" V 5800 4400 50  0000 L CNN
F 1 "124K" V 5900 4600 50  0000 L CNN
F 2 "Resistor_SMD:R_0603_1608Metric" V 5730 4700 50  0001 C CNN
F 3 "~" H 5800 4700 50  0001 C CNN
	1    5800 4700
	0    1    1    0   
$EndComp
$Comp
L Device:R R16
U 1 1 5D8ABC1D
P 5800 5000
F 0 "R16" V 5800 4700 50  0000 L CNN
F 1 "182K" V 5700 4900 50  0000 L CNN
F 2 "Resistor_SMD:R_0603_1608Metric" V 5730 5000 50  0001 C CNN
F 3 "~" H 5800 5000 50  0001 C CNN
	1    5800 5000
	0    1    1    0   
$EndComp
$Comp
L Device:R R17
U 1 1 5D8AD861
P 5800 5150
F 0 "R17" V 5800 4850 50  0000 L CNN
F 1 "187K" V 5900 5050 50  0000 L CNN
F 2 "Resistor_SMD:R_0603_1608Metric" V 5730 5150 50  0001 C CNN
F 3 "~" H 5800 5150 50  0001 C CNN
	1    5800 5150
	0    1    1    0   
$EndComp
$Comp
L Device:R R18
U 1 1 5D8AF4C5
P 5800 5450
F 0 "R18" V 5800 5150 50  0000 L CNN
F 1 "340K" V 5700 5350 50  0000 L CNN
F 2 "Resistor_SMD:R_0603_1608Metric" V 5730 5450 50  0001 C CNN
F 3 "~" H 5800 5450 50  0001 C CNN
	1    5800 5450
	0    1    1    0   
$EndComp
$Comp
L Device:R R19
U 1 1 5D8B1113
P 5800 5600
F 0 "R19" V 5800 5300 50  0000 L CNN
F 1 "340K" V 5900 5500 50  0000 L CNN
F 2 "Resistor_SMD:R_0603_1608Metric" V 5730 5600 50  0001 C CNN
F 3 "~" H 5800 5600 50  0001 C CNN
	1    5800 5600
	0    1    1    0   
$EndComp
Wire Wire Line
	5650 4100 5650 4150
Wire Wire Line
	5650 4550 5650 4600
Wire Wire Line
	5650 5000 5650 5100
Wire Wire Line
	5650 5450 5650 5550
Wire Wire Line
	5950 4100 5950 4150
Wire Wire Line
	5950 4550 5950 4600
Wire Wire Line
	5950 5000 5950 5100
Wire Wire Line
	5950 5450 5950 5550
Wire Wire Line
	5450 4150 5650 4150
Connection ~ 5650 4150
Wire Wire Line
	5650 4150 5650 4250
Wire Wire Line
	5450 4150 5450 4600
Wire Wire Line
	5450 5550 5650 5550
Connection ~ 5650 5550
Wire Wire Line
	5650 5550 5650 5600
Wire Wire Line
	5650 4600 5450 4600
Connection ~ 5650 4600
Wire Wire Line
	5650 4600 5650 4700
Connection ~ 5450 4600
Wire Wire Line
	5650 5100 5450 5100
Wire Wire Line
	5450 4600 5450 4800
Connection ~ 5650 5100
Wire Wire Line
	5650 5100 5650 5150
Wire Wire Line
	5950 4150 6700 4150
Wire Wire Line
	6700 4150 6700 4650
Wire Wire Line
	6700 4650 6900 4650
Connection ~ 5950 4150
Wire Wire Line
	5950 4150 5950 4250
Wire Wire Line
	5950 4600 6550 4600
Wire Wire Line
	6550 4600 6550 4750
Wire Wire Line
	6550 4750 6900 4750
Connection ~ 5950 4600
Wire Wire Line
	5950 4600 5950 4700
Wire Wire Line
	5950 5100 6550 5100
Wire Wire Line
	6550 4850 6900 4850
Connection ~ 5950 5100
Wire Wire Line
	5950 5100 5950 5150
Wire Wire Line
	5950 5550 6700 5550
Wire Wire Line
	6700 4950 6900 4950
Connection ~ 5950 5550
Wire Wire Line
	5950 5550 5950 5600
Wire Wire Line
	5450 4800 5150 4800
Wire Wire Line
	7500 4950 7500 4850
Wire Wire Line
	7500 4850 7500 4800
Connection ~ 7500 4850
Wire Wire Line
	7500 4750 7500 4650
Connection ~ 7500 4750
Wire Wire Line
	7500 4800 7850 4800
Connection ~ 7500 4800
Wire Wire Line
	7500 4800 7500 4750
Wire Wire Line
	7850 4800 7850 4850
Wire Wire Line
	7850 4850 8100 4850
$Comp
L Switch:SW_Push SW4
U 1 1 5D8A3260
P 7850 4600
F 0 "SW4" V 7896 4552 50  0000 R CNN
F 1 "SW_Push" H 8000 4750 50  0000 R CNN
F 2 "Button_Switch_SMD:SW_SPST_EVQPE1" H 7850 4800 50  0001 C CNN
F 3 "" H 7850 4800 50  0001 C CNN
	1    7850 4600
	0    -1   -1   0   
$EndComp
Connection ~ 7850 4800
Wire Wire Line
	8100 4750 8100 3900
Wire Wire Line
	8100 3900 8700 3900
Connection ~ 8700 3900
Wire Wire Line
	9200 4850 9550 4850
Wire Wire Line
	9550 4850 9550 4950
Text Label 10050 5800 0    39   ~ 0
GND
Text Label 9450 4750 0    39   ~ 0
DRV
Wire Wire Line
	9850 3700 9700 3700
$Comp
L Device:Jumper JP2
U 1 1 5D94902C
P 9400 3700
F 0 "JP2" H 9400 3964 50  0000 C CNN
F 1 "NANO" H 9400 3873 50  0000 C CNN
F 2 "Connector_PinSocket_2.54mm:PinSocket_1x02_P2.54mm_Vertical" H 9400 3700 50  0001 C CNN
F 3 "~" H 9400 3700 50  0001 C CNN
	1    9400 3700
	1    0    0    -1  
$EndComp
Wire Wire Line
	5150 4800 5150 5800
Wire Wire Line
	10450 1550 10950 1550
Wire Wire Line
	10450 1650 10950 1650
Text Label 10850 1550 0    39   ~ 0
DRV
Text Label 10800 1650 0    39   ~ 0
Done
Text Label 10450 1550 0    39   ~ 0
A0
Text Label 10450 1650 0    39   ~ 0
A1
Text Label 9750 3700 0    39   ~ 0
3V3
Text Label 9800 2750 0    39   ~ 0
A2
Text Label 8900 2350 0    39   ~ 0
3V3
Text Label 10450 950  0    39   ~ 0
3V3
Text Notes 10900 1800 2    39   ~ 0
Nano Timer
Text Label 7650 1150 0    39   ~ 0
ISO_GND
Text Label 7850 1050 0    39   ~ 0
A1
Text Label 7850 850  0    39   ~ 0
A0
Text Label 7550 1250 0    39   ~ 0
LED-ANODE
Text Label 7650 950  0    39   ~ 0
ISO_GND
Text Label 7800 750  0    39   ~ 0
3V3
Wire Wire Line
	8600 2350 9000 2350
Wire Wire Line
	8600 2450 9000 2450
Wire Wire Line
	8600 2550 9000 2550
Wire Wire Line
	8600 2650 9000 2650
Wire Wire Line
	8600 2750 9000 2750
Wire Wire Line
	8600 2850 9000 2850
Text Label 6750 1150 0    39   ~ 0
LED-GND
Text Label 6900 1050 0    39   ~ 0
LED
Text Label 6950 850  0    39   ~ 0
VO
Text Label 6800 1250 0    39   ~ 0
V-LED
Text Label 6800 950  0    39   ~ 0
S-GND
Text Label 5050 750  0    39   ~ 0
3V3
Wire Wire Line
	6600 850  7900 850 
Wire Wire Line
	6600 1050 7900 1050
Wire Wire Line
	6250 950  7900 950 
Wire Wire Line
	6250 1150 7900 1150
$Comp
L Device:R R7
U 1 1 5DABF63C
P 5250 900
F 0 "R7" H 5320 946 50  0000 L CNN
F 1 "150" H 5320 855 50  0000 L CNN
F 2 "Resistor_SMD:R_0603_1608Metric" V 5180 900 50  0001 C CNN
F 3 "~" H 5250 900 50  0001 C CNN
	1    5250 900 
	-1   0    0    1   
$EndComp
Wire Wire Line
	5250 750  5050 750 
Connection ~ 5250 750 
Wire Wire Line
	5250 1050 5250 1100
Text Notes 6700 650  2    39   ~ 0
Dust Sensor
$Comp
L Device:CP1 C1
U 1 1 5DAFC01C
P 5550 1100
F 0 "C1" V 5802 1100 50  0000 C CNN
F 1 "220uF" V 5711 1100 50  0000 C CNN
F 2 "Capacitor_SMD:CP_Elec_8x6.2" H 5550 1100 50  0001 C CNN
F 3 "~" H 5550 1100 50  0001 C CNN
	1    5550 1100
	0    -1   -1   0   
$EndComp
Wire Wire Line
	5250 750  7900 750 
Wire Wire Line
	5250 1250 7900 1250
Wire Wire Line
	5400 1100 5250 1100
Connection ~ 5250 1100
Wire Wire Line
	5250 1100 5250 1250
Wire Wire Line
	5700 1100 6250 1100
Wire Wire Line
	6250 950  6250 1100
Connection ~ 6250 1100
Wire Wire Line
	6250 1100 6250 1150
Text Notes 6200 4100 0    59   ~ 0
5min
Text Notes 6150 4550 0    59   ~ 0
10min
Wire Wire Line
	5450 4800 5450 5100
Connection ~ 5450 4800
Wire Wire Line
	6550 4850 6550 5100
Wire Wire Line
	6700 4950 6700 5550
Wire Wire Line
	5450 5100 5450 5550
Connection ~ 5450 5100
Text Notes 6150 5050 0    59   ~ 0
30min
Text Notes 6150 5500 0    59   ~ 0
1hour
$Comp
L Device:R R1
U 1 1 5DC1BB0C
P 1500 2550
F 0 "R1" V 1450 2350 50  0000 L CNN
F 1 "10K" V 1400 2500 50  0000 L CNN
F 2 "Resistor_SMD:R_0603_1608Metric" V 1430 2550 50  0001 C CNN
F 3 "~" H 1500 2550 50  0001 C CNN
	1    1500 2550
	0    1    1    0   
$EndComp
$Comp
L Device:R R2
U 1 1 5DC1BD8A
P 1500 2750
F 0 "R2" V 1450 2550 50  0000 L CNN
F 1 "10K" V 1400 2700 50  0000 L CNN
F 2 "Resistor_SMD:R_0603_1608Metric" V 1430 2750 50  0001 C CNN
F 3 "~" H 1500 2750 50  0001 C CNN
	1    1500 2750
	0    1    1    0   
$EndComp
$Comp
L Device:R R3
U 1 1 5DC31131
P 1500 2950
F 0 "R3" V 1450 2750 50  0000 L CNN
F 1 "10K" V 1400 2900 50  0000 L CNN
F 2 "Resistor_SMD:R_0603_1608Metric" V 1430 2950 50  0001 C CNN
F 3 "~" H 1500 2950 50  0001 C CNN
	1    1500 2950
	0    1    1    0   
$EndComp
Wire Wire Line
	1650 2550 1900 2550
Wire Wire Line
	1900 2550 1900 2750
Wire Wire Line
	1900 2750 2350 2750
Wire Wire Line
	1650 2750 1850 2750
Wire Wire Line
	1850 2750 1850 2850
Wire Wire Line
	1850 2850 2350 2850
Wire Wire Line
	1650 2950 2350 2950
Wire Wire Line
	1350 2550 1250 2550
Wire Wire Line
	1250 2750 1350 2750
Wire Wire Line
	1350 2950 1250 2950
Wire Wire Line
	1250 2750 1250 2950
Connection ~ 1250 2750
Wire Wire Line
	1250 2550 1250 2750
Wire Wire Line
	1250 2750 900  2750
Text Label 900  2750 0    39   ~ 0
3V3
Text Label 3200 2950 0    39   ~ 0
A2
Text Label 3200 2750 0    39   ~ 0
7
Text Label 3200 2850 0    39   ~ 0
8
Wire Notes Line
	4700 3000 11250 3000
Wire Notes Line
	8250 500  8250 3000
$Comp
L Connector:Conn_01x03_Male J3
U 1 1 5DD59CCF
P 10400 2550
F 0 "J3" H 10650 2350 50  0000 C CNN
F 1 "VDD GND ISO_GND" H 10600 2350 50  0001 C CNN
F 2 "Connector_PinSocket_2.54mm:PinSocket_1x03_P2.54mm_Vertical" H 10400 2550 50  0001 C CNN
F 3 "~" H 10400 2550 50  0001 C CNN
	1    10400 2550
	1    0    0    -1  
$EndComp
Wire Wire Line
	10600 2450 10850 2450
Wire Wire Line
	10600 2550 10850 2550
Wire Wire Line
	10600 2650 10850 2650
Text Label 10750 2450 0    39   ~ 0
3V3
Text Label 10750 2550 0    39   ~ 0
GND
Text Label 10600 2650 0    39   ~ 0
ISO_GND
Wire Wire Line
	9850 1700 10100 1700
Wire Wire Line
	9850 1800 10100 1800
Wire Wire Line
	9850 1900 10100 1900
Text Label 10000 1800 0    39   ~ 0
3V3
Text Label 9950 1700 0    39   ~ 0
DATA
Text Label 10000 1900 0    39   ~ 0
GND
$Comp
L Connector:Conn_01x03_Male J8
U 1 1 5DD9B874
P 9650 1800
F 0 "J8" H 9900 1600 50  0000 C CNN
F 1 "DHT" H 9900 2050 50  0000 C CNN
F 2 "Connector_PinSocket_2.54mm:PinSocket_1x03_P2.54mm_Vertical" H 9650 1800 50  0001 C CNN
F 3 "~" H 9650 1800 50  0001 C CNN
	1    9650 1800
	1    0    0    -1  
$EndComp
Wire Wire Line
	10950 2050 10500 2050
Text Label 10500 2050 0    39   ~ 0
DATA
Text Label 10900 2050 0    39   ~ 0
A2
Wire Wire Line
	8700 3900 8700 4350
Wire Wire Line
	8100 3900 7850 3900
Wire Wire Line
	7850 3900 7850 4400
Connection ~ 8100 3900
Wire Wire Line
	5150 5800 8700 5800
Connection ~ 9550 5800
Wire Wire Line
	9550 5800 10200 5800
Wire Wire Line
	8700 3900 8700 3700
$Comp
L power:PWR_FLAG #FLG0101
U 1 1 5DEB61A0
P 3800 2700
F 0 "#FLG0101" H 3800 2775 50  0001 C CNN
F 1 "PWR_FLAG" H 3800 2874 50  0000 C CNN
F 2 "" H 3800 2700 50  0001 C CNN
F 3 "~" H 3800 2700 50  0001 C CNN
	1    3800 2700
	1    0    0    -1  
$EndComp
Wire Wire Line
	3800 2700 3800 2800
Text Label 3800 2800 0    60   ~ 0
3V3
$Comp
L Device:R R8
U 1 1 5DEF89AE
P 9550 5100
F 0 "R8" H 9600 5100 50  0000 L CNN
F 1 "1M" V 9450 5050 50  0000 L CNN
F 2 "Resistor_SMD:R_0603_1608Metric" V 9480 5100 50  0001 C CNN
F 3 "~" H 9550 5100 50  0001 C CNN
	1    9550 5100
	-1   0    0    1   
$EndComp
$Comp
L Transistor_FET:2N7002 Q1
U 1 1 5D8ABBF4
P 2450 1250
F 0 "Q1" H 2655 1296 50  0000 L CNN
F 1 "2N7002" H 2655 1205 50  0000 L CNN
F 2 "Package_TO_SOT_SMD:SOT-23" H 2650 1175 50  0001 L CIN
F 3 "https://www.fairchildsemi.com/datasheets/2N/2N7002.pdf" H 2450 1250 50  0001 L CNN
	1    2450 1250
	1    0    0    -1  
$EndComp
Wire Notes Line
	4700 500  4700 7800
$Comp
L Switch:SW_DIP_x04 SW2
U 1 1 5D91D4F2
P 2650 2950
F 0 "SW2" H 2650 3417 50  0000 C CNN
F 1 "SW_DIP_x04" H 2650 3326 50  0000 C CNN
F 2 "Button_Switch_SMD:SW_DIP_SPSTx04_Slide_Omron_A6H-4101_W6.15mm_P1.27mm" H 2650 2950 50  0001 C CNN
F 3 "" H 2650 2950 50  0001 C CNN
	1    2650 2950
	1    0    0    -1  
$EndComp
Wire Wire Line
	2350 3050 900  3050
Text Label 3000 3050 0    39   ~ 0
ISO_GND
Wire Wire Line
	2950 2750 3250 2750
Wire Wire Line
	2950 2850 3250 2850
Wire Wire Line
	2950 2950 3250 2950
Wire Wire Line
	2950 3050 3250 3050
Text Label 900  3050 0    39   ~ 0
GND
Text Label 9750 1050 0    39   ~ 0
GND
Text Label 9750 1150 0    39   ~ 0
SCL
Text Label 9750 1250 0    39   ~ 0
SDA
Wire Wire Line
	9750 950  10050 950 
Wire Wire Line
	9750 1050 10050 1050
Wire Wire Line
	9750 1150 10050 1150
Wire Wire Line
	9750 1250 10050 1250
$Comp
L Connector:Conn_01x04_Male J9
U 1 1 5D9794B7
P 10250 1150
F 0 "J9" H 10222 1030 50  0000 R CNN
F 1 "I2C_B" H 10550 800 50  0000 R CNN
F 2 "Connector_PinSocket_2.54mm:PinSocket_1x04_P2.54mm_Vertical" H 10250 1150 50  0001 C CNN
F 3 "~" H 10250 1150 50  0001 C CNN
	1    10250 1150
	-1   0    0    1   
$EndComp
Text Label 9750 950  0    39   ~ 0
3V3
$Comp
L New_2:TPL5111 U1
U 1 1 5D8D7B6A
P 8700 4850
F 0 "U1" H 8500 4450 50  0000 C CNN
F 1 "TPL5111" H 8950 5350 50  0000 C CNN
F 2 "Package_TO_SOT_SMD:SOT-23-6" H 8700 4850 50  0001 C CNN
F 3 "http://www.ti.com/lit/ds/symlink/tpl5111.pdf" H 7050 5000 50  0001 C CNN
	1    8700 4850
	1    0    0    -1  
$EndComp
Text Label 9400 4850 0    39   ~ 0
Done
Wire Wire Line
	9550 5250 9550 5800
Wire Wire Line
	9200 4750 9550 4750
Wire Wire Line
	8700 3700 8950 3700
$Comp
L power:PWR_FLAG #FLG0103
U 1 1 5D93933A
P 8950 3700
F 0 "#FLG0103" H 8950 3775 50  0001 C CNN
F 1 "PWR_FLAG" H 8950 3874 50  0000 C CNN
F 2 "" H 8950 3700 50  0001 C CNN
F 3 "~" H 8950 3700 50  0001 C CNN
	1    8950 3700
	1    0    0    -1  
$EndComp
Connection ~ 8950 3700
Wire Wire Line
	8950 3700 9100 3700
Wire Wire Line
	8700 5250 8700 5800
Connection ~ 8700 5800
Wire Wire Line
	8700 5800 9550 5800
Text Label 4300 2800 0    60   ~ 0
GND
$Comp
L power:GND #PWR0101
U 1 1 5D912A34
P 4300 2900
F 0 "#PWR0101" H 4300 2650 50  0001 C CNN
F 1 "GND" H 4305 2727 50  0000 C CNN
F 2 "" H 4300 2900 50  0001 C CNN
F 3 "" H 4300 2900 50  0001 C CNN
	1    4300 2900
	1    0    0    -1  
$EndComp
Wire Wire Line
	4300 2700 4300 2900
$Comp
L power:PWR_FLAG #FLG0102
U 1 1 5DEB62ED
P 4300 2700
F 0 "#FLG0102" H 4300 2775 50  0001 C CNN
F 1 "PWR_FLAG" H 4300 2874 50  0000 C CNN
F 2 "" H 4300 2700 50  0001 C CNN
F 3 "~" H 4300 2700 50  0001 C CNN
	1    4300 2700
	1    0    0    -1  
$EndComp
Wire Wire Line
	8850 1000 8850 1200
Wire Wire Line
	8850 1000 9100 1000
Wire Wire Line
	8600 1200 8850 1200
Wire Wire Line
	8600 1100 9100 1100
$EndSCHEMATC
