../Core/Src/main.c:75:5:main	24	static
../Core/Src/main.c:147:6:SystemClock_Config	128	static
../Core/Src/main.c:198:13:MX_TIM2_Init	32	static
../Core/Src/main.c:243:13:MX_USART2_UART_Init	8	static
../Core/Src/main.c:278:13:MX_GPIO_Init	48	static
../Core/Src/main.c:309:6:usDelay	16	static
../Core/Src/main.c:325:6:Error_Handler	8	static,ignoring_inline_asm
