../Core/Src/main.c:66:5:main	40	static
../Core/Src/main.c:112:6:SystemClock_Config	128	static
../Core/Src/main.c:163:13:MX_USART2_UART_Init	8	static
../Core/Src/main.c:198:13:MX_GPIO_Init	16	static
../Core/Src/main.c:218:6:Error_Handler	8	static,ignoring_inline_asm
