/home/sherin/Videos/Gitlab/Example_Codes/Codes/Analog_ldr_2.0/Middlewares/Third_Party/LoRaWAN/Crypto/cmac.c:59:6:AES_CMAC_Init	8	static
/home/sherin/Videos/Gitlab/Example_Codes/Codes/Analog_ldr_2.0/Middlewares/Third_Party/LoRaWAN/Crypto/cmac.c:66:6:AES_CMAC_SetKey	8	static
/home/sherin/Videos/Gitlab/Example_Codes/Codes/Analog_ldr_2.0/Middlewares/Third_Party/LoRaWAN/Crypto/cmac.c:71:6:AES_CMAC_Update	48	static
/home/sherin/Videos/Gitlab/Example_Codes/Codes/Analog_ldr_2.0/Middlewares/Third_Party/LoRaWAN/Crypto/cmac.c:109:6:AES_CMAC_Final	64	static
