/home/sherin/Videos/Gitlab/Example_Codes/Codes/Analog_ldr_2.0/Core/Src/sys_app.c:316:13:tiny_snprintf_like.constprop	16	static
/home/sherin/Videos/Gitlab/Example_Codes/Codes/Analog_ldr_2.0/Core/Src/sys_app.c:241:13:TimestampNow	32	static
/home/sherin/Videos/Gitlab/Example_Codes/Codes/Analog_ldr_2.0/Core/Src/sys_app.c:94:6:SystemApp_Init	64	static
/home/sherin/Videos/Gitlab/Example_Codes/Codes/Analog_ldr_2.0/Core/Src/sys_app.c:152:6:UTIL_SEQ_Idle	8	static
/home/sherin/Videos/Gitlab/Example_Codes/Codes/Analog_ldr_2.0/Core/Src/sys_app.c:163:9:GetBatteryLevel	16	static
/home/sherin/Videos/Gitlab/Example_Codes/Codes/Analog_ldr_2.0/Core/Src/sys_app.c:197:10:GetTemperatureLevel	8	static
/home/sherin/Videos/Gitlab/Example_Codes/Codes/Analog_ldr_2.0/Core/Src/sys_app.c:208:6:GetUniqueId	16	static
/home/sherin/Videos/Gitlab/Example_Codes/Codes/Analog_ldr_2.0/Core/Src/sys_app.c:230:10:GetDevAddr	8	static
/home/sherin/Videos/Gitlab/Example_Codes/Codes/Analog_ldr_2.0/Core/Src/sys_app.c:294:6:UTIL_ADV_TRACE_PreSendHook	8	static
/home/sherin/Videos/Gitlab/Example_Codes/Codes/Analog_ldr_2.0/Core/Src/sys_app.c:305:6:UTIL_ADV_TRACE_PostSendHook	8	static
/home/sherin/Videos/Gitlab/Example_Codes/Codes/Analog_ldr_2.0/Core/Src/sys_app.c:339:19:HAL_InitTick	0	static
/home/sherin/Videos/Gitlab/Example_Codes/Codes/Analog_ldr_2.0/Core/Src/sys_app.c:354:10:HAL_GetTick	8	static
/home/sherin/Videos/Gitlab/Example_Codes/Codes/Analog_ldr_2.0/Core/Src/sys_app.c:368:6:HAL_Delay	16	static
