/home/sherin/Videos/Gitlab/Example_Codes/Codes/Analog_ldr_2.0/Drivers/STM32L0xx_HAL_Driver/Src/stm32l0xx_hal_i2c_ex.c:97:19:HAL_I2CEx_ConfigAnalogFilter	20	static
/home/sherin/Videos/Gitlab/Example_Codes/Codes/Analog_ldr_2.0/Drivers/STM32L0xx_HAL_Driver/Src/stm32l0xx_hal_i2c_ex.c:141:19:HAL_I2CEx_ConfigDigitalFilter	20	static
/home/sherin/Videos/Gitlab/Example_Codes/Codes/Analog_ldr_2.0/Drivers/STM32L0xx_HAL_Driver/Src/stm32l0xx_hal_i2c_ex.c:192:19:HAL_I2CEx_EnableWakeUp	16	static
/home/sherin/Videos/Gitlab/Example_Codes/Codes/Analog_ldr_2.0/Drivers/STM32L0xx_HAL_Driver/Src/stm32l0xx_hal_i2c_ex.c:231:19:HAL_I2CEx_DisableWakeUp	16	static
/home/sherin/Videos/Gitlab/Example_Codes/Codes/Analog_ldr_2.0/Drivers/STM32L0xx_HAL_Driver/Src/stm32l0xx_hal_i2c_ex.c:280:6:HAL_I2CEx_EnableFastModePlus	0	static
/home/sherin/Videos/Gitlab/Example_Codes/Codes/Analog_ldr_2.0/Drivers/STM32L0xx_HAL_Driver/Src/stm32l0xx_hal_i2c_ex.c:307:6:HAL_I2CEx_DisableFastModePlus	0	static
