EESchema Schematic File Version 2
LIBS:Solar_USB_Charger_6V_1s-rescue
LIBS:power
LIBS:device
LIBS:switches
LIBS:relays
LIBS:motors
LIBS:transistors
LIBS:conn
LIBS:linear
LIBS:regul
LIBS:74xx
LIBS:cmos4000
LIBS:adc-dac
LIBS:memory
LIBS:xilinx
LIBS:microcontrollers
LIBS:dsp
LIBS:microchip
LIBS:analog_switches
LIBS:motorola
LIBS:texas
LIBS:intel
LIBS:audio
LIBS:interface
LIBS:digital-audio
LIBS:philips
LIBS:display
LIBS:cypress
LIBS:siliconi
LIBS:opto
LIBS:atmel
LIBS:contrib
LIBS:valves
LIBS:MCP73871-2CCI_ML
LIBS:Solar_USB_Charger_6V_1s-cache
EELAYER 25 0
EELAYER END
$Descr A4 11693 8268
encoding utf-8
Sheet 1 1
Title "Solar_DC_USB_Battery_Charger"
Date "2018-12-28"
Rev "V1.0"
Comp "ICFOSS"
Comment1 ""
Comment2 ""
Comment3 ""
Comment4 ""
$EndDescr
$Comp
L MCP73871-2CCI_ML IC1
U 1 1 5C25B929
P 7800 2800
F 0 "IC1" H 8350 3650 50  0000 L CNN
F 1 "MCP73871-2CCI_ML" H 8350 3550 50  0000 L CNN
F 2 "Housings_DFN_QFN:QFN-20-1EP_4x4mm_Pitch0.5mm" H 8950 3500 50  0001 L CNN
F 3 "http://ww1.microchip.com/downloads/en/DeviceDoc/20002090C.pdf" H 8950 3400 50  0001 L CNN
F 4 "Li-Ion Charger USB/DC 4.2V TE LBO QFN20" H 8950 3300 50  0001 L CNN "Description"
F 5 "1" H 8950 3200 50  0001 L CNN "Height"
F 6 "Microchip" H 8950 3100 50  0001 L CNN "Manufacturer_Name"
F 7 "MCP73871-2CCI/ML" H 8950 3000 50  0001 L CNN "Manufacturer_Part_Number"
F 8 "6696199P" H 8950 2900 50  0001 L CNN "RS Part Number"
F 9 "http://uk.rs-online.com/web/p/products/6696199P" H 8950 2800 50  0001 L CNN "RS Price/Stock"
F 10 "70046833" H 8950 2700 50  0001 L CNN "Allied_Number"
F 11 "http://www.alliedelec.com/microchip-technology-inc-mcp73871-2cci-ml/70046833/" H 8950 2600 50  0001 L CNN "Allied Price/Stock"
F 12 "579-MCP73871-2CCI/ML" H 8950 2500 50  0001 L CNN "Mouser Part Number"
F 13 "https://www.mouser.com/Search/Refine.aspx?Keyword=579-MCP73871-2CCI%2FML" H 8950 2400 50  0001 L CNN "Mouser Price/Stock"
	1    7800 2800
	1    0    0    -1  
$EndComp
$Comp
L Conn_01x02 J6
U 1 1 5C25E356
P 9650 2250
F 0 "J6" H 9650 2350 50  0000 C CNN
F 1 "Load" H 9650 2050 50  0000 C CNN
F 2 "Pin_Headers:Pin_Header_Straight_1x02_Pitch2.54mm" H 9650 2250 50  0001 C CNN
F 3 "" H 9650 2250 50  0001 C CNN
	1    9650 2250
	1    0    0    -1  
$EndComp
$Comp
L Conn_01x02 J5
U 1 1 5C25E49F
P 9650 1900
F 0 "J5" H 9650 2000 50  0000 C CNN
F 1 "Load" H 9650 1700 50  0000 C CNN
F 2 "Connectors_JST:JST_PH_S2B-PH-K_02x2.00mm_Angled" H 9650 1900 50  0001 C CNN
F 3 "" H 9650 1900 50  0001 C CNN
	1    9650 1900
	1    0    0    1   
$EndComp
$Comp
L GND #PWR01
U 1 1 5C25E600
P 9400 2400
F 0 "#PWR01" H 9400 2150 50  0001 C CNN
F 1 "GND" H 9400 2250 50  0000 C CNN
F 2 "" H 9400 2400 50  0001 C CNN
F 3 "" H 9400 2400 50  0001 C CNN
	1    9400 2400
	1    0    0    -1  
$EndComp
$Comp
L GND #PWR02
U 1 1 5C25E629
P 9400 1950
F 0 "#PWR02" H 9400 1700 50  0001 C CNN
F 1 "GND" H 9400 1800 50  0000 C CNN
F 2 "" H 9400 1950 50  0001 C CNN
F 3 "" H 9400 1950 50  0001 C CNN
	1    9400 1950
	1    0    0    -1  
$EndComp
$Comp
L Conn_01x02 J7
U 1 1 5C25E670
P 10750 3050
F 0 "J7" H 10750 3150 50  0000 C CNN
F 1 "Bat" H 10750 2850 50  0000 C CNN
F 2 "Connectors_JST:JST_PH_S2B-PH-K_02x2.00mm_Angled" H 10750 3050 50  0001 C CNN
F 3 "" H 10750 3050 50  0001 C CNN
	1    10750 3050
	1    0    0    1   
$EndComp
$Comp
L GND #PWR03
U 1 1 5C25E7C3
P 10500 3100
F 0 "#PWR03" H 10500 2850 50  0001 C CNN
F 1 "GND" H 10500 2950 50  0000 C CNN
F 2 "" H 10500 3100 50  0001 C CNN
F 3 "" H 10500 3100 50  0001 C CNN
	1    10500 3100
	1    0    0    -1  
$EndComp
$Comp
L Conn_01x02 J8
U 1 1 5C25E808
P 10750 3500
F 0 "J8" H 10750 3600 50  0000 C CNN
F 1 "Bat" H 10750 3300 50  0000 C CNN
F 2 "Pin_Headers:Pin_Header_Straight_1x02_Pitch2.54mm" H 10750 3500 50  0001 C CNN
F 3 "" H 10750 3500 50  0001 C CNN
	1    10750 3500
	1    0    0    -1  
$EndComp
$Comp
L GND #PWR04
U 1 1 5C25E8F7
P 10500 3650
F 0 "#PWR04" H 10500 3400 50  0001 C CNN
F 1 "GND" H 10500 3500 50  0000 C CNN
F 2 "" H 10500 3650 50  0001 C CNN
F 3 "" H 10500 3650 50  0001 C CNN
	1    10500 3650
	1    0    0    -1  
$EndComp
$Comp
L GND #PWR05
U 1 1 5C25EB64
P 7800 3850
F 0 "#PWR05" H 7800 3600 50  0001 C CNN
F 1 "GND" H 7800 3700 50  0000 C CNN
F 2 "" H 7800 3850 50  0001 C CNN
F 3 "" H 7800 3850 50  0001 C CNN
	1    7800 3850
	1    0    0    -1  
$EndComp
$Comp
L Barrel_Jack J2
U 1 1 5C25EBCE
P 1150 5550
F 0 "J2" H 1150 5760 50  0000 C CNN
F 1 "6V PV" H 1150 5375 50  0000 C CNN
F 2 "Connectors:BARREL_JACK" H 1200 5510 50  0001 C CNN
F 3 "" H 1200 5510 50  0001 C CNN
	1    1150 5550
	1    0    0    -1  
$EndComp
$Comp
L USB_A-RESCUE-Solar_USB_Charger_6V_1s J3
U 1 1 5C25EC1F
P 1250 6550
F 0 "J3" H 1050 7000 50  0000 L CNN
F 1 "USB_A" H 1050 6900 50  0000 L CNN
F 2 "Connectors_USB:USB_Micro-B_Wuerth-629105150521" H 1400 6500 50  0001 C CNN
F 3 "" H 1400 6500 50  0001 C CNN
	1    1250 6550
	1    0    0    -1  
$EndComp
$Comp
L R R10
U 1 1 5C25EDC8
P 9600 3550
F 0 "R10" V 9680 3550 50  0000 C CNN
F 1 "150K" V 9600 3550 50  0000 C CNN
F 2 "Resistors_SMD:R_0805" V 9530 3550 50  0001 C CNN
F 3 "" H 9600 3550 50  0001 C CNN
	1    9600 3550
	1    0    0    -1  
$EndComp
$Comp
L R R9
U 1 1 5C25EE03
P 8800 3250
F 0 "R9" V 8880 3250 50  0000 C CNN
F 1 "1K" V 8800 3250 50  0000 C CNN
F 2 "Resistors_SMD:R_0805" V 8730 3250 50  0001 C CNN
F 3 "" H 8800 3250 50  0001 C CNN
	1    8800 3250
	0    1    1    0   
$EndComp
$Comp
L GND #PWR06
U 1 1 5C25EF22
P 9400 3900
F 0 "#PWR06" H 9400 3650 50  0001 C CNN
F 1 "GND" H 9400 3750 50  0000 C CNN
F 2 "" H 9400 3900 50  0001 C CNN
F 3 "" H 9400 3900 50  0001 C CNN
	1    9400 3900
	1    0    0    -1  
$EndComp
$Comp
L R R8
U 1 1 5C25F2B2
P 6850 3650
F 0 "R8" V 6930 3650 50  0000 C CNN
F 1 "2K" V 6850 3650 50  0000 C CNN
F 2 "Resistors_SMD:R_0805" V 6780 3650 50  0001 C CNN
F 3 "" H 6850 3650 50  0001 C CNN
	1    6850 3650
	1    0    0    -1  
$EndComp
$Comp
L R R7
U 1 1 5C25F2E8
P 6050 3650
F 0 "R7" V 6130 3650 50  0000 C CNN
F 1 "100K" V 6050 3650 50  0000 C CNN
F 2 "Resistors_SMD:R_0805" V 5980 3650 50  0001 C CNN
F 3 "" H 6050 3650 50  0001 C CNN
	1    6050 3650
	1    0    0    -1  
$EndComp
$Comp
L GND #PWR07
U 1 1 5C25F3FB
P 6850 3850
F 0 "#PWR07" H 6850 3600 50  0001 C CNN
F 1 "GND" H 6850 3700 50  0000 C CNN
F 2 "" H 6850 3850 50  0001 C CNN
F 3 "" H 6850 3850 50  0001 C CNN
	1    6850 3850
	1    0    0    -1  
$EndComp
$Comp
L GND #PWR08
U 1 1 5C25F427
P 6050 3850
F 0 "#PWR08" H 6050 3600 50  0001 C CNN
F 1 "GND" H 6050 3700 50  0000 C CNN
F 2 "" H 6050 3850 50  0001 C CNN
F 3 "" H 6050 3850 50  0001 C CNN
	1    6050 3850
	1    0    0    -1  
$EndComp
$Comp
L R R5
U 1 1 5C25F60D
P 6550 1150
F 0 "R5" V 6630 1150 50  0000 C CNN
F 1 "270K" V 6550 1150 50  0000 C CNN
F 2 "Resistors_SMD:R_0805" V 6480 1150 50  0001 C CNN
F 3 "" H 6550 1150 50  0001 C CNN
	1    6550 1150
	1    0    0    -1  
$EndComp
$Comp
L R R6
U 1 1 5C25F670
P 6550 1550
F 0 "R6" V 6630 1550 50  0000 C CNN
F 1 "100K" V 6550 1550 50  0000 C CNN
F 2 "Resistors_SMD:R_0805" V 6480 1550 50  0001 C CNN
F 3 "" H 6550 1550 50  0001 C CNN
	1    6550 1550
	1    0    0    -1  
$EndComp
$Comp
L GND #PWR09
U 1 1 5C25F708
P 6550 1750
F 0 "#PWR09" H 6550 1500 50  0001 C CNN
F 1 "GND" H 6550 1600 50  0000 C CNN
F 2 "" H 6550 1750 50  0001 C CNN
F 3 "" H 6550 1750 50  0001 C CNN
	1    6550 1750
	1    0    0    -1  
$EndComp
$Comp
L Conn_01x03 J4
U 1 1 5C25FB16
P 4900 2950
F 0 "J4" H 4900 3150 50  0000 C CNN
F 1 "LED_IND" H 4900 2750 50  0000 C CNN
F 2 "Pin_Headers:Pin_Header_Straight_1x03_Pitch2.54mm" H 4900 2950 50  0001 C CNN
F 3 "" H 4900 2950 50  0001 C CNN
	1    4900 2950
	-1   0    0    1   
$EndComp
$Comp
L LED_Small D2
U 1 1 5C25FC07
P 5300 2300
F 0 "D2" H 5250 2425 50  0000 L CNN
F 1 "Orange(Charging)" H 4950 2200 50  0000 L CNN
F 2 "LEDs:LED_0805" V 5300 2300 50  0001 C CNN
F 3 "" V 5300 2300 50  0001 C CNN
	1    5300 2300
	0    -1   -1   0   
$EndComp
$Comp
L LED_Small D3
U 1 1 5C25FC8C
P 5750 2300
F 0 "D3" H 5700 2425 50  0000 L CNN
F 1 "Green(Done)" H 5550 2200 50  0000 L CNN
F 2 "LEDs:LED_0805" V 5750 2300 50  0001 C CNN
F 3 "" V 5750 2300 50  0001 C CNN
	1    5750 2300
	0    -1   -1   0   
$EndComp
$Comp
L LED_Small D4
U 1 1 5C25FCD5
P 6200 2300
F 0 "D4" H 6150 2425 50  0000 L CNN
F 1 "Red(PWR)" H 6250 2200 50  0000 C CNN
F 2 "LEDs:LED_0805" V 6200 2300 50  0001 C CNN
F 3 "" V 6200 2300 50  0001 C CNN
	1    6200 2300
	0    -1   -1   0   
$EndComp
$Comp
L R R4
U 1 1 5C2603D0
P 6200 1900
F 0 "R4" V 6280 1900 50  0000 C CNN
F 1 "1K" V 6200 1900 50  0000 C CNN
F 2 "Resistors_SMD:R_0805" V 6130 1900 50  0001 C CNN
F 3 "" H 6200 1900 50  0001 C CNN
	1    6200 1900
	1    0    0    -1  
$EndComp
$Comp
L R R3
U 1 1 5C26048C
P 5750 1900
F 0 "R3" V 5830 1900 50  0000 C CNN
F 1 "1K" V 5750 1900 50  0000 C CNN
F 2 "Resistors_SMD:R_0805" V 5680 1900 50  0001 C CNN
F 3 "" H 5750 1900 50  0001 C CNN
	1    5750 1900
	1    0    0    -1  
$EndComp
$Comp
L R R2
U 1 1 5C2604EA
P 5300 1900
F 0 "R2" V 5380 1900 50  0000 C CNN
F 1 "1K" V 5300 1900 50  0000 C CNN
F 2 "Resistors_SMD:R_0805" V 5230 1900 50  0001 C CNN
F 3 "" H 5300 1900 50  0001 C CNN
	1    5300 1900
	1    0    0    -1  
$EndComp
NoConn ~ 1550 6650
NoConn ~ 1550 6550
$Comp
L D D1
U 1 1 5C2611D8
P 2100 5450
F 0 "D1" H 2100 5550 50  0000 C CNN
F 1 "MBR120VLSFT1G" H 2100 5350 50  0000 C CNN
F 2 "Diodes_SMD:D_SOD-123F" H 2100 5450 50  0001 C CNN
F 3 "" H 2100 5450 50  0001 C CNN
	1    2100 5450
	-1   0    0    1   
$EndComp
$Comp
L GND #PWR010
U 1 1 5C261307
P 1650 5850
F 0 "#PWR010" H 1650 5600 50  0001 C CNN
F 1 "GND" H 1650 5700 50  0000 C CNN
F 2 "" H 1650 5850 50  0001 C CNN
F 3 "" H 1650 5850 50  0001 C CNN
	1    1650 5850
	1    0    0    -1  
$EndComp
$Comp
L CP1 C1
U 1 1 5C2614DE
P 3050 5700
F 0 "C1" H 3075 5800 50  0000 L CNN
F 1 "4700uf" H 3075 5600 50  0000 L CNN
F 2 "Capacitors_THT:CP_Radial_D12.5mm_P5.00mm" H 3050 5700 50  0001 C CNN
F 3 "" H 3050 5700 50  0001 C CNN
	1    3050 5700
	1    0    0    -1  
$EndComp
$Comp
L CP1 C2
U 1 1 5C261554
P 3550 5700
F 0 "C2" H 3575 5800 50  0000 L CNN
F 1 "10uF" H 3575 5600 50  0000 L CNN
F 2 "Capacitors_SMD:C_0805" H 3550 5700 50  0001 C CNN
F 3 "" H 3550 5700 50  0001 C CNN
	1    3550 5700
	1    0    0    -1  
$EndComp
$Comp
L GND #PWR011
U 1 1 5C26182D
P 3550 5950
F 0 "#PWR011" H 3550 5700 50  0001 C CNN
F 1 "GND" H 3550 5800 50  0000 C CNN
F 2 "" H 3550 5950 50  0001 C CNN
F 3 "" H 3550 5950 50  0001 C CNN
	1    3550 5950
	1    0    0    -1  
$EndComp
$Comp
L GND #PWR012
U 1 1 5C261887
P 3050 5950
F 0 "#PWR012" H 3050 5700 50  0001 C CNN
F 1 "GND" H 3050 5800 50  0000 C CNN
F 2 "" H 3050 5950 50  0001 C CNN
F 3 "" H 3050 5950 50  0001 C CNN
	1    3050 5950
	1    0    0    -1  
$EndComp
$Comp
L R_Small R1
U 1 1 5C262690
P 1950 6350
F 0 "R1" V 2050 6300 50  0000 L CNN
F 1 "0R" V 1850 6300 50  0000 L CNN
F 2 "Resistors_SMD:R_0805" H 1950 6350 50  0001 C CNN
F 3 "" H 1950 6350 50  0001 C CNN
	1    1950 6350
	0    1    1    0   
$EndComp
$Comp
L Conn_01x02 J1
U 1 1 5C262BA1
P 1100 4950
F 0 "J1" H 1100 5050 50  0000 C CNN
F 1 "Conn_01x02" H 1100 4750 50  0000 C CNN
F 2 "Pin_Headers:Pin_Header_Straight_1x02_Pitch2.54mm" H 1100 4950 50  0001 C CNN
F 3 "" H 1100 4950 50  0001 C CNN
	1    1100 4950
	-1   0    0    1   
$EndComp
$Comp
L GND #PWR013
U 1 1 5C262DAD
P 1450 5000
F 0 "#PWR013" H 1450 4750 50  0001 C CNN
F 1 "GND" H 1450 4850 50  0000 C CNN
F 2 "" H 1450 5000 50  0001 C CNN
F 3 "" H 1450 5000 50  0001 C CNN
	1    1450 5000
	1    0    0    -1  
$EndComp
Text Label 5500 2900 0    60   ~ 0
Vcc
$Comp
L PWR_FLAG #FLG014
U 1 1 5C2699EE
P 2750 6650
F 0 "#FLG014" H 2750 6725 50  0001 C CNN
F 1 "PWR_FLAG" H 2750 6800 50  0000 C CNN
F 2 "" H 2750 6650 50  0001 C CNN
F 3 "" H 2750 6650 50  0001 C CNN
	1    2750 6650
	1    0    0    -1  
$EndComp
$Comp
L GND #PWR015
U 1 1 5C269E31
P 2750 6850
F 0 "#PWR015" H 2750 6600 50  0001 C CNN
F 1 "GND" H 2750 6700 50  0000 C CNN
F 2 "" H 2750 6850 50  0001 C CNN
F 3 "" H 2750 6850 50  0001 C CNN
	1    2750 6850
	1    0    0    -1  
$EndComp
Text Label 7850 1950 2    60   ~ 0
Vcc
Text Label 6700 3050 2    60   ~ 0
Vcc
Text Label 6550 950  2    60   ~ 0
Vcc
Text Label 5300 1000 2    60   ~ 0
Vcc
Text Label 3750 5450 0    60   ~ 0
Vcc
$Comp
L CP1 C4
U 1 1 5C26D0B1
P 9900 3250
F 0 "C4" H 9925 3350 50  0000 L CNN
F 1 "10uF" H 9925 3150 50  0000 L CNN
F 2 "Capacitors_SMD:C_0805" H 9900 3250 50  0001 C CNN
F 3 "" H 9900 3250 50  0001 C CNN
	1    9900 3250
	1    0    0    -1  
$EndComp
$Comp
L CP1 C3
U 1 1 5C26D1E3
P 8900 2500
F 0 "C3" H 8925 2600 50  0000 L CNN
F 1 "10uF" H 8925 2400 50  0000 L CNN
F 2 "Capacitors_SMD:C_0805" H 8900 2500 50  0001 C CNN
F 3 "" H 8900 2500 50  0001 C CNN
	1    8900 2500
	1    0    0    -1  
$EndComp
$Comp
L GND #PWR016
U 1 1 5C26D5BD
P 8900 2700
F 0 "#PWR016" H 8900 2450 50  0001 C CNN
F 1 "GND" H 8900 2550 50  0000 C CNN
F 2 "" H 8900 2700 50  0001 C CNN
F 3 "" H 8900 2700 50  0001 C CNN
	1    8900 2700
	1    0    0    -1  
$EndComp
$Comp
L GND #PWR017
U 1 1 5C26D681
P 9900 3500
F 0 "#PWR017" H 9900 3250 50  0001 C CNN
F 1 "GND" H 9900 3350 50  0000 C CNN
F 2 "" H 9900 3500 50  0001 C CNN
F 3 "" H 9900 3500 50  0001 C CNN
	1    9900 3500
	1    0    0    -1  
$EndComp
Text Notes 1550 4450 0    60   ~ 0
Power Input ( PV Panel and USB)
Text Notes 7300 850  0    60   ~ 0
Charge Controller and Output
$Comp
L R R11
U 1 1 5C2740C6
P 10400 1000
F 0 "R11" V 10480 1000 50  0000 C CNN
F 1 "680K" V 10400 1000 50  0000 C CNN
F 2 "Resistors_SMD:R_0805" V 10330 1000 50  0001 C CNN
F 3 "" H 10400 1000 50  0001 C CNN
	1    10400 1000
	1    0    0    -1  
$EndComp
$Comp
L R R12
U 1 1 5C2742A8
P 10400 1500
F 0 "R12" V 10480 1500 50  0000 C CNN
F 1 "680K" V 10400 1500 50  0000 C CNN
F 2 "Resistors_SMD:R_0805" V 10330 1500 50  0001 C CNN
F 3 "" H 10400 1500 50  0001 C CNN
	1    10400 1500
	1    0    0    -1  
$EndComp
$Comp
L GND #PWR018
U 1 1 5C274ED2
P 10400 1750
F 0 "#PWR018" H 10400 1500 50  0001 C CNN
F 1 "GND" H 10400 1600 50  0000 C CNN
F 2 "" H 10400 1750 50  0001 C CNN
F 3 "" H 10400 1750 50  0001 C CNN
	1    10400 1750
	1    0    0    -1  
$EndComp
Text Label 9400 2950 0    60   ~ 0
Vbat
Text Label 10400 750  0    60   ~ 0
Vbat
$Comp
L C C5
U 1 1 5C275969
P 10000 1500
F 0 "C5" H 10025 1600 50  0000 L CNN
F 1 "0.1uF" H 10025 1400 50  0000 L CNN
F 2 "Capacitors_SMD:C_0805" H 10038 1350 50  0001 C CNN
F 3 "" H 10000 1500 50  0001 C CNN
	1    10000 1500
	1    0    0    -1  
$EndComp
$Comp
L GND #PWR019
U 1 1 5C275A50
P 10000 1750
F 0 "#PWR019" H 10000 1500 50  0001 C CNN
F 1 "GND" H 10000 1600 50  0000 C CNN
F 2 "" H 10000 1750 50  0001 C CNN
F 3 "" H 10000 1750 50  0001 C CNN
	1    10000 1750
	1    0    0    -1  
$EndComp
Text Notes 10000 600  0    60   ~ 0
Battery Voltage Readout
$Comp
L R R13
U 1 1 5C279079
P 9200 3550
F 0 "R13" V 9280 3550 50  0000 C CNN
F 1 "10K" V 9200 3550 50  0000 C CNN
F 2 "Resistors_SMD:R_0805" V 9130 3550 50  0001 C CNN
F 3 "" H 9200 3550 50  0001 C CNN
	1    9200 3550
	1    0    0    -1  
$EndComp
$Comp
L Conn_01x01 J10
U 1 1 5C27917E
P 8850 3650
F 0 "J10" H 8850 3750 50  0000 C CNN
F 1 "NTC" H 8850 3500 50  0000 C CNN
F 2 "Pin_Headers:Pin_Header_Straight_1x01_Pitch2.54mm" H 8850 3650 50  0001 C CNN
F 3 "" H 8850 3650 50  0001 C CNN
	1    8850 3650
	0    1    1    0   
$EndComp
$Comp
L Conn_01x01 J11
U 1 1 5C27930D
P 8850 3850
F 0 "J11" H 8850 3750 50  0000 C CNN
F 1 "NTC_GND" H 8700 4000 50  0000 C CNN
F 2 "Pin_Headers:Pin_Header_Straight_1x01_Pitch2.54mm" H 8850 3850 50  0001 C CNN
F 3 "" H 8850 3850 50  0001 C CNN
	1    8850 3850
	0    -1   -1   0   
$EndComp
$Comp
L GND #PWR020
U 1 1 5C2796CC
P 8850 4100
F 0 "#PWR020" H 8850 3850 50  0001 C CNN
F 1 "GND" H 8850 3950 50  0000 C CNN
F 2 "" H 8850 4100 50  0001 C CNN
F 3 "" H 8850 4100 50  0001 C CNN
	1    8850 4100
	1    0    0    -1  
$EndComp
$Comp
L Conn_01x02 J9
U 1 1 5C279C9C
P 10950 1250
F 0 "J9" H 10950 1350 50  0000 C CNN
F 1 "Bat_V_Out" H 10950 1050 50  0000 C CNN
F 2 "Pin_Headers:Pin_Header_Straight_1x02_Pitch2.54mm" H 10950 1250 50  0001 C CNN
F 3 "" H 10950 1250 50  0001 C CNN
	1    10950 1250
	1    0    0    -1  
$EndComp
$Comp
L GND #PWR021
U 1 1 5C279F00
P 10700 1550
F 0 "#PWR021" H 10700 1300 50  0001 C CNN
F 1 "GND" H 10700 1400 50  0000 C CNN
F 2 "" H 10700 1550 50  0001 C CNN
F 3 "" H 10700 1550 50  0001 C CNN
	1    10700 1550
	1    0    0    -1  
$EndComp
$Comp
L Conn_01x01 J12
U 1 1 5C29C563
P 6500 3750
F 0 "J12" H 6500 3850 50  0000 C CNN
F 1 "PROG" H 6500 3650 50  0000 C CNN
F 2 "Pin_Headers:Pin_Header_Straight_1x01_Pitch2.54mm" H 6500 3750 50  0001 C CNN
F 3 "" H 6500 3750 50  0001 C CNN
	1    6500 3750
	0    1    1    0   
$EndComp
$Comp
L Conn_01x01 J13
U 1 1 5C29CC5F
P 6500 4100
F 0 "J13" H 6500 4200 50  0000 C CNN
F 1 "PROG_" H 6500 4000 50  0000 C CNN
F 2 "Pin_Headers:Pin_Header_Straight_1x01_Pitch2.54mm" H 6500 4100 50  0001 C CNN
F 3 "" H 6500 4100 50  0001 C CNN
	1    6500 4100
	-1   0    0    1   
$EndComp
$Comp
L GND #PWR022
U 1 1 5C29CD7F
P 6800 4150
F 0 "#PWR022" H 6800 3900 50  0001 C CNN
F 1 "GND" H 6800 4000 50  0000 C CNN
F 2 "" H 6800 4150 50  0001 C CNN
F 3 "" H 6800 4150 50  0001 C CNN
	1    6800 4150
	1    0    0    -1  
$EndComp
NoConn ~ 1250 6950
$Comp
L Jumper JP1
U 1 1 5C2B5445
P 5300 1300
F 0 "JP1" H 5300 1450 50  0000 C CNN
F 1 "Jumper" H 5300 1220 50  0000 C CNN
F 2 "Pin_Headers:Pin_Header_Straight_1x02_Pitch2.54mm" H 5300 1300 50  0001 C CNN
F 3 "" H 5300 1300 50  0001 C CNN
	1    5300 1300
	0    1    1    0   
$EndComp
Text Label 6200 1600 2    60   ~ 0
Vcc
$Comp
L Jumper JP2
U 1 1 5C2B5CBD
P 6700 2350
F 0 "JP2" H 6700 2500 50  0000 C CNN
F 1 "Jumper" H 6700 2270 50  0000 C CNN
F 2 "Pin_Headers:Pin_Header_Straight_1x02_Pitch2.54mm" H 6700 2350 50  0001 C CNN
F 3 "" H 6700 2350 50  0001 C CNN
	1    6700 2350
	1    0    0    -1  
$EndComp
Wire Wire Line
	7900 1950 7700 1950
Wire Wire Line
	8550 2400 8550 2250
Wire Wire Line
	8550 2650 8550 2950
Connection ~ 8550 2800
Connection ~ 7800 3750
Wire Wire Line
	8550 2250 9450 2250
Wire Wire Line
	9450 1800 9200 1800
Wire Wire Line
	9200 1800 9200 2250
Connection ~ 9200 2250
Wire Wire Line
	9450 2350 9400 2350
Wire Wire Line
	9400 2350 9400 2400
Wire Wire Line
	9450 1900 9400 1900
Wire Wire Line
	9400 1900 9400 1950
Wire Wire Line
	8550 2950 10550 2950
Wire Wire Line
	10550 3050 10500 3050
Wire Wire Line
	10500 3050 10500 3100
Wire Wire Line
	10300 2950 10300 3500
Wire Wire Line
	10300 3500 10550 3500
Connection ~ 10300 2950
Wire Wire Line
	10550 3600 10500 3600
Wire Wire Line
	10500 3600 10500 3650
Wire Wire Line
	7800 3750 7800 3850
Wire Wire Line
	8550 3250 8650 3250
Wire Wire Line
	8950 3250 9600 3250
Wire Wire Line
	9200 3250 9200 3400
Wire Wire Line
	9600 3250 9600 3400
Connection ~ 9200 3250
Wire Wire Line
	9200 3700 9200 3800
Wire Wire Line
	9200 3800 9600 3800
Wire Wire Line
	9600 3800 9600 3700
Wire Wire Line
	9400 3800 9400 3900
Connection ~ 9400 3800
Wire Wire Line
	7000 2850 7000 3150
Connection ~ 7000 3050
Connection ~ 7000 2950
Wire Wire Line
	6700 3050 7000 3050
Wire Wire Line
	6050 3350 7000 3350
Wire Wire Line
	6050 3350 6050 3500
Wire Wire Line
	6500 3450 7000 3450
Wire Wire Line
	6850 3450 6850 3500
Wire Wire Line
	6850 3800 6850 3850
Wire Wire Line
	6050 3800 6050 3850
Wire Wire Line
	6550 1300 6550 1400
Wire Wire Line
	6550 1700 6550 1750
Wire Wire Line
	6550 1000 6550 950 
Wire Wire Line
	6550 1350 7000 1350
Wire Wire Line
	7000 1350 7000 2250
Connection ~ 6550 1350
Wire Wire Line
	6200 2400 6200 2450
Wire Wire Line
	5750 2400 5750 3050
Wire Wire Line
	5750 2550 7000 2550
Wire Wire Line
	5300 2650 7000 2650
Wire Wire Line
	5300 2400 5300 2850
Wire Wire Line
	6200 2200 6200 2050
Wire Wire Line
	5750 2200 5750 2050
Wire Wire Line
	5300 2200 5300 2050
Wire Wire Line
	5300 1750 5300 1600
Wire Wire Line
	6200 1600 6200 1750
Connection ~ 5750 1600
Wire Wire Line
	5300 2850 5100 2850
Connection ~ 5300 2650
Wire Wire Line
	5750 3050 5100 3050
Connection ~ 5750 2550
Wire Wire Line
	5100 2950 5500 2950
Wire Wire Line
	5500 2950 5500 2900
Wire Wire Line
	1450 5650 1450 5950
Wire Wire Line
	1450 5950 800  5950
Wire Wire Line
	800  5950 800  7150
Wire Wire Line
	1450 5450 1950 5450
Wire Wire Line
	1450 5550 1650 5550
Wire Wire Line
	1650 5550 1650 5850
Wire Wire Line
	3550 5850 3550 5950
Wire Wire Line
	3050 5850 3050 5950
Connection ~ 3550 5450
Wire Wire Line
	1550 6350 1850 6350
Wire Wire Line
	2500 6350 2050 6350
Wire Wire Line
	1300 4950 1450 4950
Wire Wire Line
	1450 4950 1450 5000
Wire Wire Line
	3550 5450 3550 5550
Wire Wire Line
	5750 1600 5750 1750
Wire Wire Line
	7650 3750 7950 3750
Wire Wire Line
	2750 6650 2750 6850
Wire Wire Line
	9900 2950 9900 3100
Connection ~ 9900 2950
Wire Wire Line
	8900 2250 8900 2350
Connection ~ 8900 2250
Wire Wire Line
	9900 3400 9900 3500
Wire Wire Line
	8900 2650 8900 2700
Wire Notes Line
	500  4200 4150 4200
Wire Notes Line
	4150 500  4150 7700
Wire Notes Line
	11200 4350 4150 4350
Wire Wire Line
	10400 1150 10400 1350
Wire Wire Line
	10000 1250 10750 1250
Connection ~ 10400 1250
Wire Wire Line
	10400 1650 10400 1750
Wire Wire Line
	10400 850  10400 750 
Wire Wire Line
	10000 1250 10000 1350
Wire Wire Line
	10000 1650 10000 1750
Wire Notes Line
	11200 2000 9800 2000
Wire Notes Line
	9800 2000 9800 450 
Wire Wire Line
	2250 5450 3750 5450
Wire Wire Line
	1300 4850 2500 4850
Wire Wire Line
	2500 4850 2500 6350
Connection ~ 2500 5450
Wire Wire Line
	3050 5550 3050 5450
Connection ~ 3050 5450
Connection ~ 9050 3250
Wire Wire Line
	8850 4050 8850 4100
Wire Wire Line
	8850 3450 9050 3450
Wire Wire Line
	9050 3450 9050 3250
Wire Wire Line
	10750 1350 10700 1350
Wire Wire Line
	10700 1350 10700 1550
Wire Wire Line
	6500 3450 6500 3550
Connection ~ 6850 3450
Wire Wire Line
	6800 4150 6800 4100
Wire Wire Line
	6800 4100 6700 4100
Wire Wire Line
	800  7150 1150 7150
Wire Wire Line
	1150 7150 1150 6950
Wire Wire Line
	5300 1600 5750 1600
Wire Wire Line
	7000 2350 7000 2450
Wire Wire Line
	6400 2350 6400 2450
Wire Wire Line
	6400 2450 6200 2450
Wire Wire Line
	1450 5800 1650 5800
Connection ~ 1650 5800
Connection ~ 1450 5800
Text Notes 4350 3850 0    60   ~ 0
Charge Current = 1000/ R8\n2K  = 500 mA\n1K = 1000 mA
$EndSCHEMATC
