G04 #@! TF.FileFunction,Drawing*
%FSLAX46Y46*%
G04 Gerber Fmt 4.6, Leading zero omitted, Abs format (unit mm)*
G04 Created by KiCad (PCBNEW 4.0.7-e2-6376~61~ubuntu18.04.1) date Tue Feb 26 13:08:01 2019*
%MOMM*%
%LPD*%
G01*
G04 APERTURE LIST*
%ADD10C,0.100000*%
%ADD11C,0.080000*%
G04 APERTURE END LIST*
D10*
D11*
X129416190Y-104984285D02*
X128916190Y-104984285D01*
X128916190Y-104793809D01*
X128940000Y-104746190D01*
X128963810Y-104722381D01*
X129011429Y-104698571D01*
X129082857Y-104698571D01*
X129130476Y-104722381D01*
X129154286Y-104746190D01*
X129178095Y-104793809D01*
X129178095Y-104984285D01*
X129368571Y-104198571D02*
X129392381Y-104222381D01*
X129416190Y-104293809D01*
X129416190Y-104341428D01*
X129392381Y-104412857D01*
X129344762Y-104460476D01*
X129297143Y-104484285D01*
X129201905Y-104508095D01*
X129130476Y-104508095D01*
X129035238Y-104484285D01*
X128987619Y-104460476D01*
X128940000Y-104412857D01*
X128916190Y-104341428D01*
X128916190Y-104293809D01*
X128940000Y-104222381D01*
X128963810Y-104198571D01*
X129154286Y-103817619D02*
X129178095Y-103746190D01*
X129201905Y-103722381D01*
X129249524Y-103698571D01*
X129320952Y-103698571D01*
X129368571Y-103722381D01*
X129392381Y-103746190D01*
X129416190Y-103793809D01*
X129416190Y-103984285D01*
X128916190Y-103984285D01*
X128916190Y-103817619D01*
X128940000Y-103770000D01*
X128963810Y-103746190D01*
X129011429Y-103722381D01*
X129059048Y-103722381D01*
X129106667Y-103746190D01*
X129130476Y-103770000D01*
X129154286Y-103817619D01*
X129154286Y-103984285D01*
X129154286Y-103103333D02*
X129154286Y-102936667D01*
X129416190Y-102865238D02*
X129416190Y-103103333D01*
X128916190Y-103103333D01*
X128916190Y-102865238D01*
X129416190Y-102436667D02*
X128916190Y-102436667D01*
X129392381Y-102436667D02*
X129416190Y-102484286D01*
X129416190Y-102579524D01*
X129392381Y-102627143D01*
X129368571Y-102650952D01*
X129320952Y-102674762D01*
X129178095Y-102674762D01*
X129130476Y-102650952D01*
X129106667Y-102627143D01*
X129082857Y-102579524D01*
X129082857Y-102484286D01*
X129106667Y-102436667D01*
X129082857Y-101984286D02*
X129487619Y-101984286D01*
X129535238Y-102008095D01*
X129559048Y-102031905D01*
X129582857Y-102079524D01*
X129582857Y-102150952D01*
X129559048Y-102198571D01*
X129392381Y-101984286D02*
X129416190Y-102031905D01*
X129416190Y-102127143D01*
X129392381Y-102174762D01*
X129368571Y-102198571D01*
X129320952Y-102222381D01*
X129178095Y-102222381D01*
X129130476Y-102198571D01*
X129106667Y-102174762D01*
X129082857Y-102127143D01*
X129082857Y-102031905D01*
X129106667Y-101984286D01*
X129392381Y-101555714D02*
X129416190Y-101603333D01*
X129416190Y-101698571D01*
X129392381Y-101746190D01*
X129344762Y-101770000D01*
X129154286Y-101770000D01*
X129106667Y-101746190D01*
X129082857Y-101698571D01*
X129082857Y-101603333D01*
X129106667Y-101555714D01*
X129154286Y-101531905D01*
X129201905Y-101531905D01*
X129249524Y-101770000D01*
M02*
