G04 #@! TF.FileFunction,Legend,Top*
%FSLAX46Y46*%
G04 Gerber Fmt 4.6, Leading zero omitted, Abs format (unit mm)*
G04 Created by KiCad (PCBNEW 4.0.7-e2-6376~61~ubuntu18.04.1) date Tue Feb 26 13:08:01 2019*
%MOMM*%
%LPD*%
G01*
G04 APERTURE LIST*
%ADD10C,0.100000*%
%ADD11C,0.200000*%
%ADD12C,0.150000*%
%ADD13C,0.120000*%
G04 APERTURE END LIST*
D10*
D11*
X156510000Y-101930000D02*
X156510000Y-100630000D01*
X156510000Y-99430000D02*
X156510000Y-101930000D01*
X156510000Y-100530000D02*
X156510000Y-99430000D01*
X156210000Y-100530000D02*
X156510000Y-100530000D01*
X156560000Y-92780000D02*
X156560000Y-91380000D01*
X156160000Y-98480000D02*
X156160000Y-100530000D01*
X156560000Y-93980000D02*
X156560000Y-92780000D01*
X156160000Y-92730000D02*
X156560000Y-92730000D01*
X156160000Y-95230000D02*
X156160000Y-92730000D01*
X157380000Y-107280000D02*
X157870000Y-107280000D01*
X157510000Y-107280000D02*
X157380000Y-107280000D01*
X157630000Y-107250000D02*
X157680000Y-107250000D01*
X157630000Y-106870000D02*
X157630000Y-107250000D01*
X156660000Y-106870000D02*
X157630000Y-106870000D01*
D12*
X148410000Y-111866667D02*
X148410000Y-111166667D01*
X148576666Y-111166667D01*
X148676666Y-111200000D01*
X148743333Y-111266667D01*
X148776666Y-111333333D01*
X148810000Y-111466667D01*
X148810000Y-111566667D01*
X148776666Y-111700000D01*
X148743333Y-111766667D01*
X148676666Y-111833333D01*
X148576666Y-111866667D01*
X148410000Y-111866667D01*
X149043333Y-111166667D02*
X149476666Y-111166667D01*
X149243333Y-111433333D01*
X149343333Y-111433333D01*
X149410000Y-111466667D01*
X149443333Y-111500000D01*
X149476666Y-111566667D01*
X149476666Y-111733333D01*
X149443333Y-111800000D01*
X149410000Y-111833333D01*
X149343333Y-111866667D01*
X149143333Y-111866667D01*
X149076666Y-111833333D01*
X149043333Y-111800000D01*
X149776667Y-111600000D02*
X150310000Y-111600000D01*
X153740000Y-111876667D02*
X153740000Y-111176667D01*
X153906666Y-111176667D01*
X154006666Y-111210000D01*
X154073333Y-111276667D01*
X154106666Y-111343333D01*
X154140000Y-111476667D01*
X154140000Y-111576667D01*
X154106666Y-111710000D01*
X154073333Y-111776667D01*
X154006666Y-111843333D01*
X153906666Y-111876667D01*
X153740000Y-111876667D01*
X154406666Y-111243333D02*
X154440000Y-111210000D01*
X154506666Y-111176667D01*
X154673333Y-111176667D01*
X154740000Y-111210000D01*
X154773333Y-111243333D01*
X154806666Y-111310000D01*
X154806666Y-111376667D01*
X154773333Y-111476667D01*
X154373333Y-111876667D01*
X154806666Y-111876667D01*
X155106667Y-111610000D02*
X155640000Y-111610000D01*
X150946667Y-111176667D02*
X151180000Y-111876667D01*
X151413333Y-111176667D01*
X152046667Y-111810000D02*
X152013333Y-111843333D01*
X151913333Y-111876667D01*
X151846667Y-111876667D01*
X151746667Y-111843333D01*
X151680000Y-111776667D01*
X151646667Y-111710000D01*
X151613333Y-111576667D01*
X151613333Y-111476667D01*
X151646667Y-111343333D01*
X151680000Y-111276667D01*
X151746667Y-111210000D01*
X151846667Y-111176667D01*
X151913333Y-111176667D01*
X152013333Y-111210000D01*
X152046667Y-111243333D01*
X152746667Y-111810000D02*
X152713333Y-111843333D01*
X152613333Y-111876667D01*
X152546667Y-111876667D01*
X152446667Y-111843333D01*
X152380000Y-111776667D01*
X152346667Y-111710000D01*
X152313333Y-111576667D01*
X152313333Y-111476667D01*
X152346667Y-111343333D01*
X152380000Y-111276667D01*
X152446667Y-111210000D01*
X152546667Y-111176667D01*
X152613333Y-111176667D01*
X152713333Y-111210000D01*
X152746667Y-111243333D01*
X156626667Y-98393333D02*
X155926667Y-98393333D01*
X155926667Y-98126667D01*
X155960000Y-98060000D01*
X155993333Y-98026667D01*
X156060000Y-97993333D01*
X156160000Y-97993333D01*
X156226667Y-98026667D01*
X156260000Y-98060000D01*
X156293333Y-98126667D01*
X156293333Y-98393333D01*
X156626667Y-97293333D02*
X156293333Y-97526667D01*
X156626667Y-97693333D02*
X155926667Y-97693333D01*
X155926667Y-97426667D01*
X155960000Y-97360000D01*
X155993333Y-97326667D01*
X156060000Y-97293333D01*
X156160000Y-97293333D01*
X156226667Y-97326667D01*
X156260000Y-97360000D01*
X156293333Y-97426667D01*
X156293333Y-97693333D01*
X155926667Y-96860000D02*
X155926667Y-96726667D01*
X155960000Y-96660000D01*
X156026667Y-96593333D01*
X156160000Y-96560000D01*
X156393333Y-96560000D01*
X156526667Y-96593333D01*
X156593333Y-96660000D01*
X156626667Y-96726667D01*
X156626667Y-96860000D01*
X156593333Y-96926667D01*
X156526667Y-96993333D01*
X156393333Y-97026667D01*
X156160000Y-97026667D01*
X156026667Y-96993333D01*
X155960000Y-96926667D01*
X155926667Y-96860000D01*
X155960000Y-95893334D02*
X155926667Y-95960000D01*
X155926667Y-96060000D01*
X155960000Y-96160000D01*
X156026667Y-96226667D01*
X156093333Y-96260000D01*
X156226667Y-96293334D01*
X156326667Y-96293334D01*
X156460000Y-96260000D01*
X156526667Y-96226667D01*
X156593333Y-96160000D01*
X156626667Y-96060000D01*
X156626667Y-95993334D01*
X156593333Y-95893334D01*
X156560000Y-95860000D01*
X156326667Y-95860000D01*
X156326667Y-95993334D01*
X156626667Y-95193334D02*
X156626667Y-95593334D01*
X156626667Y-95393334D02*
X155926667Y-95393334D01*
X156026667Y-95460000D01*
X156093333Y-95526667D01*
X156126667Y-95593334D01*
D11*
X138742381Y-111632857D02*
X137742381Y-111632857D01*
X138742381Y-111156667D02*
X137742381Y-111156667D01*
X138742381Y-110585238D01*
X137742381Y-110585238D01*
X138361429Y-110109048D02*
X138361429Y-109347143D01*
X138692381Y-115142857D02*
X137692381Y-115142857D01*
X138692381Y-114666667D02*
X137692381Y-114666667D01*
X138692381Y-114095238D01*
X137692381Y-114095238D01*
X138311429Y-113619048D02*
X138311429Y-112857143D01*
X138692381Y-113238095D02*
X137930476Y-113238095D01*
X141460000Y-111620000D02*
X141460000Y-111630000D01*
X141170000Y-111330000D02*
X141460000Y-111620000D01*
X141470000Y-111630000D02*
X141170000Y-111330000D01*
X141790000Y-111310000D02*
X141470000Y-111630000D01*
X141460000Y-111640000D02*
X141790000Y-111310000D01*
X141460000Y-110750000D02*
X141460000Y-111640000D01*
D12*
X167783333Y-99930000D02*
X167849999Y-99963333D01*
X167949999Y-99963333D01*
X168049999Y-99930000D01*
X168116666Y-99863333D01*
X168149999Y-99796667D01*
X168183333Y-99663333D01*
X168183333Y-99563333D01*
X168149999Y-99430000D01*
X168116666Y-99363333D01*
X168049999Y-99296667D01*
X167949999Y-99263333D01*
X167883333Y-99263333D01*
X167783333Y-99296667D01*
X167749999Y-99330000D01*
X167749999Y-99563333D01*
X167883333Y-99563333D01*
X167449999Y-99263333D02*
X167449999Y-99963333D01*
X167049999Y-99263333D01*
X167049999Y-99963333D01*
X166716666Y-99263333D02*
X166716666Y-99963333D01*
X166550000Y-99963333D01*
X166450000Y-99930000D01*
X166383333Y-99863333D01*
X166350000Y-99796667D01*
X166316666Y-99663333D01*
X166316666Y-99563333D01*
X166350000Y-99430000D01*
X166383333Y-99363333D01*
X166450000Y-99296667D01*
X166550000Y-99263333D01*
X166716666Y-99263333D01*
X166590001Y-91566667D02*
X166723334Y-91566667D01*
X166790001Y-91600000D01*
X166856668Y-91666667D01*
X166890001Y-91800000D01*
X166890001Y-92033333D01*
X166856668Y-92166667D01*
X166790001Y-92233333D01*
X166723334Y-92266667D01*
X166590001Y-92266667D01*
X166523334Y-92233333D01*
X166456668Y-92166667D01*
X166423334Y-92033333D01*
X166423334Y-91800000D01*
X166456668Y-91666667D01*
X166523334Y-91600000D01*
X166590001Y-91566667D01*
X167190001Y-91566667D02*
X167190001Y-92133333D01*
X167223334Y-92200000D01*
X167256667Y-92233333D01*
X167323334Y-92266667D01*
X167456667Y-92266667D01*
X167523334Y-92233333D01*
X167556667Y-92200000D01*
X167590001Y-92133333D01*
X167590001Y-91566667D01*
X167823334Y-91566667D02*
X168223334Y-91566667D01*
X168023334Y-92266667D02*
X168023334Y-91566667D01*
X165126667Y-97746667D02*
X165126667Y-97413333D01*
X165326667Y-97813333D02*
X164626667Y-97580000D01*
X165326667Y-97346667D01*
X165326667Y-97113333D02*
X164626667Y-97113333D01*
X164626667Y-96946667D01*
X164660000Y-96846667D01*
X164726667Y-96780000D01*
X164793333Y-96746667D01*
X164926667Y-96713333D01*
X165026667Y-96713333D01*
X165160000Y-96746667D01*
X165226667Y-96780000D01*
X165293333Y-96846667D01*
X165326667Y-96946667D01*
X165326667Y-97113333D01*
X165260000Y-96013333D02*
X165293333Y-96046667D01*
X165326667Y-96146667D01*
X165326667Y-96213333D01*
X165293333Y-96313333D01*
X165226667Y-96380000D01*
X165160000Y-96413333D01*
X165026667Y-96446667D01*
X164926667Y-96446667D01*
X164793333Y-96413333D01*
X164726667Y-96380000D01*
X164660000Y-96313333D01*
X164626667Y-96213333D01*
X164626667Y-96146667D01*
X164660000Y-96046667D01*
X164693333Y-96013333D01*
X165593333Y-95513333D02*
X165560000Y-95546667D01*
X165460000Y-95613333D01*
X165393333Y-95646667D01*
X165293333Y-95680000D01*
X165126667Y-95713333D01*
X164993333Y-95713333D01*
X164826667Y-95680000D01*
X164726667Y-95646667D01*
X164660000Y-95613333D01*
X164560000Y-95546667D01*
X164526667Y-95513333D01*
X164626667Y-95113333D02*
X164626667Y-95046666D01*
X164660000Y-94980000D01*
X164693333Y-94946666D01*
X164760000Y-94913333D01*
X164893333Y-94880000D01*
X165060000Y-94880000D01*
X165193333Y-94913333D01*
X165260000Y-94946666D01*
X165293333Y-94980000D01*
X165326667Y-95046666D01*
X165326667Y-95113333D01*
X165293333Y-95180000D01*
X165260000Y-95213333D01*
X165193333Y-95246666D01*
X165060000Y-95280000D01*
X164893333Y-95280000D01*
X164760000Y-95246666D01*
X164693333Y-95213333D01*
X164660000Y-95180000D01*
X164626667Y-95113333D01*
X165260000Y-94579999D02*
X165293333Y-94546666D01*
X165326667Y-94579999D01*
X165293333Y-94613333D01*
X165260000Y-94579999D01*
X165326667Y-94579999D01*
X164626667Y-93913333D02*
X164626667Y-94246666D01*
X164960000Y-94280000D01*
X164926667Y-94246666D01*
X164893333Y-94180000D01*
X164893333Y-94013333D01*
X164926667Y-93946666D01*
X164960000Y-93913333D01*
X165026667Y-93880000D01*
X165193333Y-93880000D01*
X165260000Y-93913333D01*
X165293333Y-93946666D01*
X165326667Y-94013333D01*
X165326667Y-94180000D01*
X165293333Y-94246666D01*
X165260000Y-94280000D01*
X165326667Y-93646666D02*
X164860000Y-93279999D01*
X164860000Y-93646666D02*
X165326667Y-93279999D01*
X164960000Y-92779999D02*
X164993333Y-92679999D01*
X165026667Y-92646666D01*
X165093333Y-92613332D01*
X165193333Y-92613332D01*
X165260000Y-92646666D01*
X165293333Y-92679999D01*
X165326667Y-92746666D01*
X165326667Y-93013332D01*
X164626667Y-93013332D01*
X164626667Y-92779999D01*
X164660000Y-92713332D01*
X164693333Y-92679999D01*
X164760000Y-92646666D01*
X164826667Y-92646666D01*
X164893333Y-92679999D01*
X164926667Y-92713332D01*
X164960000Y-92779999D01*
X164960000Y-93013332D01*
X165126667Y-92346666D02*
X165126667Y-92013332D01*
X165326667Y-92413332D02*
X164626667Y-92179999D01*
X165326667Y-91946666D01*
X164626667Y-91813332D02*
X164626667Y-91413332D01*
X165326667Y-91613332D02*
X164626667Y-91613332D01*
X165593333Y-91246666D02*
X165560000Y-91213333D01*
X165460000Y-91146666D01*
X165393333Y-91113333D01*
X165293333Y-91079999D01*
X165126667Y-91046666D01*
X164993333Y-91046666D01*
X164826667Y-91079999D01*
X164726667Y-91113333D01*
X164660000Y-91146666D01*
X164560000Y-91213333D01*
X164526667Y-91246666D01*
X151441429Y-107297857D02*
X151405715Y-107333571D01*
X151298572Y-107369286D01*
X151227143Y-107369286D01*
X151120000Y-107333571D01*
X151048572Y-107262143D01*
X151012857Y-107190714D01*
X150977143Y-107047857D01*
X150977143Y-106940714D01*
X151012857Y-106797857D01*
X151048572Y-106726429D01*
X151120000Y-106655000D01*
X151227143Y-106619286D01*
X151298572Y-106619286D01*
X151405715Y-106655000D01*
X151441429Y-106690714D01*
X151762857Y-107369286D02*
X151762857Y-106619286D01*
X151762857Y-106976429D02*
X152191429Y-106976429D01*
X152191429Y-107369286D02*
X152191429Y-106619286D01*
X152512857Y-107155000D02*
X152870000Y-107155000D01*
X152441429Y-107369286D02*
X152691429Y-106619286D01*
X152941429Y-107369286D01*
X153620000Y-107369286D02*
X153370000Y-107012143D01*
X153191428Y-107369286D02*
X153191428Y-106619286D01*
X153477143Y-106619286D01*
X153548571Y-106655000D01*
X153584286Y-106690714D01*
X153620000Y-106762143D01*
X153620000Y-106869286D01*
X153584286Y-106940714D01*
X153548571Y-106976429D01*
X153477143Y-107012143D01*
X153191428Y-107012143D01*
X154334286Y-106655000D02*
X154262857Y-106619286D01*
X154155714Y-106619286D01*
X154048571Y-106655000D01*
X153977143Y-106726429D01*
X153941428Y-106797857D01*
X153905714Y-106940714D01*
X153905714Y-107047857D01*
X153941428Y-107190714D01*
X153977143Y-107262143D01*
X154048571Y-107333571D01*
X154155714Y-107369286D01*
X154227143Y-107369286D01*
X154334286Y-107333571D01*
X154370000Y-107297857D01*
X154370000Y-107047857D01*
X154227143Y-107047857D01*
X154691428Y-107369286D02*
X154691428Y-106619286D01*
X155048571Y-107369286D02*
X155048571Y-106619286D01*
X155477143Y-107369286D01*
X155477143Y-106619286D01*
X156227143Y-106655000D02*
X156155714Y-106619286D01*
X156048571Y-106619286D01*
X155941428Y-106655000D01*
X155870000Y-106726429D01*
X155834285Y-106797857D01*
X155798571Y-106940714D01*
X155798571Y-107047857D01*
X155834285Y-107190714D01*
X155870000Y-107262143D01*
X155941428Y-107333571D01*
X156048571Y-107369286D01*
X156120000Y-107369286D01*
X156227143Y-107333571D01*
X156262857Y-107297857D01*
X156262857Y-107047857D01*
X156120000Y-107047857D01*
D11*
X145352381Y-111061905D02*
X144352381Y-111061905D01*
X144352381Y-110823810D01*
X144400000Y-110680952D01*
X144495238Y-110585714D01*
X144590476Y-110538095D01*
X144780952Y-110490476D01*
X144923810Y-110490476D01*
X145114286Y-110538095D01*
X145209524Y-110585714D01*
X145304762Y-110680952D01*
X145352381Y-110823810D01*
X145352381Y-111061905D01*
X144352381Y-109871429D02*
X144352381Y-109680952D01*
X144400000Y-109585714D01*
X144495238Y-109490476D01*
X144685714Y-109442857D01*
X145019048Y-109442857D01*
X145209524Y-109490476D01*
X145304762Y-109585714D01*
X145352381Y-109680952D01*
X145352381Y-109871429D01*
X145304762Y-109966667D01*
X145209524Y-110061905D01*
X145019048Y-110109524D01*
X144685714Y-110109524D01*
X144495238Y-110061905D01*
X144400000Y-109966667D01*
X144352381Y-109871429D01*
X145352381Y-109014286D02*
X144352381Y-109014286D01*
X145352381Y-108442857D01*
X144352381Y-108442857D01*
X144828571Y-107966667D02*
X144828571Y-107633333D01*
X145352381Y-107490476D02*
X145352381Y-107966667D01*
X144352381Y-107966667D01*
X144352381Y-107490476D01*
X140163333Y-110282381D02*
X140163333Y-109282381D01*
X140734762Y-110282381D01*
X140734762Y-109282381D01*
X141068095Y-109282381D02*
X141639524Y-109282381D01*
X141353809Y-110282381D02*
X141353809Y-109282381D01*
X142544286Y-110187143D02*
X142496667Y-110234762D01*
X142353810Y-110282381D01*
X142258572Y-110282381D01*
X142115714Y-110234762D01*
X142020476Y-110139524D01*
X141972857Y-110044286D01*
X141925238Y-109853810D01*
X141925238Y-109710952D01*
X141972857Y-109520476D01*
X142020476Y-109425238D01*
X142115714Y-109330000D01*
X142258572Y-109282381D01*
X142353810Y-109282381D01*
X142496667Y-109330000D01*
X142544286Y-109377619D01*
X162112382Y-111158571D02*
X162255239Y-111206190D01*
X162302858Y-111253810D01*
X162350477Y-111349048D01*
X162350477Y-111491905D01*
X162302858Y-111587143D01*
X162255239Y-111634762D01*
X162160001Y-111682381D01*
X161779048Y-111682381D01*
X161779048Y-110682381D01*
X162112382Y-110682381D01*
X162207620Y-110730000D01*
X162255239Y-110777619D01*
X162302858Y-110872857D01*
X162302858Y-110968095D01*
X162255239Y-111063333D01*
X162207620Y-111110952D01*
X162112382Y-111158571D01*
X161779048Y-111158571D01*
X162779048Y-111301429D02*
X163540953Y-111301429D01*
X159492382Y-111138571D02*
X159635239Y-111186190D01*
X159682858Y-111233810D01*
X159730477Y-111329048D01*
X159730477Y-111471905D01*
X159682858Y-111567143D01*
X159635239Y-111614762D01*
X159540001Y-111662381D01*
X159159048Y-111662381D01*
X159159048Y-110662381D01*
X159492382Y-110662381D01*
X159587620Y-110710000D01*
X159635239Y-110757619D01*
X159682858Y-110852857D01*
X159682858Y-110948095D01*
X159635239Y-111043333D01*
X159587620Y-111090952D01*
X159492382Y-111138571D01*
X159159048Y-111138571D01*
X160159048Y-111281429D02*
X160920953Y-111281429D01*
X160540001Y-111662381D02*
X160540001Y-110900476D01*
X158720477Y-80612381D02*
X158244286Y-80612381D01*
X158244286Y-79612381D01*
X159053810Y-80231429D02*
X159815715Y-80231429D01*
X161970477Y-80672381D02*
X161494286Y-80672381D01*
X161494286Y-79672381D01*
X162303810Y-80291429D02*
X163065715Y-80291429D01*
X162684763Y-80672381D02*
X162684763Y-79910476D01*
X165828095Y-102061429D02*
X165685238Y-102013810D01*
X165637619Y-101966190D01*
X165590000Y-101870952D01*
X165590000Y-101728095D01*
X165637619Y-101632857D01*
X165685238Y-101585238D01*
X165780476Y-101537619D01*
X166161429Y-101537619D01*
X166161429Y-102537619D01*
X165828095Y-102537619D01*
X165732857Y-102490000D01*
X165685238Y-102442381D01*
X165637619Y-102347143D01*
X165637619Y-102251905D01*
X165685238Y-102156667D01*
X165732857Y-102109048D01*
X165828095Y-102061429D01*
X166161429Y-102061429D01*
X165209048Y-101823333D02*
X164732857Y-101823333D01*
X165304286Y-101537619D02*
X164970953Y-102537619D01*
X164637619Y-101537619D01*
X164447143Y-102537619D02*
X163875714Y-102537619D01*
X164161429Y-101537619D02*
X164161429Y-102537619D01*
X163907143Y-89972381D02*
X163430952Y-89972381D01*
X163430952Y-88972381D01*
X164430952Y-88972381D02*
X164621429Y-88972381D01*
X164716667Y-89020000D01*
X164811905Y-89115238D01*
X164859524Y-89305714D01*
X164859524Y-89639048D01*
X164811905Y-89829524D01*
X164716667Y-89924762D01*
X164621429Y-89972381D01*
X164430952Y-89972381D01*
X164335714Y-89924762D01*
X164240476Y-89829524D01*
X164192857Y-89639048D01*
X164192857Y-89305714D01*
X164240476Y-89115238D01*
X164335714Y-89020000D01*
X164430952Y-88972381D01*
X165240476Y-89686667D02*
X165716667Y-89686667D01*
X165145238Y-89972381D02*
X165478571Y-88972381D01*
X165811905Y-89972381D01*
X166145238Y-89972381D02*
X166145238Y-88972381D01*
X166383333Y-88972381D01*
X166526191Y-89020000D01*
X166621429Y-89115238D01*
X166669048Y-89210476D01*
X166716667Y-89400952D01*
X166716667Y-89543810D01*
X166669048Y-89734286D01*
X166621429Y-89829524D01*
X166526191Y-89924762D01*
X166383333Y-89972381D01*
X166145238Y-89972381D01*
D13*
X134360000Y-89370000D02*
X125560000Y-89370000D01*
X125560000Y-89370000D02*
X125560000Y-80170000D01*
X140260000Y-86670000D02*
X140260000Y-89370000D01*
X140260000Y-89370000D02*
X138360000Y-89370000D01*
X125560000Y-80170000D02*
X140260000Y-80170000D01*
X140260000Y-80170000D02*
X140260000Y-82770000D01*
X155620000Y-82510000D02*
G75*
G03X155620000Y-82510000I-6340000J0D01*
G01*
X155580000Y-82510000D02*
X142980000Y-82510000D01*
X155580000Y-82550000D02*
X142980000Y-82550000D01*
X155580000Y-82590000D02*
X142980000Y-82590000D01*
X155579000Y-82630000D02*
X142981000Y-82630000D01*
X155578000Y-82670000D02*
X142982000Y-82670000D01*
X155577000Y-82710000D02*
X142983000Y-82710000D01*
X155576000Y-82750000D02*
X142984000Y-82750000D01*
X155574000Y-82790000D02*
X142986000Y-82790000D01*
X155572000Y-82830000D02*
X142988000Y-82830000D01*
X155570000Y-82870000D02*
X142990000Y-82870000D01*
X155568000Y-82910000D02*
X142992000Y-82910000D01*
X155565000Y-82950000D02*
X142995000Y-82950000D01*
X155562000Y-82990000D02*
X142998000Y-82990000D01*
X155559000Y-83030000D02*
X143001000Y-83030000D01*
X155556000Y-83070000D02*
X143004000Y-83070000D01*
X155552000Y-83110000D02*
X143008000Y-83110000D01*
X155548000Y-83150000D02*
X143012000Y-83150000D01*
X155544000Y-83190000D02*
X143016000Y-83190000D01*
X155539000Y-83231000D02*
X143021000Y-83231000D01*
X155535000Y-83271000D02*
X143025000Y-83271000D01*
X155530000Y-83311000D02*
X143030000Y-83311000D01*
X155525000Y-83351000D02*
X143035000Y-83351000D01*
X155519000Y-83391000D02*
X143041000Y-83391000D01*
X155513000Y-83431000D02*
X143047000Y-83431000D01*
X155507000Y-83471000D02*
X143053000Y-83471000D01*
X155501000Y-83511000D02*
X143059000Y-83511000D01*
X155495000Y-83551000D02*
X143065000Y-83551000D01*
X155488000Y-83591000D02*
X143072000Y-83591000D01*
X155481000Y-83631000D02*
X150660000Y-83631000D01*
X147900000Y-83631000D02*
X143079000Y-83631000D01*
X155473000Y-83671000D02*
X150660000Y-83671000D01*
X147900000Y-83671000D02*
X143087000Y-83671000D01*
X155466000Y-83711000D02*
X150660000Y-83711000D01*
X147900000Y-83711000D02*
X143094000Y-83711000D01*
X155458000Y-83751000D02*
X150660000Y-83751000D01*
X147900000Y-83751000D02*
X143102000Y-83751000D01*
X155450000Y-83791000D02*
X150660000Y-83791000D01*
X147900000Y-83791000D02*
X143110000Y-83791000D01*
X155442000Y-83831000D02*
X150660000Y-83831000D01*
X147900000Y-83831000D02*
X143118000Y-83831000D01*
X155433000Y-83871000D02*
X150660000Y-83871000D01*
X147900000Y-83871000D02*
X143127000Y-83871000D01*
X155424000Y-83911000D02*
X150660000Y-83911000D01*
X147900000Y-83911000D02*
X143136000Y-83911000D01*
X155415000Y-83951000D02*
X150660000Y-83951000D01*
X147900000Y-83951000D02*
X143145000Y-83951000D01*
X155405000Y-83991000D02*
X150660000Y-83991000D01*
X147900000Y-83991000D02*
X143155000Y-83991000D01*
X155396000Y-84031000D02*
X150660000Y-84031000D01*
X147900000Y-84031000D02*
X143164000Y-84031000D01*
X155386000Y-84071000D02*
X150660000Y-84071000D01*
X147900000Y-84071000D02*
X143174000Y-84071000D01*
X155375000Y-84111000D02*
X150660000Y-84111000D01*
X147900000Y-84111000D02*
X143185000Y-84111000D01*
X155365000Y-84151000D02*
X150660000Y-84151000D01*
X147900000Y-84151000D02*
X143195000Y-84151000D01*
X155354000Y-84191000D02*
X150660000Y-84191000D01*
X147900000Y-84191000D02*
X143206000Y-84191000D01*
X155343000Y-84231000D02*
X150660000Y-84231000D01*
X147900000Y-84231000D02*
X143217000Y-84231000D01*
X155331000Y-84271000D02*
X150660000Y-84271000D01*
X147900000Y-84271000D02*
X143229000Y-84271000D01*
X155320000Y-84311000D02*
X150660000Y-84311000D01*
X147900000Y-84311000D02*
X143240000Y-84311000D01*
X155308000Y-84351000D02*
X150660000Y-84351000D01*
X147900000Y-84351000D02*
X143252000Y-84351000D01*
X155295000Y-84391000D02*
X150660000Y-84391000D01*
X147900000Y-84391000D02*
X143265000Y-84391000D01*
X155283000Y-84431000D02*
X150660000Y-84431000D01*
X147900000Y-84431000D02*
X143277000Y-84431000D01*
X155270000Y-84471000D02*
X150660000Y-84471000D01*
X147900000Y-84471000D02*
X143290000Y-84471000D01*
X155257000Y-84511000D02*
X150660000Y-84511000D01*
X147900000Y-84511000D02*
X143303000Y-84511000D01*
X155243000Y-84551000D02*
X150660000Y-84551000D01*
X147900000Y-84551000D02*
X143317000Y-84551000D01*
X155230000Y-84591000D02*
X150660000Y-84591000D01*
X147900000Y-84591000D02*
X143330000Y-84591000D01*
X155216000Y-84631000D02*
X150660000Y-84631000D01*
X147900000Y-84631000D02*
X143344000Y-84631000D01*
X155201000Y-84671000D02*
X150660000Y-84671000D01*
X147900000Y-84671000D02*
X143359000Y-84671000D01*
X155187000Y-84711000D02*
X150660000Y-84711000D01*
X147900000Y-84711000D02*
X143373000Y-84711000D01*
X155172000Y-84751000D02*
X150660000Y-84751000D01*
X147900000Y-84751000D02*
X143388000Y-84751000D01*
X155156000Y-84791000D02*
X150660000Y-84791000D01*
X147900000Y-84791000D02*
X143404000Y-84791000D01*
X155141000Y-84831000D02*
X150660000Y-84831000D01*
X147900000Y-84831000D02*
X143419000Y-84831000D01*
X155125000Y-84871000D02*
X150660000Y-84871000D01*
X147900000Y-84871000D02*
X143435000Y-84871000D01*
X155109000Y-84911000D02*
X150660000Y-84911000D01*
X147900000Y-84911000D02*
X143451000Y-84911000D01*
X155092000Y-84951000D02*
X150660000Y-84951000D01*
X147900000Y-84951000D02*
X143468000Y-84951000D01*
X155075000Y-84991000D02*
X150660000Y-84991000D01*
X147900000Y-84991000D02*
X143485000Y-84991000D01*
X155058000Y-85031000D02*
X150660000Y-85031000D01*
X147900000Y-85031000D02*
X143502000Y-85031000D01*
X155041000Y-85071000D02*
X150660000Y-85071000D01*
X147900000Y-85071000D02*
X143519000Y-85071000D01*
X155023000Y-85111000D02*
X150660000Y-85111000D01*
X147900000Y-85111000D02*
X143537000Y-85111000D01*
X155005000Y-85151000D02*
X150660000Y-85151000D01*
X147900000Y-85151000D02*
X143555000Y-85151000D01*
X154986000Y-85191000D02*
X150660000Y-85191000D01*
X147900000Y-85191000D02*
X143574000Y-85191000D01*
X154967000Y-85231000D02*
X150660000Y-85231000D01*
X147900000Y-85231000D02*
X143593000Y-85231000D01*
X154948000Y-85271000D02*
X150660000Y-85271000D01*
X147900000Y-85271000D02*
X143612000Y-85271000D01*
X154929000Y-85311000D02*
X150660000Y-85311000D01*
X147900000Y-85311000D02*
X143631000Y-85311000D01*
X154909000Y-85351000D02*
X150660000Y-85351000D01*
X147900000Y-85351000D02*
X143651000Y-85351000D01*
X154889000Y-85391000D02*
X150660000Y-85391000D01*
X147900000Y-85391000D02*
X143671000Y-85391000D01*
X154868000Y-85431000D02*
X150660000Y-85431000D01*
X147900000Y-85431000D02*
X143692000Y-85431000D01*
X154847000Y-85471000D02*
X150660000Y-85471000D01*
X147900000Y-85471000D02*
X143713000Y-85471000D01*
X154826000Y-85511000D02*
X150660000Y-85511000D01*
X147900000Y-85511000D02*
X143734000Y-85511000D01*
X154804000Y-85551000D02*
X150660000Y-85551000D01*
X147900000Y-85551000D02*
X143756000Y-85551000D01*
X154782000Y-85591000D02*
X150660000Y-85591000D01*
X147900000Y-85591000D02*
X143778000Y-85591000D01*
X154760000Y-85631000D02*
X150660000Y-85631000D01*
X147900000Y-85631000D02*
X143800000Y-85631000D01*
X154737000Y-85671000D02*
X150660000Y-85671000D01*
X147900000Y-85671000D02*
X143823000Y-85671000D01*
X154714000Y-85711000D02*
X150660000Y-85711000D01*
X147900000Y-85711000D02*
X143846000Y-85711000D01*
X154690000Y-85751000D02*
X150660000Y-85751000D01*
X147900000Y-85751000D02*
X143870000Y-85751000D01*
X154666000Y-85791000D02*
X150660000Y-85791000D01*
X147900000Y-85791000D02*
X143894000Y-85791000D01*
X154642000Y-85831000D02*
X150660000Y-85831000D01*
X147900000Y-85831000D02*
X143918000Y-85831000D01*
X154617000Y-85871000D02*
X150660000Y-85871000D01*
X147900000Y-85871000D02*
X143943000Y-85871000D01*
X154592000Y-85911000D02*
X150660000Y-85911000D01*
X147900000Y-85911000D02*
X143968000Y-85911000D01*
X154566000Y-85951000D02*
X150660000Y-85951000D01*
X147900000Y-85951000D02*
X143994000Y-85951000D01*
X154540000Y-85991000D02*
X150660000Y-85991000D01*
X147900000Y-85991000D02*
X144020000Y-85991000D01*
X154514000Y-86031000D02*
X150660000Y-86031000D01*
X147900000Y-86031000D02*
X144046000Y-86031000D01*
X154487000Y-86071000D02*
X150660000Y-86071000D01*
X147900000Y-86071000D02*
X144073000Y-86071000D01*
X154459000Y-86111000D02*
X150660000Y-86111000D01*
X147900000Y-86111000D02*
X144101000Y-86111000D01*
X154431000Y-86151000D02*
X150660000Y-86151000D01*
X147900000Y-86151000D02*
X144129000Y-86151000D01*
X154403000Y-86191000D02*
X150660000Y-86191000D01*
X147900000Y-86191000D02*
X144157000Y-86191000D01*
X154374000Y-86231000D02*
X150660000Y-86231000D01*
X147900000Y-86231000D02*
X144186000Y-86231000D01*
X154345000Y-86271000D02*
X150660000Y-86271000D01*
X147900000Y-86271000D02*
X144215000Y-86271000D01*
X154315000Y-86311000D02*
X150660000Y-86311000D01*
X147900000Y-86311000D02*
X144245000Y-86311000D01*
X154285000Y-86351000D02*
X150660000Y-86351000D01*
X147900000Y-86351000D02*
X144275000Y-86351000D01*
X154255000Y-86391000D02*
X144305000Y-86391000D01*
X154223000Y-86431000D02*
X144337000Y-86431000D01*
X154192000Y-86471000D02*
X144368000Y-86471000D01*
X154159000Y-86511000D02*
X144401000Y-86511000D01*
X154127000Y-86551000D02*
X144433000Y-86551000D01*
X154093000Y-86591000D02*
X144467000Y-86591000D01*
X154059000Y-86631000D02*
X144501000Y-86631000D01*
X154025000Y-86671000D02*
X144535000Y-86671000D01*
X153990000Y-86711000D02*
X144570000Y-86711000D01*
X153954000Y-86751000D02*
X144606000Y-86751000D01*
X153918000Y-86791000D02*
X144642000Y-86791000D01*
X153881000Y-86831000D02*
X144679000Y-86831000D01*
X153843000Y-86871000D02*
X144717000Y-86871000D01*
X153805000Y-86911000D02*
X144755000Y-86911000D01*
X153766000Y-86951000D02*
X144794000Y-86951000D01*
X153727000Y-86991000D02*
X144833000Y-86991000D01*
X153686000Y-87031000D02*
X144874000Y-87031000D01*
X153645000Y-87071000D02*
X144915000Y-87071000D01*
X153603000Y-87111000D02*
X144957000Y-87111000D01*
X153561000Y-87151000D02*
X144999000Y-87151000D01*
X153518000Y-87191000D02*
X145042000Y-87191000D01*
X153473000Y-87231000D02*
X145087000Y-87231000D01*
X153428000Y-87271000D02*
X145132000Y-87271000D01*
X153382000Y-87311000D02*
X145178000Y-87311000D01*
X153336000Y-87351000D02*
X145224000Y-87351000D01*
X153288000Y-87391000D02*
X145272000Y-87391000D01*
X153239000Y-87431000D02*
X145321000Y-87431000D01*
X153189000Y-87471000D02*
X145371000Y-87471000D01*
X153139000Y-87511000D02*
X145421000Y-87511000D01*
X153087000Y-87551000D02*
X145473000Y-87551000D01*
X153034000Y-87591000D02*
X145526000Y-87591000D01*
X152980000Y-87631000D02*
X145580000Y-87631000D01*
X152924000Y-87671000D02*
X145636000Y-87671000D01*
X152868000Y-87711000D02*
X145692000Y-87711000D01*
X152810000Y-87751000D02*
X145750000Y-87751000D01*
X152750000Y-87791000D02*
X145810000Y-87791000D01*
X152689000Y-87831000D02*
X145871000Y-87831000D01*
X152627000Y-87871000D02*
X145933000Y-87871000D01*
X152562000Y-87911000D02*
X145998000Y-87911000D01*
X152497000Y-87951000D02*
X146063000Y-87951000D01*
X152429000Y-87991000D02*
X146131000Y-87991000D01*
X152359000Y-88031000D02*
X146201000Y-88031000D01*
X152287000Y-88071000D02*
X146273000Y-88071000D01*
X152213000Y-88111000D02*
X146347000Y-88111000D01*
X152136000Y-88151000D02*
X146424000Y-88151000D01*
X152057000Y-88191000D02*
X146503000Y-88191000D01*
X151975000Y-88231000D02*
X146585000Y-88231000D01*
X151890000Y-88271000D02*
X146670000Y-88271000D01*
X151801000Y-88311000D02*
X146759000Y-88311000D01*
X151708000Y-88351000D02*
X146852000Y-88351000D01*
X151611000Y-88391000D02*
X146949000Y-88391000D01*
X151510000Y-88431000D02*
X147050000Y-88431000D01*
X151402000Y-88471000D02*
X147158000Y-88471000D01*
X151289000Y-88511000D02*
X147271000Y-88511000D01*
X151168000Y-88551000D02*
X147392000Y-88551000D01*
X151037000Y-88591000D02*
X147523000Y-88591000D01*
X150896000Y-88631000D02*
X147664000Y-88631000D01*
X150740000Y-88671000D02*
X147820000Y-88671000D01*
X150565000Y-88711000D02*
X147995000Y-88711000D01*
X150362000Y-88751000D02*
X148198000Y-88751000D01*
X150111000Y-88791000D02*
X148449000Y-88791000D01*
X149744000Y-88831000D02*
X148816000Y-88831000D01*
X149280000Y-76810000D02*
X149280000Y-78610000D01*
X150180000Y-77710000D02*
X148380000Y-77710000D01*
X157830000Y-82220000D02*
X157830000Y-83220000D01*
X159530000Y-83220000D02*
X159530000Y-82220000D01*
X157790000Y-87180000D02*
X157790000Y-88180000D01*
X159490000Y-88180000D02*
X159490000Y-87180000D01*
X157370000Y-104000000D02*
X157370000Y-105000000D01*
X159070000Y-105000000D02*
X159070000Y-104000000D01*
X163490000Y-93100000D02*
X163490000Y-92100000D01*
X161790000Y-92100000D02*
X161790000Y-93100000D01*
X140770000Y-78690000D02*
X140770000Y-76690000D01*
X140770000Y-76690000D02*
X136920000Y-76690000D01*
X140770000Y-78690000D02*
X136920000Y-78690000D01*
X158420000Y-107460000D02*
X157020000Y-107460000D01*
X157020000Y-107460000D02*
X157020000Y-110260000D01*
X158420000Y-107460000D02*
X158420000Y-110260000D01*
X147430000Y-107460000D02*
X146030000Y-107460000D01*
X146030000Y-107460000D02*
X146030000Y-110260000D01*
X147430000Y-107460000D02*
X147430000Y-110260000D01*
X130830000Y-97400000D02*
X132230000Y-97400000D01*
X132230000Y-97400000D02*
X132230000Y-94600000D01*
X130830000Y-97400000D02*
X130830000Y-94600000D01*
D12*
X151620000Y-94590000D02*
X151620000Y-95365000D01*
X147320000Y-98890000D02*
X147320000Y-98115000D01*
X151620000Y-98890000D02*
X151620000Y-98115000D01*
X147320000Y-94590000D02*
X148095000Y-94590000D01*
X147320000Y-98890000D02*
X148095000Y-98890000D01*
X151620000Y-98890000D02*
X150845000Y-98890000D01*
X151620000Y-94590000D02*
X150845000Y-94590000D01*
D13*
X134510000Y-115020000D02*
X137170000Y-115020000D01*
X134510000Y-112420000D02*
X134510000Y-115020000D01*
X137170000Y-112420000D02*
X137170000Y-115020000D01*
X134510000Y-112420000D02*
X137170000Y-112420000D01*
X134510000Y-111150000D02*
X134510000Y-109820000D01*
X134510000Y-109820000D02*
X135840000Y-109820000D01*
D12*
X133590000Y-99120000D02*
X132190000Y-99120000D01*
X129790000Y-99120000D02*
X129640000Y-99120000D01*
X129640000Y-99120000D02*
X129640000Y-99420000D01*
X129640000Y-99420000D02*
X129190000Y-99420000D01*
X129190000Y-107120000D02*
X129640000Y-107120000D01*
X129640000Y-107120000D02*
X129640000Y-107420000D01*
X129640000Y-107420000D02*
X129790000Y-107420000D01*
X132190000Y-107420000D02*
X133590000Y-107420000D01*
X135765000Y-102195000D02*
X135765000Y-101470000D01*
X135765000Y-101470000D02*
X135340000Y-101470000D01*
X135340000Y-101470000D02*
X135340000Y-100470000D01*
X135340000Y-105070000D02*
X135340000Y-106070000D01*
D13*
X155720000Y-115020000D02*
X155720000Y-112360000D01*
X150580000Y-115020000D02*
X155720000Y-115020000D01*
X150580000Y-112360000D02*
X155720000Y-112360000D01*
X150580000Y-115020000D02*
X150580000Y-112360000D01*
X149310000Y-115020000D02*
X147980000Y-115020000D01*
X147980000Y-115020000D02*
X147980000Y-113690000D01*
X168750000Y-85620000D02*
X164400000Y-85620000D01*
X164400000Y-85620000D02*
X164400000Y-84620000D01*
X164400000Y-84620000D02*
X168750000Y-84620000D01*
X162550000Y-86920000D02*
X162550000Y-87270000D01*
X162550000Y-87270000D02*
X160950000Y-87270000D01*
X160950000Y-87270000D02*
X160950000Y-88170000D01*
X160950000Y-88170000D02*
X168750000Y-88170000D01*
X168750000Y-88170000D02*
X168750000Y-82070000D01*
X168750000Y-82070000D02*
X160950000Y-82070000D01*
X160950000Y-82070000D02*
X160950000Y-82970000D01*
X160950000Y-82970000D02*
X162550000Y-82970000D01*
X162550000Y-82970000D02*
X162550000Y-83320000D01*
X162550000Y-88170000D02*
X162550000Y-87270000D01*
X162550000Y-82070000D02*
X162550000Y-82970000D01*
X164900000Y-87420000D02*
X166500000Y-87420000D01*
X166500000Y-87420000D02*
X166500000Y-86420000D01*
X166500000Y-86420000D02*
X164900000Y-86420000D01*
X164900000Y-86420000D02*
X164900000Y-87420000D01*
X164900000Y-82820000D02*
X166500000Y-82820000D01*
X166500000Y-82820000D02*
X166500000Y-83820000D01*
X166500000Y-83820000D02*
X164900000Y-83820000D01*
X164900000Y-83820000D02*
X164900000Y-82820000D01*
X166500000Y-86420000D02*
X168750000Y-86420000D01*
X166500000Y-86920000D02*
X168750000Y-86920000D01*
X162550000Y-86920000D02*
X161350000Y-86920000D01*
X157680000Y-76340000D02*
X157680000Y-79000000D01*
X160280000Y-76340000D02*
X157680000Y-76340000D01*
X160280000Y-79000000D02*
X157680000Y-79000000D01*
X160280000Y-76340000D02*
X160280000Y-79000000D01*
X161550000Y-76340000D02*
X162880000Y-76340000D01*
X162880000Y-76340000D02*
X162880000Y-77670000D01*
X168740000Y-106780000D02*
X164390000Y-106780000D01*
X164390000Y-106780000D02*
X164390000Y-105780000D01*
X164390000Y-105780000D02*
X168740000Y-105780000D01*
X162540000Y-108080000D02*
X162540000Y-108430000D01*
X162540000Y-108430000D02*
X160940000Y-108430000D01*
X160940000Y-108430000D02*
X160940000Y-109330000D01*
X160940000Y-109330000D02*
X168740000Y-109330000D01*
X168740000Y-109330000D02*
X168740000Y-103230000D01*
X168740000Y-103230000D02*
X160940000Y-103230000D01*
X160940000Y-103230000D02*
X160940000Y-104130000D01*
X160940000Y-104130000D02*
X162540000Y-104130000D01*
X162540000Y-104130000D02*
X162540000Y-104480000D01*
X162540000Y-109330000D02*
X162540000Y-108430000D01*
X162540000Y-103230000D02*
X162540000Y-104130000D01*
X164890000Y-108580000D02*
X166490000Y-108580000D01*
X166490000Y-108580000D02*
X166490000Y-107580000D01*
X166490000Y-107580000D02*
X164890000Y-107580000D01*
X164890000Y-107580000D02*
X164890000Y-108580000D01*
X164890000Y-103980000D02*
X166490000Y-103980000D01*
X166490000Y-103980000D02*
X166490000Y-104980000D01*
X166490000Y-104980000D02*
X164890000Y-104980000D01*
X164890000Y-104980000D02*
X164890000Y-103980000D01*
X166490000Y-107580000D02*
X168740000Y-107580000D01*
X166490000Y-108080000D02*
X168740000Y-108080000D01*
X162540000Y-108080000D02*
X161340000Y-108080000D01*
X163000000Y-115030000D02*
X163000000Y-112370000D01*
X160400000Y-115030000D02*
X163000000Y-115030000D01*
X160400000Y-112370000D02*
X163000000Y-112370000D01*
X160400000Y-115030000D02*
X160400000Y-112370000D01*
X159130000Y-115030000D02*
X157800000Y-115030000D01*
X157800000Y-115030000D02*
X157800000Y-113700000D01*
X165920000Y-98310000D02*
X168580000Y-98310000D01*
X165920000Y-95710000D02*
X165920000Y-98310000D01*
X168580000Y-95710000D02*
X168580000Y-98310000D01*
X165920000Y-95710000D02*
X168580000Y-95710000D01*
X165920000Y-94440000D02*
X165920000Y-93110000D01*
X165920000Y-93110000D02*
X167250000Y-93110000D01*
X142500000Y-115060000D02*
X145160000Y-115060000D01*
X142500000Y-115000000D02*
X142500000Y-115060000D01*
X145160000Y-115000000D02*
X145160000Y-115060000D01*
X142500000Y-115000000D02*
X145160000Y-115000000D01*
X142500000Y-113730000D02*
X142500000Y-112400000D01*
X142500000Y-112400000D02*
X143830000Y-112400000D01*
X139380000Y-115070000D02*
X142040000Y-115070000D01*
X139380000Y-115010000D02*
X139380000Y-115070000D01*
X142040000Y-115010000D02*
X142040000Y-115070000D01*
X139380000Y-115010000D02*
X142040000Y-115010000D01*
X139380000Y-113740000D02*
X139380000Y-112410000D01*
X139380000Y-112410000D02*
X140710000Y-112410000D01*
X137650000Y-101270000D02*
X137650000Y-100070000D01*
X139410000Y-100070000D02*
X139410000Y-101270000D01*
X153460000Y-109860000D02*
X153460000Y-108660000D01*
X155220000Y-108660000D02*
X155220000Y-109860000D01*
X149450000Y-109840000D02*
X149450000Y-108640000D01*
X151210000Y-108640000D02*
X151210000Y-109840000D01*
X133980000Y-91790000D02*
X135180000Y-91790000D01*
X135180000Y-93550000D02*
X133980000Y-93550000D01*
X144910000Y-94360000D02*
X144910000Y-95560000D01*
X143150000Y-95560000D02*
X143150000Y-94360000D01*
X140660000Y-90930000D02*
X141860000Y-90930000D01*
X141860000Y-92690000D02*
X140660000Y-92690000D01*
X153760000Y-99560000D02*
X153760000Y-98360000D01*
X155520000Y-98360000D02*
X155520000Y-99560000D01*
X157210000Y-97110000D02*
X157210000Y-95910000D01*
X158970000Y-95910000D02*
X158970000Y-97110000D01*
X143370000Y-102580000D02*
X142170000Y-102580000D01*
X142170000Y-100820000D02*
X143370000Y-100820000D01*
X138900000Y-105650000D02*
X138900000Y-104450000D01*
X140660000Y-104450000D02*
X140660000Y-105650000D01*
X155720000Y-102830000D02*
X155720000Y-104030000D01*
X153960000Y-104030000D02*
X153960000Y-102830000D01*
X163520000Y-98200000D02*
X163520000Y-99400000D01*
X161760000Y-99400000D02*
X161760000Y-98200000D01*
X143700000Y-105630000D02*
X143700000Y-104430000D01*
X145460000Y-104430000D02*
X145460000Y-105630000D01*
X156760000Y-93980000D02*
X159420000Y-93980000D01*
X156760000Y-93920000D02*
X156760000Y-93980000D01*
X159420000Y-93920000D02*
X159420000Y-93980000D01*
X156760000Y-93920000D02*
X159420000Y-93920000D01*
X156760000Y-92650000D02*
X156760000Y-91320000D01*
X156760000Y-91320000D02*
X158090000Y-91320000D01*
X156780000Y-102000000D02*
X159440000Y-102000000D01*
X156780000Y-101940000D02*
X156780000Y-102000000D01*
X159440000Y-101940000D02*
X159440000Y-102000000D01*
X156780000Y-101940000D02*
X159440000Y-101940000D01*
X156780000Y-100670000D02*
X156780000Y-99340000D01*
X156780000Y-99340000D02*
X158110000Y-99340000D01*
X148350000Y-106260000D02*
X151010000Y-106260000D01*
X148350000Y-103660000D02*
X148350000Y-106260000D01*
X151010000Y-103660000D02*
X151010000Y-106260000D01*
X148350000Y-103660000D02*
X151010000Y-103660000D01*
X148350000Y-102390000D02*
X148350000Y-101060000D01*
X148350000Y-101060000D02*
X149680000Y-101060000D01*
X140140000Y-97440000D02*
X140140000Y-94780000D01*
X137540000Y-97440000D02*
X140140000Y-97440000D01*
X137540000Y-94780000D02*
X140140000Y-94780000D01*
X137540000Y-97440000D02*
X137540000Y-94780000D01*
X136270000Y-97440000D02*
X134940000Y-97440000D01*
X134940000Y-97440000D02*
X134940000Y-96110000D01*
D12*
X130576667Y-89972381D02*
X130576667Y-90686667D01*
X130529047Y-90829524D01*
X130433809Y-90924762D01*
X130290952Y-90972381D01*
X130195714Y-90972381D01*
X131005238Y-90067619D02*
X131052857Y-90020000D01*
X131148095Y-89972381D01*
X131386191Y-89972381D01*
X131481429Y-90020000D01*
X131529048Y-90067619D01*
X131576667Y-90162857D01*
X131576667Y-90258095D01*
X131529048Y-90400952D01*
X130957619Y-90972381D01*
X131576667Y-90972381D01*
X142237143Y-79716666D02*
X142284762Y-79764285D01*
X142332381Y-79907142D01*
X142332381Y-80002380D01*
X142284762Y-80145238D01*
X142189524Y-80240476D01*
X142094286Y-80288095D01*
X141903810Y-80335714D01*
X141760952Y-80335714D01*
X141570476Y-80288095D01*
X141475238Y-80240476D01*
X141380000Y-80145238D01*
X141332381Y-80002380D01*
X141332381Y-79907142D01*
X141380000Y-79764285D01*
X141427619Y-79716666D01*
X142332381Y-78764285D02*
X142332381Y-79335714D01*
X142332381Y-79050000D02*
X141332381Y-79050000D01*
X141475238Y-79145238D01*
X141570476Y-79240476D01*
X141618095Y-79335714D01*
X157517143Y-82896666D02*
X157564762Y-82944285D01*
X157612381Y-83087142D01*
X157612381Y-83182380D01*
X157564762Y-83325238D01*
X157469524Y-83420476D01*
X157374286Y-83468095D01*
X157183810Y-83515714D01*
X157040952Y-83515714D01*
X156850476Y-83468095D01*
X156755238Y-83420476D01*
X156660000Y-83325238D01*
X156612381Y-83182380D01*
X156612381Y-83087142D01*
X156660000Y-82944285D01*
X156707619Y-82896666D01*
X156707619Y-82515714D02*
X156660000Y-82468095D01*
X156612381Y-82372857D01*
X156612381Y-82134761D01*
X156660000Y-82039523D01*
X156707619Y-81991904D01*
X156802857Y-81944285D01*
X156898095Y-81944285D01*
X157040952Y-81991904D01*
X157612381Y-82563333D01*
X157612381Y-81944285D01*
X157497143Y-87846666D02*
X157544762Y-87894285D01*
X157592381Y-88037142D01*
X157592381Y-88132380D01*
X157544762Y-88275238D01*
X157449524Y-88370476D01*
X157354286Y-88418095D01*
X157163810Y-88465714D01*
X157020952Y-88465714D01*
X156830476Y-88418095D01*
X156735238Y-88370476D01*
X156640000Y-88275238D01*
X156592381Y-88132380D01*
X156592381Y-88037142D01*
X156640000Y-87894285D01*
X156687619Y-87846666D01*
X156592381Y-87513333D02*
X156592381Y-86894285D01*
X156973333Y-87227619D01*
X156973333Y-87084761D01*
X157020952Y-86989523D01*
X157068571Y-86941904D01*
X157163810Y-86894285D01*
X157401905Y-86894285D01*
X157497143Y-86941904D01*
X157544762Y-86989523D01*
X157592381Y-87084761D01*
X157592381Y-87370476D01*
X157544762Y-87465714D01*
X157497143Y-87513333D01*
X157077143Y-104666666D02*
X157124762Y-104714285D01*
X157172381Y-104857142D01*
X157172381Y-104952380D01*
X157124762Y-105095238D01*
X157029524Y-105190476D01*
X156934286Y-105238095D01*
X156743810Y-105285714D01*
X156600952Y-105285714D01*
X156410476Y-105238095D01*
X156315238Y-105190476D01*
X156220000Y-105095238D01*
X156172381Y-104952380D01*
X156172381Y-104857142D01*
X156220000Y-104714285D01*
X156267619Y-104666666D01*
X156505714Y-103809523D02*
X157172381Y-103809523D01*
X156124762Y-104047619D02*
X156839048Y-104285714D01*
X156839048Y-103666666D01*
X161457143Y-92766666D02*
X161504762Y-92814285D01*
X161552381Y-92957142D01*
X161552381Y-93052380D01*
X161504762Y-93195238D01*
X161409524Y-93290476D01*
X161314286Y-93338095D01*
X161123810Y-93385714D01*
X160980952Y-93385714D01*
X160790476Y-93338095D01*
X160695238Y-93290476D01*
X160600000Y-93195238D01*
X160552381Y-93052380D01*
X160552381Y-92957142D01*
X160600000Y-92814285D01*
X160647619Y-92766666D01*
X160552381Y-91861904D02*
X160552381Y-92338095D01*
X161028571Y-92385714D01*
X160980952Y-92338095D01*
X160933333Y-92242857D01*
X160933333Y-92004761D01*
X160980952Y-91909523D01*
X161028571Y-91861904D01*
X161123810Y-91814285D01*
X161361905Y-91814285D01*
X161457143Y-91861904D01*
X161504762Y-91909523D01*
X161552381Y-92004761D01*
X161552381Y-92242857D01*
X161504762Y-92338095D01*
X161457143Y-92385714D01*
X137958905Y-80047381D02*
X137958905Y-79047381D01*
X138197000Y-79047381D01*
X138339858Y-79095000D01*
X138435096Y-79190238D01*
X138482715Y-79285476D01*
X138530334Y-79475952D01*
X138530334Y-79618810D01*
X138482715Y-79809286D01*
X138435096Y-79904524D01*
X138339858Y-79999762D01*
X138197000Y-80047381D01*
X137958905Y-80047381D01*
X139482715Y-80047381D02*
X138911286Y-80047381D01*
X139197000Y-80047381D02*
X139197000Y-79047381D01*
X139101762Y-79190238D01*
X139006524Y-79285476D01*
X138911286Y-79333095D01*
X159622381Y-109998095D02*
X158622381Y-109998095D01*
X158622381Y-109760000D01*
X158670000Y-109617142D01*
X158765238Y-109521904D01*
X158860476Y-109474285D01*
X159050952Y-109426666D01*
X159193810Y-109426666D01*
X159384286Y-109474285D01*
X159479524Y-109521904D01*
X159574762Y-109617142D01*
X159622381Y-109760000D01*
X159622381Y-109998095D01*
X158717619Y-109045714D02*
X158670000Y-108998095D01*
X158622381Y-108902857D01*
X158622381Y-108664761D01*
X158670000Y-108569523D01*
X158717619Y-108521904D01*
X158812857Y-108474285D01*
X158908095Y-108474285D01*
X159050952Y-108521904D01*
X159622381Y-109093333D01*
X159622381Y-108474285D01*
X148632381Y-109998095D02*
X147632381Y-109998095D01*
X147632381Y-109760000D01*
X147680000Y-109617142D01*
X147775238Y-109521904D01*
X147870476Y-109474285D01*
X148060952Y-109426666D01*
X148203810Y-109426666D01*
X148394286Y-109474285D01*
X148489524Y-109521904D01*
X148584762Y-109617142D01*
X148632381Y-109760000D01*
X148632381Y-109998095D01*
X147632381Y-109093333D02*
X147632381Y-108474285D01*
X148013333Y-108807619D01*
X148013333Y-108664761D01*
X148060952Y-108569523D01*
X148108571Y-108521904D01*
X148203810Y-108474285D01*
X148441905Y-108474285D01*
X148537143Y-108521904D01*
X148584762Y-108569523D01*
X148632381Y-108664761D01*
X148632381Y-108950476D01*
X148584762Y-109045714D01*
X148537143Y-109093333D01*
X130532381Y-96338095D02*
X129532381Y-96338095D01*
X129532381Y-96100000D01*
X129580000Y-95957142D01*
X129675238Y-95861904D01*
X129770476Y-95814285D01*
X129960952Y-95766666D01*
X130103810Y-95766666D01*
X130294286Y-95814285D01*
X130389524Y-95861904D01*
X130484762Y-95957142D01*
X130532381Y-96100000D01*
X130532381Y-96338095D01*
X129865714Y-94909523D02*
X130532381Y-94909523D01*
X129484762Y-95147619D02*
X130199048Y-95385714D01*
X130199048Y-94766666D01*
X148493810Y-93862381D02*
X148493810Y-92862381D01*
X149541429Y-93767143D02*
X149493810Y-93814762D01*
X149350953Y-93862381D01*
X149255715Y-93862381D01*
X149112857Y-93814762D01*
X149017619Y-93719524D01*
X148970000Y-93624286D01*
X148922381Y-93433810D01*
X148922381Y-93290952D01*
X148970000Y-93100476D01*
X149017619Y-93005238D01*
X149112857Y-92910000D01*
X149255715Y-92862381D01*
X149350953Y-92862381D01*
X149493810Y-92910000D01*
X149541429Y-92957619D01*
X150493810Y-93862381D02*
X149922381Y-93862381D01*
X150208095Y-93862381D02*
X150208095Y-92862381D01*
X150112857Y-93005238D01*
X150017619Y-93100476D01*
X149922381Y-93148095D01*
X135506667Y-108272381D02*
X135506667Y-108986667D01*
X135459047Y-109129524D01*
X135363809Y-109224762D01*
X135220952Y-109272381D01*
X135125714Y-109272381D01*
X136506667Y-109272381D02*
X135935238Y-109272381D01*
X136220952Y-109272381D02*
X136220952Y-108272381D01*
X136125714Y-108415238D01*
X136030476Y-108510476D01*
X135935238Y-108558095D01*
X135892381Y-103603333D02*
X136606667Y-103603333D01*
X136749524Y-103650953D01*
X136844762Y-103746191D01*
X136892381Y-103889048D01*
X136892381Y-103984286D01*
X135892381Y-103222381D02*
X135892381Y-102603333D01*
X136273333Y-102936667D01*
X136273333Y-102793809D01*
X136320952Y-102698571D01*
X136368571Y-102650952D01*
X136463810Y-102603333D01*
X136701905Y-102603333D01*
X136797143Y-102650952D01*
X136844762Y-102698571D01*
X136892381Y-102793809D01*
X136892381Y-103079524D01*
X136844762Y-103174762D01*
X136797143Y-103222381D01*
X146432381Y-114023333D02*
X147146667Y-114023333D01*
X147289524Y-114070953D01*
X147384762Y-114166191D01*
X147432381Y-114309048D01*
X147432381Y-114404286D01*
X146765714Y-113118571D02*
X147432381Y-113118571D01*
X146384762Y-113356667D02*
X147099048Y-113594762D01*
X147099048Y-112975714D01*
X159432381Y-85673333D02*
X160146667Y-85673333D01*
X160289524Y-85720953D01*
X160384762Y-85816191D01*
X160432381Y-85959048D01*
X160432381Y-86054286D01*
X159432381Y-84720952D02*
X159432381Y-85197143D01*
X159908571Y-85244762D01*
X159860952Y-85197143D01*
X159813333Y-85101905D01*
X159813333Y-84863809D01*
X159860952Y-84768571D01*
X159908571Y-84720952D01*
X160003810Y-84673333D01*
X160241905Y-84673333D01*
X160337143Y-84720952D01*
X160384762Y-84768571D01*
X160432381Y-84863809D01*
X160432381Y-85101905D01*
X160384762Y-85197143D01*
X160337143Y-85244762D01*
X163332381Y-78003333D02*
X164046667Y-78003333D01*
X164189524Y-78050953D01*
X164284762Y-78146191D01*
X164332381Y-78289048D01*
X164332381Y-78384286D01*
X163332381Y-77098571D02*
X163332381Y-77289048D01*
X163380000Y-77384286D01*
X163427619Y-77431905D01*
X163570476Y-77527143D01*
X163760952Y-77574762D01*
X164141905Y-77574762D01*
X164237143Y-77527143D01*
X164284762Y-77479524D01*
X164332381Y-77384286D01*
X164332381Y-77193809D01*
X164284762Y-77098571D01*
X164237143Y-77050952D01*
X164141905Y-77003333D01*
X163903810Y-77003333D01*
X163808571Y-77050952D01*
X163760952Y-77098571D01*
X163713333Y-77193809D01*
X163713333Y-77384286D01*
X163760952Y-77479524D01*
X163808571Y-77527143D01*
X163903810Y-77574762D01*
X159582381Y-106213333D02*
X160296667Y-106213333D01*
X160439524Y-106260953D01*
X160534762Y-106356191D01*
X160582381Y-106499048D01*
X160582381Y-106594286D01*
X159582381Y-105832381D02*
X159582381Y-105165714D01*
X160582381Y-105594286D01*
X156252381Y-114033333D02*
X156966667Y-114033333D01*
X157109524Y-114080953D01*
X157204762Y-114176191D01*
X157252381Y-114319048D01*
X157252381Y-114414286D01*
X156680952Y-113414286D02*
X156633333Y-113509524D01*
X156585714Y-113557143D01*
X156490476Y-113604762D01*
X156442857Y-113604762D01*
X156347619Y-113557143D01*
X156300000Y-113509524D01*
X156252381Y-113414286D01*
X156252381Y-113223809D01*
X156300000Y-113128571D01*
X156347619Y-113080952D01*
X156442857Y-113033333D01*
X156490476Y-113033333D01*
X156585714Y-113080952D01*
X156633333Y-113128571D01*
X156680952Y-113223809D01*
X156680952Y-113414286D01*
X156728571Y-113509524D01*
X156776190Y-113557143D01*
X156871429Y-113604762D01*
X157061905Y-113604762D01*
X157157143Y-113557143D01*
X157204762Y-113509524D01*
X157252381Y-113414286D01*
X157252381Y-113223809D01*
X157204762Y-113128571D01*
X157157143Y-113080952D01*
X157061905Y-113033333D01*
X156871429Y-113033333D01*
X156776190Y-113080952D01*
X156728571Y-113128571D01*
X156680952Y-113223809D01*
X140632381Y-100836666D02*
X140156190Y-101170000D01*
X140632381Y-101408095D02*
X139632381Y-101408095D01*
X139632381Y-101027142D01*
X139680000Y-100931904D01*
X139727619Y-100884285D01*
X139822857Y-100836666D01*
X139965714Y-100836666D01*
X140060952Y-100884285D01*
X140108571Y-100931904D01*
X140156190Y-101027142D01*
X140156190Y-101408095D01*
X140632381Y-99884285D02*
X140632381Y-100455714D01*
X140632381Y-100170000D02*
X139632381Y-100170000D01*
X139775238Y-100265238D01*
X139870476Y-100360476D01*
X139918095Y-100455714D01*
X156442381Y-109426666D02*
X155966190Y-109760000D01*
X156442381Y-109998095D02*
X155442381Y-109998095D01*
X155442381Y-109617142D01*
X155490000Y-109521904D01*
X155537619Y-109474285D01*
X155632857Y-109426666D01*
X155775714Y-109426666D01*
X155870952Y-109474285D01*
X155918571Y-109521904D01*
X155966190Y-109617142D01*
X155966190Y-109998095D01*
X155537619Y-109045714D02*
X155490000Y-108998095D01*
X155442381Y-108902857D01*
X155442381Y-108664761D01*
X155490000Y-108569523D01*
X155537619Y-108521904D01*
X155632857Y-108474285D01*
X155728095Y-108474285D01*
X155870952Y-108521904D01*
X156442381Y-109093333D01*
X156442381Y-108474285D01*
X152432381Y-109406666D02*
X151956190Y-109740000D01*
X152432381Y-109978095D02*
X151432381Y-109978095D01*
X151432381Y-109597142D01*
X151480000Y-109501904D01*
X151527619Y-109454285D01*
X151622857Y-109406666D01*
X151765714Y-109406666D01*
X151860952Y-109454285D01*
X151908571Y-109501904D01*
X151956190Y-109597142D01*
X151956190Y-109978095D01*
X151432381Y-109073333D02*
X151432381Y-108454285D01*
X151813333Y-108787619D01*
X151813333Y-108644761D01*
X151860952Y-108549523D01*
X151908571Y-108501904D01*
X152003810Y-108454285D01*
X152241905Y-108454285D01*
X152337143Y-108501904D01*
X152384762Y-108549523D01*
X152432381Y-108644761D01*
X152432381Y-108930476D01*
X152384762Y-109025714D01*
X152337143Y-109073333D01*
X131723334Y-92772381D02*
X131390000Y-92296190D01*
X131151905Y-92772381D02*
X131151905Y-91772381D01*
X131532858Y-91772381D01*
X131628096Y-91820000D01*
X131675715Y-91867619D01*
X131723334Y-91962857D01*
X131723334Y-92105714D01*
X131675715Y-92200952D01*
X131628096Y-92248571D01*
X131532858Y-92296190D01*
X131151905Y-92296190D01*
X132580477Y-92105714D02*
X132580477Y-92772381D01*
X132342381Y-91724762D02*
X132104286Y-92439048D01*
X132723334Y-92439048D01*
X142832381Y-95126666D02*
X142356190Y-95460000D01*
X142832381Y-95698095D02*
X141832381Y-95698095D01*
X141832381Y-95317142D01*
X141880000Y-95221904D01*
X141927619Y-95174285D01*
X142022857Y-95126666D01*
X142165714Y-95126666D01*
X142260952Y-95174285D01*
X142308571Y-95221904D01*
X142356190Y-95317142D01*
X142356190Y-95698095D01*
X141832381Y-94221904D02*
X141832381Y-94698095D01*
X142308571Y-94745714D01*
X142260952Y-94698095D01*
X142213333Y-94602857D01*
X142213333Y-94364761D01*
X142260952Y-94269523D01*
X142308571Y-94221904D01*
X142403810Y-94174285D01*
X142641905Y-94174285D01*
X142737143Y-94221904D01*
X142784762Y-94269523D01*
X142832381Y-94364761D01*
X142832381Y-94602857D01*
X142784762Y-94698095D01*
X142737143Y-94745714D01*
X141093334Y-93912381D02*
X140760000Y-93436190D01*
X140521905Y-93912381D02*
X140521905Y-92912381D01*
X140902858Y-92912381D01*
X140998096Y-92960000D01*
X141045715Y-93007619D01*
X141093334Y-93102857D01*
X141093334Y-93245714D01*
X141045715Y-93340952D01*
X140998096Y-93388571D01*
X140902858Y-93436190D01*
X140521905Y-93436190D01*
X141950477Y-92912381D02*
X141760000Y-92912381D01*
X141664762Y-92960000D01*
X141617143Y-93007619D01*
X141521905Y-93150476D01*
X141474286Y-93340952D01*
X141474286Y-93721905D01*
X141521905Y-93817143D01*
X141569524Y-93864762D01*
X141664762Y-93912381D01*
X141855239Y-93912381D01*
X141950477Y-93864762D01*
X141998096Y-93817143D01*
X142045715Y-93721905D01*
X142045715Y-93483810D01*
X141998096Y-93388571D01*
X141950477Y-93340952D01*
X141855239Y-93293333D01*
X141664762Y-93293333D01*
X141569524Y-93340952D01*
X141521905Y-93388571D01*
X141474286Y-93483810D01*
X155412381Y-96446666D02*
X154936190Y-96780000D01*
X155412381Y-97018095D02*
X154412381Y-97018095D01*
X154412381Y-96637142D01*
X154460000Y-96541904D01*
X154507619Y-96494285D01*
X154602857Y-96446666D01*
X154745714Y-96446666D01*
X154840952Y-96494285D01*
X154888571Y-96541904D01*
X154936190Y-96637142D01*
X154936190Y-97018095D01*
X154412381Y-96113333D02*
X154412381Y-95446666D01*
X155412381Y-95875238D01*
X160192381Y-96676666D02*
X159716190Y-97010000D01*
X160192381Y-97248095D02*
X159192381Y-97248095D01*
X159192381Y-96867142D01*
X159240000Y-96771904D01*
X159287619Y-96724285D01*
X159382857Y-96676666D01*
X159525714Y-96676666D01*
X159620952Y-96724285D01*
X159668571Y-96771904D01*
X159716190Y-96867142D01*
X159716190Y-97248095D01*
X159620952Y-96105238D02*
X159573333Y-96200476D01*
X159525714Y-96248095D01*
X159430476Y-96295714D01*
X159382857Y-96295714D01*
X159287619Y-96248095D01*
X159240000Y-96200476D01*
X159192381Y-96105238D01*
X159192381Y-95914761D01*
X159240000Y-95819523D01*
X159287619Y-95771904D01*
X159382857Y-95724285D01*
X159430476Y-95724285D01*
X159525714Y-95771904D01*
X159573333Y-95819523D01*
X159620952Y-95914761D01*
X159620952Y-96105238D01*
X159668571Y-96200476D01*
X159716190Y-96248095D01*
X159811429Y-96295714D01*
X160001905Y-96295714D01*
X160097143Y-96248095D01*
X160144762Y-96200476D01*
X160192381Y-96105238D01*
X160192381Y-95914761D01*
X160144762Y-95819523D01*
X160097143Y-95771904D01*
X160001905Y-95724285D01*
X159811429Y-95724285D01*
X159716190Y-95771904D01*
X159668571Y-95819523D01*
X159620952Y-95914761D01*
X142603334Y-100502381D02*
X142270000Y-100026190D01*
X142031905Y-100502381D02*
X142031905Y-99502381D01*
X142412858Y-99502381D01*
X142508096Y-99550000D01*
X142555715Y-99597619D01*
X142603334Y-99692857D01*
X142603334Y-99835714D01*
X142555715Y-99930952D01*
X142508096Y-99978571D01*
X142412858Y-100026190D01*
X142031905Y-100026190D01*
X143079524Y-100502381D02*
X143270000Y-100502381D01*
X143365239Y-100454762D01*
X143412858Y-100407143D01*
X143508096Y-100264286D01*
X143555715Y-100073810D01*
X143555715Y-99692857D01*
X143508096Y-99597619D01*
X143460477Y-99550000D01*
X143365239Y-99502381D01*
X143174762Y-99502381D01*
X143079524Y-99550000D01*
X143031905Y-99597619D01*
X142984286Y-99692857D01*
X142984286Y-99930952D01*
X143031905Y-100026190D01*
X143079524Y-100073810D01*
X143174762Y-100121429D01*
X143365239Y-100121429D01*
X143460477Y-100073810D01*
X143508096Y-100026190D01*
X143555715Y-99930952D01*
X141882381Y-105692857D02*
X141406190Y-106026191D01*
X141882381Y-106264286D02*
X140882381Y-106264286D01*
X140882381Y-105883333D01*
X140930000Y-105788095D01*
X140977619Y-105740476D01*
X141072857Y-105692857D01*
X141215714Y-105692857D01*
X141310952Y-105740476D01*
X141358571Y-105788095D01*
X141406190Y-105883333D01*
X141406190Y-106264286D01*
X141882381Y-104740476D02*
X141882381Y-105311905D01*
X141882381Y-105026191D02*
X140882381Y-105026191D01*
X141025238Y-105121429D01*
X141120476Y-105216667D01*
X141168095Y-105311905D01*
X140882381Y-104121429D02*
X140882381Y-104026190D01*
X140930000Y-103930952D01*
X140977619Y-103883333D01*
X141072857Y-103835714D01*
X141263333Y-103788095D01*
X141501429Y-103788095D01*
X141691905Y-103835714D01*
X141787143Y-103883333D01*
X141834762Y-103930952D01*
X141882381Y-104026190D01*
X141882381Y-104121429D01*
X141834762Y-104216667D01*
X141787143Y-104264286D01*
X141691905Y-104311905D01*
X141501429Y-104359524D01*
X141263333Y-104359524D01*
X141072857Y-104311905D01*
X140977619Y-104264286D01*
X140930000Y-104216667D01*
X140882381Y-104121429D01*
X153642381Y-104072857D02*
X153166190Y-104406191D01*
X153642381Y-104644286D02*
X152642381Y-104644286D01*
X152642381Y-104263333D01*
X152690000Y-104168095D01*
X152737619Y-104120476D01*
X152832857Y-104072857D01*
X152975714Y-104072857D01*
X153070952Y-104120476D01*
X153118571Y-104168095D01*
X153166190Y-104263333D01*
X153166190Y-104644286D01*
X153642381Y-103120476D02*
X153642381Y-103691905D01*
X153642381Y-103406191D02*
X152642381Y-103406191D01*
X152785238Y-103501429D01*
X152880476Y-103596667D01*
X152928095Y-103691905D01*
X153642381Y-102168095D02*
X153642381Y-102739524D01*
X153642381Y-102453810D02*
X152642381Y-102453810D01*
X152785238Y-102549048D01*
X152880476Y-102644286D01*
X152928095Y-102739524D01*
X161442381Y-99442857D02*
X160966190Y-99776191D01*
X161442381Y-100014286D02*
X160442381Y-100014286D01*
X160442381Y-99633333D01*
X160490000Y-99538095D01*
X160537619Y-99490476D01*
X160632857Y-99442857D01*
X160775714Y-99442857D01*
X160870952Y-99490476D01*
X160918571Y-99538095D01*
X160966190Y-99633333D01*
X160966190Y-100014286D01*
X161442381Y-98490476D02*
X161442381Y-99061905D01*
X161442381Y-98776191D02*
X160442381Y-98776191D01*
X160585238Y-98871429D01*
X160680476Y-98966667D01*
X160728095Y-99061905D01*
X160537619Y-98109524D02*
X160490000Y-98061905D01*
X160442381Y-97966667D01*
X160442381Y-97728571D01*
X160490000Y-97633333D01*
X160537619Y-97585714D01*
X160632857Y-97538095D01*
X160728095Y-97538095D01*
X160870952Y-97585714D01*
X161442381Y-98157143D01*
X161442381Y-97538095D01*
X146682381Y-105672857D02*
X146206190Y-106006191D01*
X146682381Y-106244286D02*
X145682381Y-106244286D01*
X145682381Y-105863333D01*
X145730000Y-105768095D01*
X145777619Y-105720476D01*
X145872857Y-105672857D01*
X146015714Y-105672857D01*
X146110952Y-105720476D01*
X146158571Y-105768095D01*
X146206190Y-105863333D01*
X146206190Y-106244286D01*
X146682381Y-104720476D02*
X146682381Y-105291905D01*
X146682381Y-105006191D02*
X145682381Y-105006191D01*
X145825238Y-105101429D01*
X145920476Y-105196667D01*
X145968095Y-105291905D01*
X145682381Y-104387143D02*
X145682381Y-103768095D01*
X146063333Y-104101429D01*
X146063333Y-103958571D01*
X146110952Y-103863333D01*
X146158571Y-103815714D01*
X146253810Y-103768095D01*
X146491905Y-103768095D01*
X146587143Y-103815714D01*
X146634762Y-103863333D01*
X146682381Y-103958571D01*
X146682381Y-104244286D01*
X146634762Y-104339524D01*
X146587143Y-104387143D01*
X148846667Y-99512381D02*
X148846667Y-100226667D01*
X148799047Y-100369524D01*
X148703809Y-100464762D01*
X148560952Y-100512381D01*
X148465714Y-100512381D01*
X149322857Y-100512381D02*
X149322857Y-99512381D01*
X149703810Y-99512381D01*
X149799048Y-99560000D01*
X149846667Y-99607619D01*
X149894286Y-99702857D01*
X149894286Y-99845714D01*
X149846667Y-99940952D01*
X149799048Y-99988571D01*
X149703810Y-100036190D01*
X149322857Y-100036190D01*
X150846667Y-100512381D02*
X150275238Y-100512381D01*
X150560952Y-100512381D02*
X150560952Y-99512381D01*
X150465714Y-99655238D01*
X150370476Y-99750476D01*
X150275238Y-99798095D01*
X136776667Y-92982381D02*
X136776667Y-93696667D01*
X136729047Y-93839524D01*
X136633809Y-93934762D01*
X136490952Y-93982381D01*
X136395714Y-93982381D01*
X137252857Y-93982381D02*
X137252857Y-92982381D01*
X137633810Y-92982381D01*
X137729048Y-93030000D01*
X137776667Y-93077619D01*
X137824286Y-93172857D01*
X137824286Y-93315714D01*
X137776667Y-93410952D01*
X137729048Y-93458571D01*
X137633810Y-93506190D01*
X137252857Y-93506190D01*
X138205238Y-93077619D02*
X138252857Y-93030000D01*
X138348095Y-92982381D01*
X138586191Y-92982381D01*
X138681429Y-93030000D01*
X138729048Y-93077619D01*
X138776667Y-93172857D01*
X138776667Y-93268095D01*
X138729048Y-93410952D01*
X138157619Y-93982381D01*
X138776667Y-93982381D01*
M02*
