G04 #@! TF.FileFunction,Paste,Top*
%FSLAX46Y46*%
G04 Gerber Fmt 4.6, Leading zero omitted, Abs format (unit mm)*
G04 Created by KiCad (PCBNEW 4.0.7-e2-6376~61~ubuntu18.04.1) date Tue Feb 26 13:08:01 2019*
%MOMM*%
%LPD*%
G01*
G04 APERTURE LIST*
%ADD10C,0.100000*%
%ADD11R,1.250000X1.000000*%
%ADD12R,1.100000X1.100000*%
%ADD13R,1.200000X1.200000*%
%ADD14R,0.730000X0.300000*%
%ADD15R,0.300000X0.730000*%
%ADD16R,0.750000X0.750000*%
%ADD17R,1.300000X0.450000*%
%ADD18R,1.300000X0.700000*%
%ADD19R,0.700000X1.300000*%
G04 APERTURE END LIST*
D10*
D11*
X158680000Y-83720000D03*
X158680000Y-81720000D03*
X158640000Y-88680000D03*
X158640000Y-86680000D03*
X158220000Y-105500000D03*
X158220000Y-103500000D03*
X162640000Y-91600000D03*
X162640000Y-93600000D03*
D12*
X139970000Y-77690000D03*
X137170000Y-77690000D03*
D13*
X157720000Y-110360000D03*
X157720000Y-108160000D03*
X146730000Y-110360000D03*
X146730000Y-108160000D03*
X131530000Y-94500000D03*
X131530000Y-96700000D03*
D14*
X147505000Y-95740000D03*
X147505000Y-96240000D03*
X147505000Y-96740000D03*
X147505000Y-97240000D03*
X147505000Y-97740000D03*
D15*
X148470000Y-98705000D03*
X148970000Y-98705000D03*
X149470000Y-98705000D03*
X149970000Y-98705000D03*
X150470000Y-98705000D03*
D14*
X151435000Y-97740000D03*
X151435000Y-97240000D03*
X151435000Y-96740000D03*
X151435000Y-96240000D03*
X151435000Y-95740000D03*
D15*
X150470000Y-94775000D03*
X149970000Y-94775000D03*
X149470000Y-94775000D03*
X148970000Y-94775000D03*
X148470000Y-94775000D03*
D16*
X150095000Y-97365000D03*
X150095000Y-96115000D03*
X148845000Y-97365000D03*
X148845000Y-96115000D03*
D17*
X134840000Y-101970000D03*
X134840000Y-102620000D03*
X134840000Y-103270000D03*
X134840000Y-103920000D03*
X134840000Y-104570000D03*
D18*
X138530000Y-99720000D03*
X138530000Y-101620000D03*
X154340000Y-108310000D03*
X154340000Y-110210000D03*
X150330000Y-108290000D03*
X150330000Y-110190000D03*
D19*
X135530000Y-92670000D03*
X133630000Y-92670000D03*
D18*
X144030000Y-95910000D03*
X144030000Y-94010000D03*
D19*
X142210000Y-91810000D03*
X140310000Y-91810000D03*
D18*
X154640000Y-98010000D03*
X154640000Y-99910000D03*
X158090000Y-95560000D03*
X158090000Y-97460000D03*
D19*
X141820000Y-101700000D03*
X143720000Y-101700000D03*
D18*
X139780000Y-104100000D03*
X139780000Y-106000000D03*
X154840000Y-104380000D03*
X154840000Y-102480000D03*
X162640000Y-99750000D03*
X162640000Y-97850000D03*
X144580000Y-104080000D03*
X144580000Y-105980000D03*
M02*
