G04 #@! TF.FileFunction,Soldermask,Bot*
%FSLAX46Y46*%
G04 Gerber Fmt 4.6, Leading zero omitted, Abs format (unit mm)*
G04 Created by KiCad (PCBNEW 4.0.7-e2-6376~61~ubuntu18.04.1) date Thu Mar 14 12:40:49 2019*
%MOMM*%
%LPD*%
G01*
G04 APERTURE LIST*
%ADD10C,0.100000*%
%ADD11R,1.400000X1.650000*%
%ADD12R,2.100000X1.600000*%
%ADD13O,2.100000X1.600000*%
%ADD14R,2.100000X2.100000*%
%ADD15O,2.100000X2.100000*%
%ADD16R,2.150000X2.150000*%
%ADD17C,2.150000*%
%ADD18R,2.900000X2.400000*%
%ADD19R,1.100000X1.700000*%
%ADD20R,1.700000X1.100000*%
%ADD21R,1.050000X0.700000*%
%ADD22R,1.400000X2.400000*%
%ADD23C,2.600000*%
G04 APERTURE END LIST*
D10*
D11*
X115300000Y-55880000D03*
X113300000Y-55880000D03*
D12*
X125835000Y-47150000D03*
D13*
X125835000Y-45150000D03*
D14*
X121920000Y-83820000D03*
D15*
X124460000Y-83820000D03*
X121920000Y-86360000D03*
X124460000Y-86360000D03*
X121920000Y-88900000D03*
X124460000Y-88900000D03*
D14*
X125984000Y-100838000D03*
D15*
X125984000Y-103378000D03*
X125984000Y-105918000D03*
D14*
X108991400Y-79756000D03*
D15*
X108991400Y-77216000D03*
X108991400Y-74676000D03*
X108991400Y-72136000D03*
X108991400Y-69596000D03*
X108991400Y-67056000D03*
X108991400Y-64516000D03*
X108991400Y-61976000D03*
X108991400Y-59436000D03*
X108991400Y-56896000D03*
X108991400Y-54356000D03*
X108991400Y-51816000D03*
D14*
X108000800Y-44754800D03*
D15*
X110540800Y-44754800D03*
X113080800Y-44754800D03*
X115620800Y-44754800D03*
X118160800Y-44754800D03*
X120700800Y-44754800D03*
D16*
X109982000Y-92202000D03*
D17*
X109982000Y-89702000D03*
X109982000Y-87202000D03*
X109982000Y-84702000D03*
D18*
X118618000Y-55086000D03*
X118618000Y-51086000D03*
D11*
X115046000Y-49276000D03*
X113046000Y-49276000D03*
D19*
X112202000Y-105410000D03*
X110302000Y-105410000D03*
D20*
X116586000Y-78806000D03*
X116586000Y-80706000D03*
D19*
X118110000Y-76675000D03*
X120010000Y-76675000D03*
D20*
X112217200Y-79563000D03*
X112217200Y-77663000D03*
D21*
X112953800Y-54102000D03*
X112953200Y-53582000D03*
X112953200Y-53082000D03*
X112953200Y-52582000D03*
X112953200Y-52082000D03*
X115646800Y-52082000D03*
X115646800Y-52582000D03*
X115646200Y-53086000D03*
X115646200Y-53594000D03*
X115646200Y-54102000D03*
D22*
X114300000Y-52832000D03*
D21*
X112953200Y-51582000D03*
X115646800Y-51582000D03*
D14*
X116810000Y-85925000D03*
D15*
X116810000Y-88465000D03*
D14*
X124206000Y-79756000D03*
D15*
X124206000Y-77216000D03*
X124206000Y-74676000D03*
X124206000Y-72136000D03*
X124206000Y-69596000D03*
X124206000Y-67056000D03*
X124206000Y-64516000D03*
X124206000Y-61976000D03*
X124206000Y-59436000D03*
X124206000Y-56896000D03*
X124206000Y-54356000D03*
D14*
X124185000Y-51800000D03*
D23*
X107060000Y-48600000D03*
X125910000Y-95100000D03*
M02*
