G04 #@! TF.FileFunction,Other,User*
%FSLAX46Y46*%
G04 Gerber Fmt 4.6, Leading zero omitted, Abs format (unit mm)*
G04 Created by KiCad (PCBNEW 4.0.7-e2-6376~61~ubuntu18.04.1) date Thu Mar 14 12:40:49 2019*
%MOMM*%
%LPD*%
G01*
G04 APERTURE LIST*
%ADD10C,0.100000*%
%ADD11C,0.050000*%
G04 APERTURE END LIST*
D10*
D11*
X116050000Y-55000000D02*
X112550000Y-55000000D01*
X116050000Y-55000000D02*
X116050000Y-56750000D01*
X112550000Y-56750000D02*
X112550000Y-55000000D01*
X112550000Y-56750000D02*
X116050000Y-56750000D01*
X107191400Y-81556000D02*
X107191400Y-50006000D01*
X107191400Y-50006000D02*
X110791400Y-50006000D01*
X110791400Y-50006000D02*
X110791400Y-81556000D01*
X110791400Y-81556000D02*
X107191400Y-81556000D01*
X106200800Y-42954800D02*
X122500800Y-42954800D01*
X122500800Y-42954800D02*
X122500800Y-46554800D01*
X122500800Y-46554800D02*
X106200800Y-46554800D01*
X106200800Y-46554800D02*
X106200800Y-42954800D01*
X120218000Y-56386000D02*
X120218000Y-49786000D01*
X117018000Y-56386000D02*
X117018000Y-49786000D01*
X120218000Y-56386000D02*
X117018000Y-56386000D01*
X120218000Y-49786000D02*
X117018000Y-49786000D01*
X115796000Y-48396000D02*
X112296000Y-48396000D01*
X115796000Y-48396000D02*
X115796000Y-50146000D01*
X112296000Y-50146000D02*
X112296000Y-48396000D01*
X112296000Y-50146000D02*
X115796000Y-50146000D01*
X112802000Y-104510000D02*
X109702000Y-104510000D01*
X112802000Y-104510000D02*
X112802000Y-106310000D01*
X109702000Y-106310000D02*
X109702000Y-104510000D01*
X109702000Y-106310000D02*
X112802000Y-106310000D01*
X115686000Y-78206000D02*
X115686000Y-81306000D01*
X115686000Y-78206000D02*
X117486000Y-78206000D01*
X117486000Y-81306000D02*
X115686000Y-81306000D01*
X117486000Y-81306000D02*
X117486000Y-78206000D01*
X117510000Y-77575000D02*
X120610000Y-77575000D01*
X117510000Y-77575000D02*
X117510000Y-75775000D01*
X120610000Y-75775000D02*
X120610000Y-77575000D01*
X120610000Y-75775000D02*
X117510000Y-75775000D01*
X113117200Y-80163000D02*
X113117200Y-77063000D01*
X113117200Y-80163000D02*
X111317200Y-80163000D01*
X111317200Y-77063000D02*
X113117200Y-77063000D01*
X111317200Y-77063000D02*
X111317200Y-80163000D01*
X112150000Y-54632000D02*
X112150000Y-51032000D01*
X116450000Y-54632000D02*
X116450000Y-51032000D01*
X112150000Y-54632000D02*
X116450000Y-54632000D01*
X112150000Y-51032000D02*
X116450000Y-51032000D01*
X122406000Y-81556000D02*
X122406000Y-52556000D01*
X122406000Y-52556000D02*
X126006000Y-52556000D01*
X126006000Y-52556000D02*
X126006000Y-81556000D01*
X126006000Y-81556000D02*
X122406000Y-81556000D01*
X122385000Y-53600000D02*
X122385000Y-50000000D01*
X122385000Y-50000000D02*
X125985000Y-50000000D01*
X125985000Y-50000000D02*
X125985000Y-53600000D01*
X125985000Y-53600000D02*
X122385000Y-53600000D01*
M02*
