EESchema Schematic File Version 4
EELAYER 30 0
EELAYER END
$Descr A4 11693 8268
encoding utf-8
Sheet 1 1
Title "Generic - Energy Harvester"
Date ""
Rev "1.0"
Comp "ICFOSS"
Comment1 "Sooraj V S"
Comment2 "Open Hardware"
Comment3 ""
Comment4 ""
$EndDescr
$Comp
L Connector:TestPoint TP1
U 1 1 6100C553
P 5500 1700
F 0 "TP1" V 5550 1650 50  0000 L CNN
F 1 "TestPoint" H 5558 1727 50  0001 L CNN
F 2 "TestPoint:TestPoint_Pad_D2.0mm" H 5700 1700 50  0001 C CNN
F 3 "~" H 5700 1700 50  0001 C CNN
	1    5500 1700
	1    0    0    -1  
$EndComp
Text Label 5250 2000 1    50   ~ 0
VDD
$Comp
L Connector:TestPoint TP3
U 1 1 610A2920
P 6000 1700
F 0 "TP3" V 6050 1800 50  0000 R CNN
F 1 "TestPoint" H 6058 1727 50  0001 L CNN
F 2 "TestPoint:TestPoint_Pad_D2.0mm" H 6200 1700 50  0001 C CNN
F 3 "~" H 6200 1700 50  0001 C CNN
	1    6000 1700
	1    0    0    -1  
$EndComp
Text Label 5500 1850 3    50   ~ 0
VCC
$Comp
L Connector:TestPoint TP2
U 1 1 610DE5BE
P 5750 1700
F 0 "TP2" V 5800 1800 50  0000 R CNN
F 1 "TestPoint" H 5808 1727 50  0001 L CNN
F 2 "TestPoint:TestPoint_Pad_D2.0mm" H 5950 1700 50  0001 C CNN
F 3 "~" H 5950 1700 50  0001 C CNN
	1    5750 1700
	1    0    0    -1  
$EndComp
Text Label 6000 2000 1    50   ~ 0
BM_OUT
$Comp
L ULPLoRa-rescue:Q_PMOS_GSD Q1
U 1 1 610EA87C
P 4050 1650
F 0 "Q1" H 4256 1696 50  0000 L CNN
F 1 "Q_PMOS_GSD" H 4256 1605 50  0000 L CNN
F 2 "Package_TO_SOT_SMD:SOT-23" H 4250 1750 50  0001 C CNN
F 3 "" H 4050 1650 50  0001 C CNN
	1    4050 1650
	1    0    0    -1  
$EndComp
Wire Wire Line
	4150 1450 4150 1300
Wire Wire Line
	4150 1850 4150 2000
Wire Wire Line
	3850 1650 3800 1650
Wire Wire Line
	3800 1650 3800 2000
$Comp
L power:GND #PWR01
U 1 1 610FE2F8
P 3800 2000
F 0 "#PWR01" H 3800 1750 50  0001 C CNN
F 1 "GND" H 3805 1827 50  0000 C CNN
F 2 "" H 3800 2000 50  0001 C CNN
F 3 "" H 3800 2000 50  0001 C CNN
	1    3800 2000
	1    0    0    -1  
$EndComp
Text Label 4150 2000 0    50   ~ 0
VDD
Text Label 4150 1300 0    50   ~ 0
VIN
Text Label 6250 1850 3    50   ~ 0
VIN
Text Notes 3600 1100 0    50   ~ 0
REVERSE POLARITY PROTECTION
Text Notes 5700 1100 0    50   ~ 0
TEST POINTS
Wire Notes Line
	5000 950  5000 2400
Wire Notes Line
	3350 950  3350 2400
Wire Notes Line
	6900 2400 6900 950 
Text Notes 7500 1100 0    50   ~ 0
CONNECTORS
$Comp
L Connector:Conn_01x02_Male J1
U 1 1 6192E792
P 7200 1550
F 0 "J1" H 7150 1500 50  0000 C CNN
F 1 "Conn_01x02_Male" H 7400 1400 50  0001 C CNN
F 2 "Connector_PinHeader_2.54mm:PinHeader_1x02_P2.54mm_Vertical" H 7200 1550 50  0001 C CNN
F 3 "~" H 7200 1550 50  0001 C CNN
	1    7200 1550
	1    0    0    -1  
$EndComp
Text Label 7650 1550 2    50   ~ 0
VIN
Text Label 7650 1650 2    50   ~ 0
GND
$Comp
L Connector:Conn_01x02_Male J3
U 1 1 619544EA
P 7900 1550
F 0 "J3" H 7850 1500 50  0000 C CNN
F 1 "Conn_01x02_Male" H 8050 1400 50  0001 C CNN
F 2 "Connector_PinHeader_2.54mm:PinHeader_1x02_P2.54mm_Vertical" H 7900 1550 50  0001 C CNN
F 3 "~" H 7900 1550 50  0001 C CNN
	1    7900 1550
	1    0    0    -1  
$EndComp
Text Label 8350 1550 2    50   ~ 0
BAT_IN
Text Label 8350 1650 2    50   ~ 0
GND
$Comp
L Connector:Conn_01x02_Male J4
U 1 1 6196B9E0
P 7900 1850
F 0 "J4" H 7850 1800 50  0000 C CNN
F 1 "Conn_01x02_Male" H 8050 1700 50  0001 C CNN
F 2 "Connector_PinHeader_2.54mm:PinHeader_1x02_P2.54mm_Vertical" H 7900 1850 50  0001 C CNN
F 3 "~" H 7900 1850 50  0001 C CNN
	1    7900 1850
	1    0    0    -1  
$EndComp
Text Label 8350 1850 2    50   ~ 0
VCC
Text Label 8350 1950 2    50   ~ 0
GND
Wire Notes Line
	8500 950  8500 2400
$Comp
L Connector:Conn_01x02_Male J2
U 1 1 619ABAAA
P 7200 1850
F 0 "J2" H 7150 1800 50  0000 C CNN
F 1 "Conn_01x02_Male" H 7350 1700 50  0001 C CNN
F 2 "Connector_PinHeader_2.54mm:PinHeader_1x02_P2.54mm_Vertical" H 7200 1850 50  0001 C CNN
F 3 "~" H 7200 1850 50  0001 C CNN
	1    7200 1850
	1    0    0    -1  
$EndComp
Text Label 7650 1850 2    50   ~ 0
BM_OUT
Text Label 7650 1950 2    50   ~ 0
VDD
Text Notes 4300 1300 0    50   ~ 0
(0-5.5V)
$Comp
L Connector:TestPoint TP4
U 1 1 619EA503
P 6250 1700
F 0 "TP4" V 6300 1800 50  0000 R CNN
F 1 "TestPoint" H 6308 1727 50  0001 L CNN
F 2 "TestPoint:TestPoint_Pad_D2.0mm" H 6450 1700 50  0001 C CNN
F 3 "~" H 6450 1700 50  0001 C CNN
	1    6250 1700
	1    0    0    -1  
$EndComp
Text Label 5750 1750 3    50   ~ 0
BAT_IN
Wire Notes Line
	3350 950  8500 950 
Wire Notes Line
	3350 1150 8500 1150
Wire Notes Line
	3350 2400 8500 2400
$Comp
L power:PWR_FLAG #FLG0101
U 1 1 61AF1812
P 5250 1650
F 0 "#FLG0101" H 5250 1725 50  0001 C CNN
F 1 "PWR_FLAG" H 5250 1823 50  0000 C CNN
F 2 "" H 5250 1650 50  0001 C CNN
F 3 "~" H 5250 1650 50  0001 C CNN
	1    5250 1650
	1    0    0    -1  
$EndComp
$Comp
L power:+3V3 #PWR0101
U 1 1 61B414EE
P 6500 1650
F 0 "#PWR0101" H 6500 1500 50  0001 C CNN
F 1 "+3V3" H 6515 1823 50  0000 C CNN
F 2 "" H 6500 1650 50  0001 C CNN
F 3 "" H 6500 1650 50  0001 C CNN
	1    6500 1650
	1    0    0    -1  
$EndComp
Wire Wire Line
	5750 1700 5750 2000
Wire Wire Line
	6000 1700 6000 2000
Text Label 6500 2000 1    50   ~ 0
VCC
Wire Wire Line
	6250 1700 6250 2000
Wire Wire Line
	6500 1650 6500 2000
Wire Wire Line
	5250 1650 5250 2000
Wire Wire Line
	5500 1700 5500 2000
Wire Wire Line
	7400 1550 7650 1550
Wire Wire Line
	7400 1650 7650 1650
Wire Wire Line
	7400 1850 7650 1850
Wire Wire Line
	7400 1950 7650 1950
Wire Wire Line
	8100 1550 8350 1550
Wire Wire Line
	8100 1650 8350 1650
Wire Wire Line
	8100 1850 8350 1850
Wire Wire Line
	8100 1950 8350 1950
Text Label 3800 1850 1    50   ~ 0
GND
Wire Wire Line
	6250 3350 6050 3350
Connection ~ 5350 3350
$Comp
L Device:R_Small_US R2
U 1 1 610495A0
P 7800 4700
F 0 "R2" H 7650 4750 50  0000 L CNN
F 1 "0Ω" H 7650 4650 50  0000 L CNN
F 2 "Resistor_SMD:R_0402_1005Metric" H 7800 4700 50  0001 C CNN
F 3 "~" H 7800 4700 50  0001 C CNN
	1    7800 4700
	-1   0    0    1   
$EndComp
Wire Wire Line
	3900 4450 3900 4350
$Comp
L Device:C_Small C1
U 1 1 6100FEA7
P 3550 3950
F 0 "C1" H 3642 3996 50  0000 L CNN
F 1 "10uF/10V" H 3642 3905 50  0000 L CNN
F 2 "Capacitor_SMD:C_0805_2012Metric" H 3550 3950 50  0001 C CNN
F 3 "~" H 3550 3950 50  0001 C CNN
	1    3550 3950
	-1   0    0    1   
$EndComp
Text Label 3550 3450 0    50   ~ 0
VDD
$Comp
L pspice:INDUCTOR L1
U 1 1 61016624
P 4250 3350
F 0 "L1" H 4250 3565 50  0000 C CNN
F 1 "22uH" H 4250 3474 50  0000 C CNN
F 2 "Inductor_SMD:L_0805_2012Metric" H 4250 3350 50  0001 C CNN
F 3 "~" H 4250 3350 50  0001 C CNN
	1    4250 3350
	1    0    0    -1  
$EndComp
Wire Wire Line
	3900 3600 3900 3550
Wire Wire Line
	4000 3600 4000 3550
Wire Wire Line
	3900 3550 4000 3550
Wire Wire Line
	4100 3600 4100 3450
Wire Wire Line
	3950 3450 3950 3350
Wire Wire Line
	3950 3350 4000 3350
Wire Wire Line
	4600 3350 4600 3450
Wire Wire Line
	4600 3450 4400 3450
Wire Wire Line
	4400 3450 4400 3600
Wire Wire Line
	4200 3600 4200 3450
Wire Wire Line
	3950 3450 4100 3450
Connection ~ 4100 3450
Wire Wire Line
	4100 3450 4200 3450
Wire Wire Line
	4300 3600 4300 3550
Wire Wire Line
	4300 3550 4700 3550
Wire Wire Line
	4700 3550 4700 4000
Wire Wire Line
	4700 4450 3900 4450
Connection ~ 3900 4450
$Comp
L power:GND #PWR04
U 1 1 6102C7AE
P 3900 4550
F 0 "#PWR04" H 3900 4300 50  0001 C CNN
F 1 "GND" H 3905 4377 50  0000 C CNN
F 2 "" H 3900 4550 50  0001 C CNN
F 3 "" H 3900 4550 50  0001 C CNN
	1    3900 4550
	1    0    0    -1  
$EndComp
Wire Wire Line
	3900 4450 3900 4550
Wire Wire Line
	4500 3350 4600 3350
Wire Wire Line
	3900 3550 3550 3550
Wire Wire Line
	3550 3550 3550 3850
Connection ~ 3900 3550
Wire Wire Line
	3550 4050 3550 4450
Wire Wire Line
	3550 4450 3900 4450
Wire Wire Line
	3550 3550 3550 3350
Connection ~ 3550 3550
Connection ~ 4700 4000
Wire Wire Line
	4700 4000 4700 4450
$Comp
L Device:C_Small C2
U 1 1 6177B8B4
P 4950 3800
F 0 "C2" H 5042 3846 50  0000 L CNN
F 1 "47uF/6.3V" H 4950 3700 50  0000 L CNN
F 2 "Capacitor_SMD:C_1210_3225Metric" H 4950 3800 50  0001 C CNN
F 3 "~" H 4950 3800 50  0001 C CNN
	1    4950 3800
	1    0    0    -1  
$EndComp
Wire Wire Line
	4700 4000 4950 4000
Wire Wire Line
	4950 4000 4950 3900
Wire Wire Line
	4950 3700 4950 3350
Connection ~ 4600 3350
$Comp
L EH-GENERIC_BOARD-rescue:R1800K022A-R1800K022A U1
U 1 1 6178E1E9
P 4250 3900
F 0 "U1" V 4400 3500 50  0000 L CNN
F 1 "R1800K022A" H 3950 4400 50  0000 L CNN
F 2 "R1800K022A:R1800K-DFN" H 4200 3600 50  0001 C CNN
F 3 "" H 4200 3600 50  0001 C CNN
	1    4250 3900
	0    -1   -1   0   
$EndComp
Wire Wire Line
	4600 4000 4700 4000
Wire Wire Line
	4600 3350 4950 3350
Connection ~ 4950 3350
Wire Wire Line
	4950 3350 5350 3350
Text Notes 8450 3450 0    50   ~ 0
(3.3V)
Text Notes 5250 3300 0    50   ~ 0
(2.8V)
Text Label 5350 3550 0    50   ~ 0
BAT_IN
Wire Wire Line
	5350 3350 5350 3650
Wire Wire Line
	5350 4550 5350 3950
$Comp
L Jumper:SolderJumper_2_Bridged JP1
U 1 1 618346BD
P 6400 3350
F 0 "JP1" H 6400 3555 50  0000 C CNN
F 1 " " H 6400 3464 50  0000 C CNN
F 2 "Jumper:SolderJumper-2_P1.3mm_Bridged_RoundedPad1.0x1.5mm" H 6400 3350 50  0001 C CNN
F 3 "~" H 6400 3350 50  0001 C CNN
	1    6400 3350
	1    0    0    -1  
$EndComp
$Comp
L power:GND #PWR08
U 1 1 610D49EF
P 8100 4850
F 0 "#PWR08" H 8100 4600 50  0001 C CNN
F 1 "GND" H 8105 4677 50  0000 C CNN
F 2 "" H 8100 4850 50  0001 C CNN
F 3 "" H 8100 4850 50  0001 C CNN
	1    8100 4850
	1    0    0    -1  
$EndComp
Text Label 8650 3350 2    50   ~ 0
VCC
$Comp
L Device:R_Small_US R1
U 1 1 6104571B
P 7300 4700
F 0 "R1" H 7350 4750 50  0000 L CNN
F 1 "0Ω" H 7350 4650 50  0000 L CNN
F 2 "Resistor_SMD:R_0402_1005Metric" H 7300 4700 50  0001 C CNN
F 3 "~" H 7300 4700 50  0001 C CNN
	1    7300 4700
	-1   0    0    1   
$EndComp
$Comp
L pspice:INDUCTOR L2
U 1 1 610324D7
P 7550 3350
F 0 "L2" H 7550 3565 50  0000 C CNN
F 1 "2.2uH" H 7550 3474 50  0000 C CNN
F 2 "Inductor_SMD:L_1008_2520Metric" H 7550 3350 50  0001 C CNN
F 3 "~" H 7550 3350 50  0001 C CNN
	1    7550 3350
	1    0    0    -1  
$EndComp
$Comp
L power:GND #PWR06
U 1 1 617C1D1E
P 6050 4550
F 0 "#PWR06" H 6050 4300 50  0001 C CNN
F 1 "GND" H 6055 4377 50  0000 C CNN
F 2 "" H 6050 4550 50  0001 C CNN
F 3 "" H 6050 4550 50  0001 C CNN
	1    6050 4550
	1    0    0    -1  
$EndComp
Wire Wire Line
	6050 3900 6050 4550
Wire Wire Line
	6050 3700 6050 3350
$Comp
L Device:C_Small C3
U 1 1 617B5A1C
P 6050 3800
F 0 "C3" H 6142 3846 50  0000 L CNN
F 1 "10uF/6.3V" H 6142 3755 50  0000 L CNN
F 2 "Capacitor_SMD:C_1210_3225Metric" H 6050 3800 50  0001 C CNN
F 3 "~" H 6050 3800 50  0001 C CNN
	1    6050 3800
	1    0    0    -1  
$EndComp
$Comp
L power:GND #PWR05
U 1 1 617990FA
P 5350 4550
F 0 "#PWR05" H 5350 4300 50  0001 C CNN
F 1 "GND" H 5355 4377 50  0000 C CNN
F 2 "" H 5350 4550 50  0001 C CNN
F 3 "" H 5350 4550 50  0001 C CNN
	1    5350 4550
	1    0    0    -1  
$EndComp
$Comp
L Device:Battery_Cell BT1
U 1 1 6178520C
P 5350 3850
F 0 "BT1" H 5468 3946 50  0000 L CNN
F 1 "SLB08115L140" V 5400 3300 50  0000 L CNN
F 2 "SLB08115L140:SLB08115L140" V 5350 3910 50  0001 C CNN
F 3 "~" V 5350 3910 50  0001 C CNN
	1    5350 3850
	1    0    0    -1  
$EndComp
Wire Notes Line
	2850 2800 2850 5400
Wire Notes Line
	2850 5400 9050 5400
Wire Notes Line
	9050 5400 9050 2800
Wire Notes Line
	2850 2800 9050 2800
Text Label 5750 3550 0    50   ~ 0
BAT_IN
Wire Wire Line
	5750 3350 5750 3650
Wire Wire Line
	5750 4550 5750 3950
$Comp
L power:GND #PWR02
U 1 1 61823283
P 5750 4550
F 0 "#PWR02" H 5750 4300 50  0001 C CNN
F 1 "GND" H 5755 4377 50  0000 C CNN
F 2 "" H 5750 4550 50  0001 C CNN
F 3 "" H 5750 4550 50  0001 C CNN
	1    5750 4550
	1    0    0    -1  
$EndComp
$Comp
L Device:Battery_Cell BT2
U 1 1 61823289
P 5750 3850
F 0 "BT2" H 5868 3946 50  0000 L CNN
F 1 "SLB08115L140" V 5800 3300 50  0000 L CNN
F 2 "SLB08115L140:SLB08115L140" V 5750 3910 50  0001 C CNN
F 3 "~" V 5750 3910 50  0001 C CNN
	1    5750 3850
	1    0    0    -1  
$EndComp
Wire Wire Line
	5350 3350 5750 3350
Connection ~ 6050 3350
Connection ~ 5750 3350
Wire Wire Line
	5750 3350 6050 3350
Text Label 8050 4500 3    50   ~ 0
BM_OUT
$Comp
L power:GND #PWR03
U 1 1 6185585C
P 8400 3800
F 0 "#PWR03" H 8400 3550 50  0001 C CNN
F 1 "GND" H 8405 3627 50  0000 C CNN
F 2 "" H 8400 3800 50  0001 C CNN
F 3 "" H 8400 3800 50  0001 C CNN
	1    8400 3800
	1    0    0    -1  
$EndComp
$Comp
L Device:C_Small C4
U 1 1 610CA1FC
P 8100 4700
F 0 "C4" H 8192 4746 50  0000 L CNN
F 1 "0.1uF/10V" V 8400 4500 50  0000 L CNN
F 2 "Capacitor_SMD:C_0402_1005Metric" H 8100 4700 50  0001 C CNN
F 3 "~" H 8100 4700 50  0001 C CNN
	1    8100 4700
	1    0    0    -1  
$EndComp
Wire Wire Line
	7100 3350 7100 3450
Wire Wire Line
	7100 3450 7200 3450
Wire Wire Line
	7200 3450 7200 3550
Connection ~ 7100 3450
Wire Wire Line
	7100 3450 7100 3550
Wire Wire Line
	8000 3550 8000 3450
Wire Wire Line
	7900 3550 7900 3450
Wire Wire Line
	7900 3450 8000 3450
Connection ~ 8000 3450
Wire Wire Line
	8000 3450 8000 3350
$Comp
L Device:C_Small C5
U 1 1 6107C56D
P 8400 3550
F 0 "C5" H 8492 3596 50  0000 L CNN
F 1 "22uF/16V" H 8492 3505 50  0000 L CNN
F 2 "Capacitor_SMD:C_1210_3225Metric" H 8400 3550 50  0001 C CNN
F 3 "~" H 8400 3550 50  0001 C CNN
	1    8400 3550
	1    0    0    -1  
$EndComp
Wire Wire Line
	7800 3350 7800 3450
Wire Wire Line
	7300 3350 7300 3450
Wire Wire Line
	7400 3550 7400 3450
Wire Wire Line
	7400 3450 7300 3450
Connection ~ 7300 3450
Wire Wire Line
	7300 3450 7300 3550
Wire Wire Line
	7500 3550 7500 3450
Wire Wire Line
	7500 3450 7400 3450
Connection ~ 7400 3450
Wire Wire Line
	7700 3550 7700 3450
Wire Wire Line
	7700 3450 7800 3450
Connection ~ 7800 3450
Wire Wire Line
	7800 3450 7800 3550
Wire Wire Line
	7600 3550 7600 3450
Wire Wire Line
	7600 3450 7700 3450
Connection ~ 7700 3450
Wire Wire Line
	7100 4350 7100 4500
Wire Wire Line
	7100 4500 7200 4500
Wire Wire Line
	7200 4500 7200 4350
Wire Wire Line
	6550 3350 6750 3350
Wire Wire Line
	7100 4500 6750 4500
Wire Wire Line
	6750 4500 6750 3350
Connection ~ 7100 4500
Connection ~ 6750 3350
Wire Wire Line
	6750 3350 7100 3350
Wire Wire Line
	7400 4350 7400 4500
Wire Wire Line
	7400 4500 7500 4500
Wire Wire Line
	7700 4500 7700 4350
Wire Wire Line
	7600 4350 7600 4500
Connection ~ 7600 4500
Wire Wire Line
	7600 4500 7700 4500
Wire Wire Line
	7500 4350 7500 4500
Connection ~ 7500 4500
Wire Wire Line
	7500 4500 7550 4500
Wire Wire Line
	7900 4350 7900 4500
Wire Wire Line
	7900 4500 8100 4500
Wire Wire Line
	7300 4350 7300 4600
Wire Wire Line
	7800 4350 7800 4600
Wire Wire Line
	6750 4500 6750 4950
Wire Wire Line
	6750 4950 7300 4950
Wire Wire Line
	7800 4950 7800 4800
Connection ~ 6750 4500
Wire Wire Line
	7300 4800 7300 4950
Connection ~ 7300 4950
Wire Wire Line
	7300 4950 7800 4950
$Comp
L power:GND #PWR07
U 1 1 618C2345
P 7550 4650
F 0 "#PWR07" H 7550 4400 50  0001 C CNN
F 1 "GND" H 7555 4477 50  0000 C CNN
F 2 "" H 7550 4650 50  0001 C CNN
F 3 "" H 7550 4650 50  0001 C CNN
	1    7550 4650
	1    0    0    -1  
$EndComp
Wire Wire Line
	7550 4500 7550 4650
Connection ~ 7550 4500
Wire Wire Line
	7550 4500 7600 4500
Wire Wire Line
	8000 4350 8000 4450
Wire Wire Line
	8000 4450 8200 4450
Wire Wire Line
	8200 4450 8200 3350
Wire Wire Line
	8200 3350 8000 3350
Wire Wire Line
	8100 4500 8100 4600
Wire Wire Line
	8100 4800 8100 4850
Wire Wire Line
	8200 3350 8400 3350
Connection ~ 8200 3350
Wire Wire Line
	8400 3350 8400 3450
Wire Wire Line
	8400 3650 8400 3800
Wire Wire Line
	8400 3350 8650 3350
Connection ~ 8400 3350
$Comp
L RP605:RP605Z334A U2
U 1 1 619102ED
P 7350 4450
F 0 "U2" V 7896 3672 50  0000 R CNN
F 1 "RP605Z334A" V 7805 3672 50  0000 R CNN
F 2 "RP605Z:WLCSP-20_2.315X1.71mm_Layout5x4_P0.4mm" H 7850 3550 50  0001 C CNN
F 3 "" H 7850 3550 50  0001 C CNN
	1    7350 4450
	0    -1   -1   0   
$EndComp
$EndSCHEMATC
