%TF.GenerationSoftware,KiCad,Pcbnew,5.1.7-a382d34a88~90~ubuntu20.04.1*%
%TF.CreationDate,2021-10-28T14:58:43+05:30*%
%TF.ProjectId,EH-GENERIC_BOARD,45482d47-454e-4455-9249-435f424f4152,rev?*%
%TF.SameCoordinates,Original*%
%TF.FileFunction,Legend,Top*%
%TF.FilePolarity,Positive*%
%FSLAX46Y46*%
G04 Gerber Fmt 4.6, Leading zero omitted, Abs format (unit mm)*
G04 Created by KiCad (PCBNEW 5.1.7-a382d34a88~90~ubuntu20.04.1) date 2021-10-28 14:58:43*
%MOMM*%
%LPD*%
G01*
G04 APERTURE LIST*
%ADD10C,0.150000*%
%ADD11C,0.120000*%
%ADD12C,0.100000*%
%ADD13C,0.050000*%
G04 APERTURE END LIST*
D10*
X114140500Y-71450133D02*
X114107166Y-71516800D01*
X114107166Y-71616800D01*
X114140500Y-71716800D01*
X114207166Y-71783466D01*
X114273833Y-71816800D01*
X114407166Y-71850133D01*
X114507166Y-71850133D01*
X114640500Y-71816800D01*
X114707166Y-71783466D01*
X114773833Y-71716800D01*
X114807166Y-71616800D01*
X114807166Y-71550133D01*
X114773833Y-71450133D01*
X114740500Y-71416800D01*
X114507166Y-71416800D01*
X114507166Y-71550133D01*
X114807166Y-71116800D02*
X114107166Y-71116800D01*
X114807166Y-70716800D01*
X114107166Y-70716800D01*
X114807166Y-70383466D02*
X114107166Y-70383466D01*
X114107166Y-70216800D01*
X114140500Y-70116800D01*
X114207166Y-70050133D01*
X114273833Y-70016800D01*
X114407166Y-69983466D01*
X114507166Y-69983466D01*
X114640500Y-70016800D01*
X114707166Y-70050133D01*
X114773833Y-70116800D01*
X114807166Y-70216800D01*
X114807166Y-70383466D01*
X98225833Y-78880500D02*
X98325833Y-78913833D01*
X98359166Y-78947166D01*
X98392500Y-79013833D01*
X98392500Y-79113833D01*
X98359166Y-79180500D01*
X98325833Y-79213833D01*
X98259166Y-79247166D01*
X97992500Y-79247166D01*
X97992500Y-78547166D01*
X98225833Y-78547166D01*
X98292500Y-78580500D01*
X98325833Y-78613833D01*
X98359166Y-78680500D01*
X98359166Y-78747166D01*
X98325833Y-78813833D01*
X98292500Y-78847166D01*
X98225833Y-78880500D01*
X97992500Y-78880500D01*
X98659166Y-79047166D02*
X98992500Y-79047166D01*
X98592500Y-79247166D02*
X98825833Y-78547166D01*
X99059166Y-79247166D01*
X99192500Y-78547166D02*
X99592500Y-78547166D01*
X99392500Y-79247166D02*
X99392500Y-78547166D01*
X95732666Y-78580500D02*
X95666000Y-78547166D01*
X95566000Y-78547166D01*
X95466000Y-78580500D01*
X95399333Y-78647166D01*
X95366000Y-78713833D01*
X95332666Y-78847166D01*
X95332666Y-78947166D01*
X95366000Y-79080500D01*
X95399333Y-79147166D01*
X95466000Y-79213833D01*
X95566000Y-79247166D01*
X95632666Y-79247166D01*
X95732666Y-79213833D01*
X95766000Y-79180500D01*
X95766000Y-78947166D01*
X95632666Y-78947166D01*
X96066000Y-79247166D02*
X96066000Y-78547166D01*
X96466000Y-79247166D01*
X96466000Y-78547166D01*
X96799333Y-79247166D02*
X96799333Y-78547166D01*
X96966000Y-78547166D01*
X97066000Y-78580500D01*
X97132666Y-78647166D01*
X97166000Y-78713833D01*
X97199333Y-78847166D01*
X97199333Y-78947166D01*
X97166000Y-79080500D01*
X97132666Y-79147166D01*
X97066000Y-79213833D01*
X96966000Y-79247166D01*
X96799333Y-79247166D01*
X98406833Y-58751000D02*
X98506833Y-58784333D01*
X98540166Y-58817666D01*
X98573500Y-58884333D01*
X98573500Y-58984333D01*
X98540166Y-59051000D01*
X98506833Y-59084333D01*
X98440166Y-59117666D01*
X98173500Y-59117666D01*
X98173500Y-58417666D01*
X98406833Y-58417666D01*
X98473500Y-58451000D01*
X98506833Y-58484333D01*
X98540166Y-58551000D01*
X98540166Y-58617666D01*
X98506833Y-58684333D01*
X98473500Y-58717666D01*
X98406833Y-58751000D01*
X98173500Y-58751000D01*
X98873500Y-59117666D02*
X98873500Y-58417666D01*
X99106833Y-58917666D01*
X99340166Y-58417666D01*
X99340166Y-59117666D01*
X99806833Y-58417666D02*
X99940166Y-58417666D01*
X100006833Y-58451000D01*
X100073500Y-58517666D01*
X100106833Y-58651000D01*
X100106833Y-58884333D01*
X100073500Y-59017666D01*
X100006833Y-59084333D01*
X99940166Y-59117666D01*
X99806833Y-59117666D01*
X99740166Y-59084333D01*
X99673500Y-59017666D01*
X99640166Y-58884333D01*
X99640166Y-58651000D01*
X99673500Y-58517666D01*
X99740166Y-58451000D01*
X99806833Y-58417666D01*
X95650166Y-58417666D02*
X95883500Y-59117666D01*
X96116833Y-58417666D01*
X96350166Y-59117666D02*
X96350166Y-58417666D01*
X96516833Y-58417666D01*
X96616833Y-58451000D01*
X96683500Y-58517666D01*
X96716833Y-58584333D01*
X96750166Y-58717666D01*
X96750166Y-58817666D01*
X96716833Y-58951000D01*
X96683500Y-59017666D01*
X96616833Y-59084333D01*
X96516833Y-59117666D01*
X96350166Y-59117666D01*
X97050166Y-59117666D02*
X97050166Y-58417666D01*
X97216833Y-58417666D01*
X97316833Y-58451000D01*
X97383500Y-58517666D01*
X97416833Y-58584333D01*
X97450166Y-58717666D01*
X97450166Y-58817666D01*
X97416833Y-58951000D01*
X97383500Y-59017666D01*
X97316833Y-59084333D01*
X97216833Y-59117666D01*
X97050166Y-59117666D01*
X80918800Y-70078666D02*
X80952133Y-70012000D01*
X80952133Y-69912000D01*
X80918800Y-69812000D01*
X80852133Y-69745333D01*
X80785466Y-69712000D01*
X80652133Y-69678666D01*
X80552133Y-69678666D01*
X80418800Y-69712000D01*
X80352133Y-69745333D01*
X80285466Y-69812000D01*
X80252133Y-69912000D01*
X80252133Y-69978666D01*
X80285466Y-70078666D01*
X80318800Y-70112000D01*
X80552133Y-70112000D01*
X80552133Y-69978666D01*
X80252133Y-70412000D02*
X80952133Y-70412000D01*
X80252133Y-70812000D01*
X80952133Y-70812000D01*
X80252133Y-71145333D02*
X80952133Y-71145333D01*
X80952133Y-71312000D01*
X80918800Y-71412000D01*
X80852133Y-71478666D01*
X80785466Y-71512000D01*
X80652133Y-71545333D01*
X80552133Y-71545333D01*
X80418800Y-71512000D01*
X80352133Y-71478666D01*
X80285466Y-71412000D01*
X80252133Y-71312000D01*
X80252133Y-71145333D01*
X80952133Y-67406933D02*
X80252133Y-67640266D01*
X80952133Y-67873600D01*
X80252133Y-68106933D02*
X80952133Y-68106933D01*
X80252133Y-68440266D02*
X80952133Y-68440266D01*
X80252133Y-68840266D01*
X80952133Y-68840266D01*
D11*
%TO.C,BAT2*%
X101790000Y-73660000D02*
G75*
G03*
X101790000Y-73660000I-4000000J0D01*
G01*
%TO.C,L1*%
X86816000Y-68725622D02*
X86816000Y-67926378D01*
X87936000Y-68725622D02*
X87936000Y-67926378D01*
%TO.C,C1*%
X87117248Y-72480500D02*
X87639752Y-72480500D01*
X87117248Y-73950500D02*
X87639752Y-73950500D01*
%TO.C,C2*%
X88237748Y-60997000D02*
X89660252Y-60997000D01*
X88237748Y-63717000D02*
X89660252Y-63717000D01*
%TO.C,C3*%
X88188748Y-56298000D02*
X89611252Y-56298000D01*
X88188748Y-59018000D02*
X89611252Y-59018000D01*
%TO.C,C4*%
X107461164Y-73681000D02*
X107676836Y-73681000D01*
X107461164Y-74401000D02*
X107676836Y-74401000D01*
%TO.C,C5*%
X105613252Y-59600000D02*
X104190748Y-59600000D01*
X105613252Y-62320000D02*
X104190748Y-62320000D01*
%TO.C,J1*%
X81220000Y-66742000D02*
X82550000Y-66742000D01*
X81220000Y-68072000D02*
X81220000Y-66742000D01*
X81220000Y-69342000D02*
X83880000Y-69342000D01*
X83880000Y-69342000D02*
X83880000Y-71942000D01*
X81220000Y-69342000D02*
X81220000Y-71942000D01*
X81220000Y-71942000D02*
X83880000Y-71942000D01*
%TO.C,J2*%
X95190000Y-55058000D02*
X95190000Y-57718000D01*
X97790000Y-55058000D02*
X95190000Y-55058000D01*
X97790000Y-57718000D02*
X95190000Y-57718000D01*
X97790000Y-55058000D02*
X97790000Y-57718000D01*
X99060000Y-55058000D02*
X100390000Y-55058000D01*
X100390000Y-55058000D02*
X100390000Y-56388000D01*
%TO.C,J3*%
X94936000Y-79950000D02*
X94936000Y-82610000D01*
X97536000Y-79950000D02*
X94936000Y-79950000D01*
X97536000Y-82610000D02*
X94936000Y-82610000D01*
X97536000Y-79950000D02*
X97536000Y-82610000D01*
X98806000Y-79950000D02*
X100136000Y-79950000D01*
X100136000Y-79950000D02*
X100136000Y-81280000D01*
%TO.C,J4*%
X111192000Y-66996000D02*
X112522000Y-66996000D01*
X111192000Y-68326000D02*
X111192000Y-66996000D01*
X111192000Y-69596000D02*
X113852000Y-69596000D01*
X113852000Y-69596000D02*
X113852000Y-72196000D01*
X111192000Y-69596000D02*
X111192000Y-72196000D01*
X111192000Y-72196000D02*
X113852000Y-72196000D01*
%TO.C,JP*%
X101089000Y-69388000D02*
X101089000Y-68788000D01*
X103189000Y-70088000D02*
X101789000Y-70088000D01*
X103889000Y-68788000D02*
X103889000Y-69388000D01*
X101789000Y-68088000D02*
X103189000Y-68088000D01*
X103189000Y-68088000D02*
G75*
G02*
X103889000Y-68788000I0J-700000D01*
G01*
X103889000Y-69388000D02*
G75*
G02*
X103189000Y-70088000I-700000J0D01*
G01*
X101789000Y-70088000D02*
G75*
G02*
X101089000Y-69388000I0J700000D01*
G01*
X101089000Y-68788000D02*
G75*
G02*
X101789000Y-68088000I700000J0D01*
G01*
%TO.C,L2*%
X103474500Y-65788752D02*
X103474500Y-65266248D01*
X105694500Y-65788752D02*
X105694500Y-65266248D01*
%TO.C,Q1*%
X88956000Y-77218000D02*
X88026000Y-77218000D01*
X85796000Y-77218000D02*
X86726000Y-77218000D01*
X85796000Y-77218000D02*
X85796000Y-79378000D01*
X88956000Y-77218000D02*
X88956000Y-78678000D01*
%TO.C,R1*%
X103289859Y-72962500D02*
X103597141Y-72962500D01*
X103289859Y-73722500D02*
X103597141Y-73722500D01*
%TO.C,R2*%
X103285859Y-75056000D02*
X103593141Y-75056000D01*
X103285859Y-74296000D02*
X103593141Y-74296000D01*
%TO.C,BAT_IN*%
X106864000Y-81280000D02*
G75*
G03*
X106864000Y-81280000I-1200000J0D01*
G01*
%TO.C,BMO*%
X106864000Y-56388000D02*
G75*
G03*
X106864000Y-56388000I-1200000J0D01*
G01*
%TO.C,VIN*%
X83750000Y-62738000D02*
G75*
G03*
X83750000Y-62738000I-1200000J0D01*
G01*
%TO.C,BAT1*%
X101790000Y-64516000D02*
G75*
G03*
X101790000Y-64516000I-4000000J0D01*
G01*
%TO.C,3V3*%
X113722000Y-62738000D02*
G75*
G03*
X113722000Y-62738000I-1200000J0D01*
G01*
D12*
%TO.C,U1*%
X93023500Y-70006000D02*
G75*
G03*
X93023500Y-70006000I-100000J0D01*
G01*
D13*
X93373500Y-70256000D02*
X93673500Y-69906000D01*
X90173500Y-70256000D02*
X93373500Y-70256000D01*
X93673500Y-66506000D02*
X93673500Y-69906000D01*
X90173500Y-66506000D02*
X90173500Y-70256000D01*
X93673500Y-66506000D02*
X90173500Y-66506000D01*
%TO.C,U2*%
X109262000Y-71385000D02*
X109262000Y-67885000D01*
X109262000Y-67885000D02*
X105512000Y-67885000D01*
X109262000Y-71385000D02*
X105862000Y-71385000D01*
X105512000Y-67885000D02*
X105512000Y-71085000D01*
X105512000Y-71085000D02*
X105862000Y-71385000D01*
D12*
X105862000Y-70635000D02*
G75*
G03*
X105862000Y-70635000I-100000J0D01*
G01*
%TO.C,*%
D10*
X114069066Y-69167266D02*
X114069066Y-68733933D01*
X114335733Y-68967266D01*
X114335733Y-68867266D01*
X114369066Y-68800600D01*
X114402400Y-68767266D01*
X114469066Y-68733933D01*
X114635733Y-68733933D01*
X114702400Y-68767266D01*
X114735733Y-68800600D01*
X114769066Y-68867266D01*
X114769066Y-69067266D01*
X114735733Y-69133933D01*
X114702400Y-69167266D01*
X114069066Y-68533933D02*
X114769066Y-68300600D01*
X114069066Y-68067266D01*
X114069066Y-67900600D02*
X114069066Y-67467266D01*
X114335733Y-67700600D01*
X114335733Y-67600600D01*
X114369066Y-67533933D01*
X114402400Y-67500600D01*
X114469066Y-67467266D01*
X114635733Y-67467266D01*
X114702400Y-67500600D01*
X114735733Y-67533933D01*
X114769066Y-67600600D01*
X114769066Y-67800600D01*
X114735733Y-67867266D01*
X114702400Y-67900600D01*
X225371133Y-121206466D02*
X225804466Y-121206466D01*
X225571133Y-121473133D01*
X225671133Y-121473133D01*
X225737800Y-121506466D01*
X225771133Y-121539800D01*
X225804466Y-121606466D01*
X225804466Y-121773133D01*
X225771133Y-121839800D01*
X225737800Y-121873133D01*
X225671133Y-121906466D01*
X225471133Y-121906466D01*
X225404466Y-121873133D01*
X225371133Y-121839800D01*
X226004466Y-121206466D02*
X226237800Y-121906466D01*
X226471133Y-121206466D01*
X226637800Y-121206466D02*
X227071133Y-121206466D01*
X226837800Y-121473133D01*
X226937800Y-121473133D01*
X227004466Y-121506466D01*
X227037800Y-121539800D01*
X227071133Y-121606466D01*
X227071133Y-121773133D01*
X227037800Y-121839800D01*
X227004466Y-121873133D01*
X226937800Y-121906466D01*
X226737800Y-121906466D01*
X226671133Y-121873133D01*
X226637800Y-121839800D01*
X193256133Y-141118466D02*
X193689466Y-141118466D01*
X193456133Y-141385133D01*
X193556133Y-141385133D01*
X193622800Y-141418466D01*
X193656133Y-141451800D01*
X193689466Y-141518466D01*
X193689466Y-141685133D01*
X193656133Y-141751800D01*
X193622800Y-141785133D01*
X193556133Y-141818466D01*
X193356133Y-141818466D01*
X193289466Y-141785133D01*
X193256133Y-141751800D01*
X193889466Y-141118466D02*
X194122800Y-141818466D01*
X194356133Y-141118466D01*
X194522800Y-141118466D02*
X194956133Y-141118466D01*
X194722800Y-141385133D01*
X194822800Y-141385133D01*
X194889466Y-141418466D01*
X194922800Y-141451800D01*
X194956133Y-141518466D01*
X194956133Y-141685133D01*
X194922800Y-141751800D01*
X194889466Y-141785133D01*
X194822800Y-141818466D01*
X194622800Y-141818466D01*
X194556133Y-141785133D01*
X194522800Y-141751800D01*
%TO.C,BAT2*%
X92558500Y-77229500D02*
X92658500Y-77262833D01*
X92691833Y-77296166D01*
X92725166Y-77362833D01*
X92725166Y-77462833D01*
X92691833Y-77529500D01*
X92658500Y-77562833D01*
X92591833Y-77596166D01*
X92325166Y-77596166D01*
X92325166Y-76896166D01*
X92558500Y-76896166D01*
X92625166Y-76929500D01*
X92658500Y-76962833D01*
X92691833Y-77029500D01*
X92691833Y-77096166D01*
X92658500Y-77162833D01*
X92625166Y-77196166D01*
X92558500Y-77229500D01*
X92325166Y-77229500D01*
X92991833Y-77396166D02*
X93325166Y-77396166D01*
X92925166Y-77596166D02*
X93158500Y-76896166D01*
X93391833Y-77596166D01*
X93525166Y-76896166D02*
X93925166Y-76896166D01*
X93725166Y-77596166D02*
X93725166Y-76896166D01*
X94125166Y-76962833D02*
X94158500Y-76929500D01*
X94225166Y-76896166D01*
X94391833Y-76896166D01*
X94458500Y-76929500D01*
X94491833Y-76962833D01*
X94525166Y-77029500D01*
X94525166Y-77096166D01*
X94491833Y-77196166D01*
X94091833Y-77596166D01*
X94525166Y-77596166D01*
%TO.C,L1*%
X87259333Y-70992166D02*
X86926000Y-70992166D01*
X86926000Y-70292166D01*
X87859333Y-70992166D02*
X87459333Y-70992166D01*
X87659333Y-70992166D02*
X87659333Y-70292166D01*
X87592666Y-70392166D01*
X87526000Y-70458833D01*
X87459333Y-70492166D01*
%TO.C,C1*%
X87259333Y-75180000D02*
X87226000Y-75213333D01*
X87126000Y-75246666D01*
X87059333Y-75246666D01*
X86959333Y-75213333D01*
X86892666Y-75146666D01*
X86859333Y-75080000D01*
X86826000Y-74946666D01*
X86826000Y-74846666D01*
X86859333Y-74713333D01*
X86892666Y-74646666D01*
X86959333Y-74580000D01*
X87059333Y-74546666D01*
X87126000Y-74546666D01*
X87226000Y-74580000D01*
X87259333Y-74613333D01*
X87926000Y-75246666D02*
X87526000Y-75246666D01*
X87726000Y-75246666D02*
X87726000Y-74546666D01*
X87659333Y-74646666D01*
X87592666Y-74713333D01*
X87526000Y-74746666D01*
%TO.C,C2*%
X88832333Y-64893000D02*
X88799000Y-64926333D01*
X88699000Y-64959666D01*
X88632333Y-64959666D01*
X88532333Y-64926333D01*
X88465666Y-64859666D01*
X88432333Y-64793000D01*
X88399000Y-64659666D01*
X88399000Y-64559666D01*
X88432333Y-64426333D01*
X88465666Y-64359666D01*
X88532333Y-64293000D01*
X88632333Y-64259666D01*
X88699000Y-64259666D01*
X88799000Y-64293000D01*
X88832333Y-64326333D01*
X89099000Y-64326333D02*
X89132333Y-64293000D01*
X89199000Y-64259666D01*
X89365666Y-64259666D01*
X89432333Y-64293000D01*
X89465666Y-64326333D01*
X89499000Y-64393000D01*
X89499000Y-64459666D01*
X89465666Y-64559666D01*
X89065666Y-64959666D01*
X89499000Y-64959666D01*
%TO.C,C3*%
X88832333Y-60194000D02*
X88799000Y-60227333D01*
X88699000Y-60260666D01*
X88632333Y-60260666D01*
X88532333Y-60227333D01*
X88465666Y-60160666D01*
X88432333Y-60094000D01*
X88399000Y-59960666D01*
X88399000Y-59860666D01*
X88432333Y-59727333D01*
X88465666Y-59660666D01*
X88532333Y-59594000D01*
X88632333Y-59560666D01*
X88699000Y-59560666D01*
X88799000Y-59594000D01*
X88832333Y-59627333D01*
X89065666Y-59560666D02*
X89499000Y-59560666D01*
X89265666Y-59827333D01*
X89365666Y-59827333D01*
X89432333Y-59860666D01*
X89465666Y-59894000D01*
X89499000Y-59960666D01*
X89499000Y-60127333D01*
X89465666Y-60194000D01*
X89432333Y-60227333D01*
X89365666Y-60260666D01*
X89165666Y-60260666D01*
X89099000Y-60227333D01*
X89065666Y-60194000D01*
%TO.C,C4*%
X107452333Y-75434000D02*
X107419000Y-75467333D01*
X107319000Y-75500666D01*
X107252333Y-75500666D01*
X107152333Y-75467333D01*
X107085666Y-75400666D01*
X107052333Y-75334000D01*
X107019000Y-75200666D01*
X107019000Y-75100666D01*
X107052333Y-74967333D01*
X107085666Y-74900666D01*
X107152333Y-74834000D01*
X107252333Y-74800666D01*
X107319000Y-74800666D01*
X107419000Y-74834000D01*
X107452333Y-74867333D01*
X108052333Y-75034000D02*
X108052333Y-75500666D01*
X107885666Y-74767333D02*
X107719000Y-75267333D01*
X108152333Y-75267333D01*
%TO.C,C5*%
X104785333Y-58924000D02*
X104752000Y-58957333D01*
X104652000Y-58990666D01*
X104585333Y-58990666D01*
X104485333Y-58957333D01*
X104418666Y-58890666D01*
X104385333Y-58824000D01*
X104352000Y-58690666D01*
X104352000Y-58590666D01*
X104385333Y-58457333D01*
X104418666Y-58390666D01*
X104485333Y-58324000D01*
X104585333Y-58290666D01*
X104652000Y-58290666D01*
X104752000Y-58324000D01*
X104785333Y-58357333D01*
X105418666Y-58290666D02*
X105085333Y-58290666D01*
X105052000Y-58624000D01*
X105085333Y-58590666D01*
X105152000Y-58557333D01*
X105318666Y-58557333D01*
X105385333Y-58590666D01*
X105418666Y-58624000D01*
X105452000Y-58690666D01*
X105452000Y-58857333D01*
X105418666Y-58924000D01*
X105385333Y-58957333D01*
X105318666Y-58990666D01*
X105152000Y-58990666D01*
X105085333Y-58957333D01*
X105052000Y-58924000D01*
%TO.C,J1*%
X82316666Y-72768666D02*
X82316666Y-73268666D01*
X82283333Y-73368666D01*
X82216666Y-73435333D01*
X82116666Y-73468666D01*
X82050000Y-73468666D01*
X83016666Y-73468666D02*
X82616666Y-73468666D01*
X82816666Y-73468666D02*
X82816666Y-72768666D01*
X82750000Y-72868666D01*
X82683333Y-72935333D01*
X82616666Y-72968666D01*
%TO.C,J2*%
X101239666Y-56068166D02*
X101239666Y-56568166D01*
X101206333Y-56668166D01*
X101139666Y-56734833D01*
X101039666Y-56768166D01*
X100973000Y-56768166D01*
X101539666Y-56134833D02*
X101573000Y-56101500D01*
X101639666Y-56068166D01*
X101806333Y-56068166D01*
X101873000Y-56101500D01*
X101906333Y-56134833D01*
X101939666Y-56201500D01*
X101939666Y-56268166D01*
X101906333Y-56368166D01*
X101506333Y-56768166D01*
X101939666Y-56768166D01*
%TO.C,J3*%
X101176166Y-80896666D02*
X101176166Y-81396666D01*
X101142833Y-81496666D01*
X101076166Y-81563333D01*
X100976166Y-81596666D01*
X100909500Y-81596666D01*
X101442833Y-80896666D02*
X101876166Y-80896666D01*
X101642833Y-81163333D01*
X101742833Y-81163333D01*
X101809500Y-81196666D01*
X101842833Y-81230000D01*
X101876166Y-81296666D01*
X101876166Y-81463333D01*
X101842833Y-81530000D01*
X101809500Y-81563333D01*
X101742833Y-81596666D01*
X101542833Y-81596666D01*
X101476166Y-81563333D01*
X101442833Y-81530000D01*
%TO.C,J4*%
X112352166Y-72959166D02*
X112352166Y-73459166D01*
X112318833Y-73559166D01*
X112252166Y-73625833D01*
X112152166Y-73659166D01*
X112085500Y-73659166D01*
X112985500Y-73192500D02*
X112985500Y-73659166D01*
X112818833Y-72925833D02*
X112652166Y-73425833D01*
X113085500Y-73425833D01*
%TO.C,JP*%
X102239000Y-70546166D02*
X102239000Y-71046166D01*
X102205666Y-71146166D01*
X102139000Y-71212833D01*
X102039000Y-71246166D01*
X101972333Y-71246166D01*
X102572333Y-71246166D02*
X102572333Y-70546166D01*
X102839000Y-70546166D01*
X102905666Y-70579500D01*
X102939000Y-70612833D01*
X102972333Y-70679500D01*
X102972333Y-70779500D01*
X102939000Y-70846166D01*
X102905666Y-70879500D01*
X102839000Y-70912833D01*
X102572333Y-70912833D01*
%TO.C,L2*%
X104658333Y-68452166D02*
X104325000Y-68452166D01*
X104325000Y-67752166D01*
X104858333Y-67818833D02*
X104891666Y-67785500D01*
X104958333Y-67752166D01*
X105125000Y-67752166D01*
X105191666Y-67785500D01*
X105225000Y-67818833D01*
X105258333Y-67885500D01*
X105258333Y-67952166D01*
X105225000Y-68052166D01*
X104825000Y-68452166D01*
X105258333Y-68452166D01*
%TO.C,Q1*%
X87309333Y-80647333D02*
X87242666Y-80614000D01*
X87176000Y-80547333D01*
X87076000Y-80447333D01*
X87009333Y-80414000D01*
X86942666Y-80414000D01*
X86976000Y-80580666D02*
X86909333Y-80547333D01*
X86842666Y-80480666D01*
X86809333Y-80347333D01*
X86809333Y-80114000D01*
X86842666Y-79980666D01*
X86909333Y-79914000D01*
X86976000Y-79880666D01*
X87109333Y-79880666D01*
X87176000Y-79914000D01*
X87242666Y-79980666D01*
X87276000Y-80114000D01*
X87276000Y-80347333D01*
X87242666Y-80480666D01*
X87176000Y-80547333D01*
X87109333Y-80580666D01*
X86976000Y-80580666D01*
X87942666Y-80580666D02*
X87542666Y-80580666D01*
X87742666Y-80580666D02*
X87742666Y-79880666D01*
X87676000Y-79980666D01*
X87609333Y-80047333D01*
X87542666Y-80080666D01*
%TO.C,R1*%
X105104833Y-73722666D02*
X104871500Y-73389333D01*
X104704833Y-73722666D02*
X104704833Y-73022666D01*
X104971500Y-73022666D01*
X105038166Y-73056000D01*
X105071500Y-73089333D01*
X105104833Y-73156000D01*
X105104833Y-73256000D01*
X105071500Y-73322666D01*
X105038166Y-73356000D01*
X104971500Y-73389333D01*
X104704833Y-73389333D01*
X105771500Y-73722666D02*
X105371500Y-73722666D01*
X105571500Y-73722666D02*
X105571500Y-73022666D01*
X105504833Y-73122666D01*
X105438166Y-73189333D01*
X105371500Y-73222666D01*
%TO.C,R2*%
X105102833Y-75056166D02*
X104869500Y-74722833D01*
X104702833Y-75056166D02*
X104702833Y-74356166D01*
X104969500Y-74356166D01*
X105036166Y-74389500D01*
X105069500Y-74422833D01*
X105102833Y-74489500D01*
X105102833Y-74589500D01*
X105069500Y-74656166D01*
X105036166Y-74689500D01*
X104969500Y-74722833D01*
X104702833Y-74722833D01*
X105369500Y-74422833D02*
X105402833Y-74389500D01*
X105469500Y-74356166D01*
X105636166Y-74356166D01*
X105702833Y-74389500D01*
X105736166Y-74422833D01*
X105769500Y-74489500D01*
X105769500Y-74556166D01*
X105736166Y-74656166D01*
X105336166Y-75056166D01*
X105769500Y-75056166D01*
%TO.C,BAT_IN*%
X107585833Y-81230000D02*
X107685833Y-81263333D01*
X107719166Y-81296666D01*
X107752500Y-81363333D01*
X107752500Y-81463333D01*
X107719166Y-81530000D01*
X107685833Y-81563333D01*
X107619166Y-81596666D01*
X107352500Y-81596666D01*
X107352500Y-80896666D01*
X107585833Y-80896666D01*
X107652500Y-80930000D01*
X107685833Y-80963333D01*
X107719166Y-81030000D01*
X107719166Y-81096666D01*
X107685833Y-81163333D01*
X107652500Y-81196666D01*
X107585833Y-81230000D01*
X107352500Y-81230000D01*
X108019166Y-81396666D02*
X108352500Y-81396666D01*
X107952500Y-81596666D02*
X108185833Y-80896666D01*
X108419166Y-81596666D01*
X108552500Y-80896666D02*
X108952500Y-80896666D01*
X108752500Y-81596666D02*
X108752500Y-80896666D01*
X109019166Y-81663333D02*
X109552500Y-81663333D01*
X109719166Y-81596666D02*
X109719166Y-80896666D01*
X110052500Y-81596666D02*
X110052500Y-80896666D01*
X110452500Y-81596666D01*
X110452500Y-80896666D01*
%TO.C,BMO*%
X107677833Y-56338000D02*
X107777833Y-56371333D01*
X107811166Y-56404666D01*
X107844500Y-56471333D01*
X107844500Y-56571333D01*
X107811166Y-56638000D01*
X107777833Y-56671333D01*
X107711166Y-56704666D01*
X107444500Y-56704666D01*
X107444500Y-56004666D01*
X107677833Y-56004666D01*
X107744500Y-56038000D01*
X107777833Y-56071333D01*
X107811166Y-56138000D01*
X107811166Y-56204666D01*
X107777833Y-56271333D01*
X107744500Y-56304666D01*
X107677833Y-56338000D01*
X107444500Y-56338000D01*
X108144500Y-56704666D02*
X108144500Y-56004666D01*
X108377833Y-56504666D01*
X108611166Y-56004666D01*
X108611166Y-56704666D01*
X109077833Y-56004666D02*
X109211166Y-56004666D01*
X109277833Y-56038000D01*
X109344500Y-56104666D01*
X109377833Y-56238000D01*
X109377833Y-56471333D01*
X109344500Y-56604666D01*
X109277833Y-56671333D01*
X109211166Y-56704666D01*
X109077833Y-56704666D01*
X109011166Y-56671333D01*
X108944500Y-56604666D01*
X108911166Y-56471333D01*
X108911166Y-56238000D01*
X108944500Y-56104666D01*
X109011166Y-56038000D01*
X109077833Y-56004666D01*
%TO.C,VIN*%
X81783333Y-60068666D02*
X82016666Y-60768666D01*
X82250000Y-60068666D01*
X82483333Y-60768666D02*
X82483333Y-60068666D01*
X82816666Y-60768666D02*
X82816666Y-60068666D01*
X83216666Y-60768666D01*
X83216666Y-60068666D01*
%TO.C,BAT1*%
X92622000Y-60973500D02*
X92722000Y-61006833D01*
X92755333Y-61040166D01*
X92788666Y-61106833D01*
X92788666Y-61206833D01*
X92755333Y-61273500D01*
X92722000Y-61306833D01*
X92655333Y-61340166D01*
X92388666Y-61340166D01*
X92388666Y-60640166D01*
X92622000Y-60640166D01*
X92688666Y-60673500D01*
X92722000Y-60706833D01*
X92755333Y-60773500D01*
X92755333Y-60840166D01*
X92722000Y-60906833D01*
X92688666Y-60940166D01*
X92622000Y-60973500D01*
X92388666Y-60973500D01*
X93055333Y-61140166D02*
X93388666Y-61140166D01*
X92988666Y-61340166D02*
X93222000Y-60640166D01*
X93455333Y-61340166D01*
X93588666Y-60640166D02*
X93988666Y-60640166D01*
X93788666Y-61340166D02*
X93788666Y-60640166D01*
X94588666Y-61340166D02*
X94188666Y-61340166D01*
X94388666Y-61340166D02*
X94388666Y-60640166D01*
X94322000Y-60740166D01*
X94255333Y-60806833D01*
X94188666Y-60840166D01*
%TO.C,3V3*%
X111655333Y-60322666D02*
X112088666Y-60322666D01*
X111855333Y-60589333D01*
X111955333Y-60589333D01*
X112022000Y-60622666D01*
X112055333Y-60656000D01*
X112088666Y-60722666D01*
X112088666Y-60889333D01*
X112055333Y-60956000D01*
X112022000Y-60989333D01*
X111955333Y-61022666D01*
X111755333Y-61022666D01*
X111688666Y-60989333D01*
X111655333Y-60956000D01*
X112288666Y-60322666D02*
X112522000Y-61022666D01*
X112755333Y-60322666D01*
X112922000Y-60322666D02*
X113355333Y-60322666D01*
X113122000Y-60589333D01*
X113222000Y-60589333D01*
X113288666Y-60622666D01*
X113322000Y-60656000D01*
X113355333Y-60722666D01*
X113355333Y-60889333D01*
X113322000Y-60956000D01*
X113288666Y-60989333D01*
X113222000Y-61022666D01*
X113022000Y-61022666D01*
X112955333Y-60989333D01*
X112922000Y-60956000D01*
%TO.C,U1*%
X91351166Y-70482666D02*
X91351166Y-71049333D01*
X91384500Y-71116000D01*
X91417833Y-71149333D01*
X91484500Y-71182666D01*
X91617833Y-71182666D01*
X91684500Y-71149333D01*
X91717833Y-71116000D01*
X91751166Y-71049333D01*
X91751166Y-70482666D01*
X92451166Y-71182666D02*
X92051166Y-71182666D01*
X92251166Y-71182666D02*
X92251166Y-70482666D01*
X92184500Y-70582666D01*
X92117833Y-70649333D01*
X92051166Y-70682666D01*
%TO.C,U2*%
X106895166Y-71704166D02*
X106895166Y-72270833D01*
X106928500Y-72337500D01*
X106961833Y-72370833D01*
X107028500Y-72404166D01*
X107161833Y-72404166D01*
X107228500Y-72370833D01*
X107261833Y-72337500D01*
X107295166Y-72270833D01*
X107295166Y-71704166D01*
X107595166Y-71770833D02*
X107628500Y-71737500D01*
X107695166Y-71704166D01*
X107861833Y-71704166D01*
X107928500Y-71737500D01*
X107961833Y-71770833D01*
X107995166Y-71837500D01*
X107995166Y-71904166D01*
X107961833Y-72004166D01*
X107561833Y-72404166D01*
X107995166Y-72404166D01*
%TD*%
M02*
