%TF.GenerationSoftware,KiCad,Pcbnew,5.1.7-a382d34a88~90~ubuntu20.04.1*%
%TF.CreationDate,2021-11-30T13:44:55+05:30*%
%TF.ProjectId,EH-GENERIC_BOARD,45482d47-454e-4455-9249-435f424f4152,rev?*%
%TF.SameCoordinates,Original*%
%TF.FileFunction,Soldermask,Bot*%
%TF.FilePolarity,Negative*%
%FSLAX46Y46*%
G04 Gerber Fmt 4.6, Leading zero omitted, Abs format (unit mm)*
G04 Created by KiCad (PCBNEW 5.1.7-a382d34a88~90~ubuntu20.04.1) date 2021-11-30 13:44:55*
%MOMM*%
%LPD*%
G01*
G04 APERTURE LIST*
%ADD10C,2.500000*%
%ADD11C,2.100000*%
%ADD12O,2.100000X2.100000*%
G04 APERTURE END LIST*
D10*
%TO.C,*%
X82677000Y-81153000D03*
%TD*%
%TO.C,*%
X112125000Y-56415000D03*
%TD*%
D11*
%TO.C,BT2*%
X99790000Y-73660000D03*
X95790000Y-73660000D03*
%TD*%
D12*
%TO.C,J1*%
X82550000Y-70612000D03*
G36*
G01*
X81500000Y-68922000D02*
X81500000Y-67222000D01*
G75*
G02*
X81700000Y-67022000I200000J0D01*
G01*
X83400000Y-67022000D01*
G75*
G02*
X83600000Y-67222000I0J-200000D01*
G01*
X83600000Y-68922000D01*
G75*
G02*
X83400000Y-69122000I-200000J0D01*
G01*
X81700000Y-69122000D01*
G75*
G02*
X81500000Y-68922000I0J200000D01*
G01*
G37*
%TD*%
%TO.C,J2*%
G36*
G01*
X98210000Y-55338000D02*
X99910000Y-55338000D01*
G75*
G02*
X100110000Y-55538000I0J-200000D01*
G01*
X100110000Y-57238000D01*
G75*
G02*
X99910000Y-57438000I-200000J0D01*
G01*
X98210000Y-57438000D01*
G75*
G02*
X98010000Y-57238000I0J200000D01*
G01*
X98010000Y-55538000D01*
G75*
G02*
X98210000Y-55338000I200000J0D01*
G01*
G37*
X96520000Y-56388000D03*
%TD*%
%TO.C,J3*%
G36*
G01*
X97956000Y-80230000D02*
X99656000Y-80230000D01*
G75*
G02*
X99856000Y-80430000I0J-200000D01*
G01*
X99856000Y-82130000D01*
G75*
G02*
X99656000Y-82330000I-200000J0D01*
G01*
X97956000Y-82330000D01*
G75*
G02*
X97756000Y-82130000I0J200000D01*
G01*
X97756000Y-80430000D01*
G75*
G02*
X97956000Y-80230000I200000J0D01*
G01*
G37*
X96266000Y-81280000D03*
%TD*%
%TO.C,J4*%
X112522000Y-70866000D03*
G36*
G01*
X111472000Y-69176000D02*
X111472000Y-67476000D01*
G75*
G02*
X111672000Y-67276000I200000J0D01*
G01*
X113372000Y-67276000D01*
G75*
G02*
X113572000Y-67476000I0J-200000D01*
G01*
X113572000Y-69176000D01*
G75*
G02*
X113372000Y-69376000I-200000J0D01*
G01*
X111672000Y-69376000D01*
G75*
G02*
X111472000Y-69176000I0J200000D01*
G01*
G37*
%TD*%
D11*
%TO.C,BT1*%
X99790000Y-64516000D03*
X95790000Y-64516000D03*
%TD*%
M02*
