%!PS-Adobe-3.0
%%Creator: PCBNEW
%%CreationDate: Tue Nov 30 13:44:42 2021
%%Title: /home/jaroos/Desktop/EH-GENERIC_BOARD/EH-PCB/EH-GENERIC_BOARD-PTH-drl_map.ps
%%Pages: 1
%%PageOrder: Ascend
%%BoundingBox: 0 0 596 842
%%DocumentMedia: A4 595 842 0 () ()
%%Orientation: Landscape
%%EndComments
%%BeginProlog
/line { newpath moveto lineto stroke } bind def
/cir0 { newpath 0 360 arc stroke } bind def
/cir1 { newpath 0 360 arc gsave fill grestore stroke } bind def
/cir2 { newpath 0 360 arc gsave fill grestore stroke } bind def
/arc0 { newpath arc stroke } bind def
/arc1 { newpath 4 index 4 index moveto arc closepath gsave fill
    grestore stroke } bind def
/arc2 { newpath 4 index 4 index moveto arc closepath gsave fill
    grestore stroke } bind def
/poly0 { stroke } bind def
/poly1 { closepath gsave fill grestore stroke } bind def
/poly2 { closepath gsave fill grestore stroke } bind def
/rect0 { rectstroke } bind def
/rect1 { rectfill } bind def
/rect2 { rectfill } bind def
/linemode0 { 0 setlinecap 0 setlinejoin 0 setlinewidth } bind def
/linemode1 { 1 setlinecap 1 setlinejoin } bind def
/dashedline { [200] 100 setdash } bind def
/solidline { [] 0 setdash } bind def
/phantomshow { moveto
    /KicadFont findfont 0.000001 scalefont setfont
    show } bind def
/textshow { gsave
    findfont exch scalefont setfont concat 1 scale 0 0 moveto show
    } bind def
/reencodefont {
  findfont dup length dict begin
  { 1 index /FID ne
    { def }
    { pop pop } ifelse
  } forall
  /Encoding ISOLatin1Encoding def
  currentdict
  end } bind def
/KicadFont /Helvetica reencodefont definefont pop
/KicadFont-Bold /Helvetica-Bold reencodefont definefont pop
/KicadFont-Oblique /Helvetica-Oblique reencodefont definefont pop
/KicadFont-BoldOblique /Helvetica-BoldOblique reencodefont definefont pop
%%EndProlog
%%Page: 1 1
%%BeginPageSetup
gsave
0.0072 0.0072 scale
linemode1
82680 0 translate 90 rotate
150 setlinewidth
%%EndPageSetup
0 0 0 setrgbcolor
177.165 setlinewidth
newpath
79135 75081 moveto
79135 40611 lineto
stroke
0 0 0 setrgbcolor
newpath
38245 40161 moveto
78625 40161 lineto
stroke
0 0 0 setrgbcolor
newpath
37795 75141 moveto
37795 40671 lineto
stroke
0 0 0 setrgbcolor
newpath
78685 75591 moveto
38305 75591 lineto
stroke
0 0 0 setrgbcolor
78655 75111 480.937 -3.57633 86.4237 arc0
0 0 0 setrgbcolor
78655 40641 480.937 -93.5763 -3.57633 arc0
0 0 0 setrgbcolor
38275 40641 480.937 176.424 266.424 arc0
0 0 0 setrgbcolor
38275 75111 480.937 86.4237 176.424 arc0
78.7394 setlinewidth
newpath
49467.8 61488.2 moveto
49822.2 61133.8 lineto
stroke
newpath
49822.2 61488.2 moveto
49467.8 61133.8 lineto
stroke
44995 55161 236.22 cir0
64495 71361 236.22 cir0
69370 62811 236.22 cir0
70870 59961 236.22 cir0
71845 53886 236.22 cir0
72745 65136 236.22 cir0
newpath
56432.8 52751.6 moveto
56432.8 51570.4 lineto
stroke
newpath
55842.2 52161 moveto
57023.3 52161 lineto
stroke
newpath
61157.2 52751.6 moveto
61157.2 51570.4 lineto
stroke
newpath
60566.7 52161 moveto
61747.8 52161 lineto
stroke
newpath
57295 73151.6 moveto
57295 71970.4 lineto
stroke
newpath
56704.4 72561 moveto
57885.6 72561 lineto
stroke
newpath
60295 73151.6 moveto
60295 71970.4 lineto
stroke
newpath
59704.4 72561 moveto
60885.6 72561 lineto
stroke
newpath
40795 59351.6 moveto
40795 58170.4 lineto
stroke
newpath
40204.4 58761 moveto
41385.6 58761 lineto
stroke
newpath
40795 56351.6 moveto
40795 55170.4 lineto
stroke
newpath
40204.4 55761 moveto
41385.6 55761 lineto
stroke
newpath
76195 59051.6 moveto
76195 57870.4 lineto
stroke
newpath
75604.4 58461 moveto
76785.6 58461 lineto
stroke
newpath
76195 56051.6 moveto
76195 54870.4 lineto
stroke
newpath
75604.4 55461 moveto
76785.6 55461 lineto
stroke
newpath
56995 43751.6 moveto
56995 42570.4 lineto
stroke
newpath
56404.4 43161 moveto
57585.6 43161 lineto
stroke
newpath
59995 43751.6 moveto
59995 42570.4 lineto
stroke
newpath
59404.4 43161 moveto
60585.6 43161 lineto
stroke
newpath
56432.8 63551.6 moveto
56432.8 62370.4 lineto
stroke
newpath
55842.2 62961 moveto
57023.3 62961 lineto
stroke
newpath
61157.2 63551.6 moveto
61157.2 62370.4 lineto
stroke
newpath
60566.7 62961 moveto
61747.8 62961 lineto
stroke
118.11 setlinewidth
0 0 0 setrgbcolor
0 0 0 setrgbcolor
newpath
38833.2 38238 moveto
38833.2 39419.1 lineto
39114.4 39419.1 lineto
39283.1 39362.8 lineto
39395.6 39250.3 lineto
39451.8 39137.8 lineto
39508.1 38912.9 lineto
39508.1 38744.1 lineto
39451.8 38519.2 lineto
39395.6 38406.7 lineto
39283.1 38294.2 lineto
39114.4 38238 lineto
38833.2 38238 lineto
stroke
newpath
40014.3 38238 moveto
40014.3 39025.4 lineto
stroke
newpath
40014.3 38800.4 moveto
40070.5 38912.9 lineto
40126.7 38969.1 lineto
40239.2 39025.4 lineto
40351.7 39025.4 lineto
stroke
newpath
40745.4 38238 moveto
40745.4 39025.4 lineto
stroke
newpath
40745.4 39419.1 moveto
40689.2 39362.8 lineto
40745.4 39306.6 lineto
40801.7 39362.8 lineto
40745.4 39419.1 lineto
40745.4 39306.6 lineto
stroke
newpath
41476.6 38238 moveto
41364.1 38294.2 lineto
41307.8 38406.7 lineto
41307.8 39419.1 lineto
stroke
newpath
42095.2 38238 moveto
41982.8 38294.2 lineto
41926.5 38406.7 lineto
41926.5 39419.1 lineto
stroke
newpath
43445.1 38238 moveto
43445.1 39419.1 lineto
43838.8 38575.4 lineto
44232.5 39419.1 lineto
44232.5 38238 lineto
stroke
newpath
45301.1 38238 moveto
45301.1 38856.6 lineto
45244.8 38969.1 lineto
45132.4 39025.4 lineto
44907.4 39025.4 lineto
44794.9 38969.1 lineto
stroke
newpath
45301.1 38294.2 moveto
45188.6 38238 lineto
44907.4 38238 lineto
44794.9 38294.2 lineto
44738.7 38406.7 lineto
44738.7 38519.2 lineto
44794.9 38631.7 lineto
44907.4 38687.9 lineto
45188.6 38687.9 lineto
45301.1 38744.1 lineto
stroke
newpath
45863.5 39025.4 moveto
45863.5 37844.3 lineto
stroke
newpath
45863.5 38969.1 moveto
45976 39025.4 lineto
46201 39025.4 lineto
46313.5 38969.1 lineto
46369.7 38912.9 lineto
46426 38800.4 lineto
46426 38462.9 lineto
46369.7 38350.4 lineto
46313.5 38294.2 lineto
46201 38238 lineto
45976 38238 lineto
45863.5 38294.2 lineto
stroke
newpath
46932.1 38350.4 moveto
46988.4 38294.2 lineto
46932.1 38238 lineto
46875.9 38294.2 lineto
46932.1 38350.4 lineto
46932.1 38238 lineto
stroke
newpath
46932.1 38969.1 moveto
46988.4 38912.9 lineto
46932.1 38856.6 lineto
46875.9 38912.9 lineto
46932.1 38969.1 lineto
46932.1 38856.6 lineto
stroke
newpath
37351.1 36469.1 moveto
37705.5 36114.8 lineto
stroke
newpath
37705.5 36469.1 moveto
37351.1 36114.8 lineto
stroke
0 0 0 setrgbcolor
0 0 0 setrgbcolor
newpath
39058.1 36938.7 moveto
39170.6 36938.7 lineto
39283.1 36882.5 lineto
39339.3 36826.3 lineto
39395.6 36713.8 lineto
39451.8 36488.8 lineto
39451.8 36207.6 lineto
39395.6 35982.6 lineto
39339.3 35870.1 lineto
39283.1 35813.9 lineto
39170.6 35757.6 lineto
39058.1 35757.6 lineto
38945.6 35813.9 lineto
38889.4 35870.1 lineto
38833.2 35982.6 lineto
38776.9 36207.6 lineto
38776.9 36488.8 lineto
38833.2 36713.8 lineto
38889.4 36826.3 lineto
38945.6 36882.5 lineto
39058.1 36938.7 lineto
stroke
newpath
39958 35870.1 moveto
40014.3 35813.9 lineto
39958 35757.6 lineto
39901.8 35813.9 lineto
39958 35870.1 lineto
39958 35757.6 lineto
stroke
newpath
40408 36938.7 moveto
41139.1 36938.7 lineto
40745.4 36488.8 lineto
40914.1 36488.8 lineto
41026.6 36432.6 lineto
41082.9 36376.3 lineto
41139.1 36263.8 lineto
41139.1 35982.6 lineto
41082.9 35870.1 lineto
41026.6 35813.9 lineto
40914.1 35757.6 lineto
40576.7 35757.6 lineto
40464.2 35813.9 lineto
40408 35870.1 lineto
stroke
newpath
41870.3 36938.7 moveto
41982.8 36938.7 lineto
42095.2 36882.5 lineto
42151.5 36826.3 lineto
42207.7 36713.8 lineto
42264 36488.8 lineto
42264 36207.6 lineto
42207.7 35982.6 lineto
42151.5 35870.1 lineto
42095.2 35813.9 lineto
41982.8 35757.6 lineto
41870.3 35757.6 lineto
41757.8 35813.9 lineto
41701.5 35870.1 lineto
41645.3 35982.6 lineto
41589.1 36207.6 lineto
41589.1 36488.8 lineto
41645.3 36713.8 lineto
41701.5 36826.3 lineto
41757.8 36882.5 lineto
41870.3 36938.7 lineto
stroke
newpath
42770.2 35757.6 moveto
42770.2 36545 lineto
stroke
newpath
42770.2 36432.6 moveto
42826.4 36488.8 lineto
42938.9 36545 lineto
43107.6 36545 lineto
43220.1 36488.8 lineto
43276.3 36376.3 lineto
43276.3 35757.6 lineto
stroke
newpath
43276.3 36376.3 moveto
43332.6 36488.8 lineto
43445.1 36545 lineto
43613.8 36545 lineto
43726.3 36488.8 lineto
43782.5 36376.3 lineto
43782.5 35757.6 lineto
stroke
newpath
44345 35757.6 moveto
44345 36545 lineto
stroke
newpath
44345 36432.6 moveto
44401.2 36488.8 lineto
44513.7 36545 lineto
44682.4 36545 lineto
44794.9 36488.8 lineto
44851.1 36376.3 lineto
44851.1 35757.6 lineto
stroke
newpath
44851.1 36376.3 moveto
44907.4 36488.8 lineto
45019.9 36545 lineto
45188.6 36545 lineto
45301.1 36488.8 lineto
45357.3 36376.3 lineto
45357.3 35757.6 lineto
stroke
newpath
47663.3 36995 moveto
46650.9 35476.4 lineto
stroke
newpath
49181.9 36938.7 moveto
49294.3 36938.7 lineto
49406.8 36882.5 lineto
49463.1 36826.3 lineto
49519.3 36713.8 lineto
49575.6 36488.8 lineto
49575.6 36207.6 lineto
49519.3 35982.6 lineto
49463.1 35870.1 lineto
49406.8 35813.9 lineto
49294.3 35757.6 lineto
49181.9 35757.6 lineto
49069.4 35813.9 lineto
49013.1 35870.1 lineto
48956.9 35982.6 lineto
48900.6 36207.6 lineto
48900.6 36488.8 lineto
48956.9 36713.8 lineto
49013.1 36826.3 lineto
49069.4 36882.5 lineto
49181.9 36938.7 lineto
stroke
newpath
50081.7 35870.1 moveto
50138 35813.9 lineto
50081.7 35757.6 lineto
50025.5 35813.9 lineto
50081.7 35870.1 lineto
50081.7 35757.6 lineto
stroke
newpath
50869.1 36938.7 moveto
50981.6 36938.7 lineto
51094.1 36882.5 lineto
51150.4 36826.3 lineto
51206.6 36713.8 lineto
51262.8 36488.8 lineto
51262.8 36207.6 lineto
51206.6 35982.6 lineto
51150.4 35870.1 lineto
51094.1 35813.9 lineto
50981.6 35757.6 lineto
50869.1 35757.6 lineto
50756.7 35813.9 lineto
50700.4 35870.1 lineto
50644.2 35982.6 lineto
50587.9 36207.6 lineto
50587.9 36488.8 lineto
50644.2 36713.8 lineto
50700.4 36826.3 lineto
50756.7 36882.5 lineto
50869.1 36938.7 lineto
stroke
newpath
52387.7 35757.6 moveto
51712.8 35757.6 lineto
stroke
newpath
52050.2 35757.6 moveto
52050.2 36938.7 lineto
51937.8 36770 lineto
51825.3 36657.5 lineto
51712.8 36601.3 lineto
stroke
newpath
52837.7 36826.3 moveto
52893.9 36882.5 lineto
53006.4 36938.7 lineto
53287.6 36938.7 lineto
53400.1 36882.5 lineto
53456.3 36826.3 lineto
53512.6 36713.8 lineto
53512.6 36601.3 lineto
53456.3 36432.6 lineto
52781.4 35757.6 lineto
53512.6 35757.6 lineto
stroke
newpath
53962.5 36938.7 moveto
53962.5 36713.8 lineto
stroke
newpath
54412.5 36938.7 moveto
54412.5 36713.8 lineto
stroke
newpath
56156 35307.7 moveto
56099.7 35363.9 lineto
55987.3 35532.7 lineto
55931 35645.2 lineto
55874.8 35813.9 lineto
55818.5 36095.1 lineto
55818.5 36320.1 lineto
55874.8 36601.3 lineto
55931 36770 lineto
55987.3 36882.5 lineto
56099.7 37051.2 lineto
56156 37107.5 lineto
stroke
newpath
57224.6 35757.6 moveto
56549.7 35757.6 lineto
stroke
newpath
56887.1 35757.6 moveto
56887.1 36938.7 lineto
56774.7 36770 lineto
56662.2 36657.5 lineto
56549.7 36601.3 lineto
stroke
newpath
58630.7 35757.6 moveto
58630.7 36938.7 lineto
stroke
newpath
59136.9 35757.6 moveto
59136.9 36376.3 lineto
59080.6 36488.8 lineto
58968.1 36545 lineto
58799.4 36545 lineto
58686.9 36488.8 lineto
58630.7 36432.6 lineto
stroke
newpath
59868 35757.6 moveto
59755.5 35813.9 lineto
59699.3 35870.1 lineto
59643 35982.6 lineto
59643 36320.1 lineto
59699.3 36432.6 lineto
59755.5 36488.8 lineto
59868 36545 lineto
60036.8 36545 lineto
60149.2 36488.8 lineto
60205.5 36432.6 lineto
60261.7 36320.1 lineto
60261.7 35982.6 lineto
60205.5 35870.1 lineto
60149.2 35813.9 lineto
60036.8 35757.6 lineto
59868 35757.6 lineto
stroke
newpath
60936.6 35757.6 moveto
60824.2 35813.9 lineto
60767.9 35926.4 lineto
60767.9 36938.7 lineto
stroke
newpath
61836.5 35813.9 moveto
61724 35757.6 lineto
61499.1 35757.6 lineto
61386.6 35813.9 lineto
61330.3 35926.4 lineto
61330.3 36376.3 lineto
61386.6 36488.8 lineto
61499.1 36545 lineto
61724 36545 lineto
61836.5 36488.8 lineto
61892.8 36376.3 lineto
61892.8 36263.8 lineto
61330.3 36151.3 lineto
stroke
newpath
62286.5 35307.7 moveto
62342.7 35363.9 lineto
62455.2 35532.7 lineto
62511.4 35645.2 lineto
62567.7 35813.9 lineto
62623.9 36095.1 lineto
62623.9 36320.1 lineto
62567.7 36601.3 lineto
62511.4 36770 lineto
62455.2 36882.5 lineto
62342.7 37051.2 lineto
62286.5 37107.5 lineto
stroke
37469.3 34732.9 236.22 cir0
0 0 0 setrgbcolor
0 0 0 setrgbcolor
newpath
39058.1 35379.7 moveto
39170.6 35379.7 lineto
39283.1 35323.4 lineto
39339.3 35267.2 lineto
39395.6 35154.7 lineto
39451.8 34929.7 lineto
39451.8 34648.5 lineto
39395.6 34423.6 lineto
39339.3 34311.1 lineto
39283.1 34254.8 lineto
39170.6 34198.6 lineto
39058.1 34198.6 lineto
38945.6 34254.8 lineto
38889.4 34311.1 lineto
38833.2 34423.6 lineto
38776.9 34648.5 lineto
38776.9 34929.7 lineto
38833.2 35154.7 lineto
38889.4 35267.2 lineto
38945.6 35323.4 lineto
39058.1 35379.7 lineto
stroke
newpath
39958 34311.1 moveto
40014.3 34254.8 lineto
39958 34198.6 lineto
39901.8 34254.8 lineto
39958 34311.1 lineto
39958 34198.6 lineto
stroke
newpath
41026.6 34986 moveto
41026.6 34198.6 lineto
stroke
newpath
40745.4 35435.9 moveto
40464.2 34592.3 lineto
41195.4 34592.3 lineto
stroke
newpath
41870.3 35379.7 moveto
41982.8 35379.7 lineto
42095.2 35323.4 lineto
42151.5 35267.2 lineto
42207.7 35154.7 lineto
42264 34929.7 lineto
42264 34648.5 lineto
42207.7 34423.6 lineto
42151.5 34311.1 lineto
42095.2 34254.8 lineto
41982.8 34198.6 lineto
41870.3 34198.6 lineto
41757.8 34254.8 lineto
41701.5 34311.1 lineto
41645.3 34423.6 lineto
41589.1 34648.5 lineto
41589.1 34929.7 lineto
41645.3 35154.7 lineto
41701.5 35267.2 lineto
41757.8 35323.4 lineto
41870.3 35379.7 lineto
stroke
newpath
42770.2 34198.6 moveto
42770.2 34986 lineto
stroke
newpath
42770.2 34873.5 moveto
42826.4 34929.7 lineto
42938.9 34986 lineto
43107.6 34986 lineto
43220.1 34929.7 lineto
43276.3 34817.3 lineto
43276.3 34198.6 lineto
stroke
newpath
43276.3 34817.3 moveto
43332.6 34929.7 lineto
43445.1 34986 lineto
43613.8 34986 lineto
43726.3 34929.7 lineto
43782.5 34817.3 lineto
43782.5 34198.6 lineto
stroke
newpath
44345 34198.6 moveto
44345 34986 lineto
stroke
newpath
44345 34873.5 moveto
44401.2 34929.7 lineto
44513.7 34986 lineto
44682.4 34986 lineto
44794.9 34929.7 lineto
44851.1 34817.3 lineto
44851.1 34198.6 lineto
stroke
newpath
44851.1 34817.3 moveto
44907.4 34929.7 lineto
45019.9 34986 lineto
45188.6 34986 lineto
45301.1 34929.7 lineto
45357.3 34817.3 lineto
45357.3 34198.6 lineto
stroke
newpath
47663.3 35435.9 moveto
46650.9 33917.4 lineto
stroke
newpath
49181.9 35379.7 moveto
49294.3 35379.7 lineto
49406.8 35323.4 lineto
49463.1 35267.2 lineto
49519.3 35154.7 lineto
49575.6 34929.7 lineto
49575.6 34648.5 lineto
49519.3 34423.6 lineto
49463.1 34311.1 lineto
49406.8 34254.8 lineto
49294.3 34198.6 lineto
49181.9 34198.6 lineto
49069.4 34254.8 lineto
49013.1 34311.1 lineto
48956.9 34423.6 lineto
48900.6 34648.5 lineto
48900.6 34929.7 lineto
48956.9 35154.7 lineto
49013.1 35267.2 lineto
49069.4 35323.4 lineto
49181.9 35379.7 lineto
stroke
newpath
50081.7 34311.1 moveto
50138 34254.8 lineto
50081.7 34198.6 lineto
50025.5 34254.8 lineto
50081.7 34311.1 lineto
50081.7 34198.6 lineto
stroke
newpath
50869.1 35379.7 moveto
50981.6 35379.7 lineto
51094.1 35323.4 lineto
51150.4 35267.2 lineto
51206.6 35154.7 lineto
51262.8 34929.7 lineto
51262.8 34648.5 lineto
51206.6 34423.6 lineto
51150.4 34311.1 lineto
51094.1 34254.8 lineto
50981.6 34198.6 lineto
50869.1 34198.6 lineto
50756.7 34254.8 lineto
50700.4 34311.1 lineto
50644.2 34423.6 lineto
50587.9 34648.5 lineto
50587.9 34929.7 lineto
50644.2 35154.7 lineto
50700.4 35267.2 lineto
50756.7 35323.4 lineto
50869.1 35379.7 lineto
stroke
newpath
52387.7 34198.6 moveto
51712.8 34198.6 lineto
stroke
newpath
52050.2 34198.6 moveto
52050.2 35379.7 lineto
51937.8 35211 lineto
51825.3 35098.5 lineto
51712.8 35042.2 lineto
stroke
newpath
53400.1 35379.7 moveto
53175.1 35379.7 lineto
53062.6 35323.4 lineto
53006.4 35267.2 lineto
52893.9 35098.5 lineto
52837.7 34873.5 lineto
52837.7 34423.6 lineto
52893.9 34311.1 lineto
52950.1 34254.8 lineto
53062.6 34198.6 lineto
53287.6 34198.6 lineto
53400.1 34254.8 lineto
53456.3 34311.1 lineto
53512.6 34423.6 lineto
53512.6 34704.8 lineto
53456.3 34817.3 lineto
53400.1 34873.5 lineto
53287.6 34929.7 lineto
53062.6 34929.7 lineto
52950.1 34873.5 lineto
52893.9 34817.3 lineto
52837.7 34704.8 lineto
stroke
newpath
53962.5 35379.7 moveto
53962.5 35154.7 lineto
stroke
newpath
54412.5 35379.7 moveto
54412.5 35154.7 lineto
stroke
newpath
56156 33748.6 moveto
56099.7 33804.9 lineto
55987.3 33973.6 lineto
55931 34086.1 lineto
55874.8 34254.8 lineto
55818.5 34536 lineto
55818.5 34761 lineto
55874.8 35042.2 lineto
55931 35211 lineto
55987.3 35323.4 lineto
56099.7 35492.2 lineto
56156 35548.4 lineto
stroke
newpath
57112.1 35379.7 moveto
56887.1 35379.7 lineto
56774.7 35323.4 lineto
56718.4 35267.2 lineto
56605.9 35098.5 lineto
56549.7 34873.5 lineto
56549.7 34423.6 lineto
56605.9 34311.1 lineto
56662.2 34254.8 lineto
56774.7 34198.6 lineto
56999.6 34198.6 lineto
57112.1 34254.8 lineto
57168.4 34311.1 lineto
57224.6 34423.6 lineto
57224.6 34704.8 lineto
57168.4 34817.3 lineto
57112.1 34873.5 lineto
56999.6 34929.7 lineto
56774.7 34929.7 lineto
56662.2 34873.5 lineto
56605.9 34817.3 lineto
56549.7 34704.8 lineto
stroke
newpath
58630.7 34198.6 moveto
58630.7 35379.7 lineto
stroke
newpath
59136.9 34198.6 moveto
59136.9 34817.3 lineto
59080.6 34929.7 lineto
58968.1 34986 lineto
58799.4 34986 lineto
58686.9 34929.7 lineto
58630.7 34873.5 lineto
stroke
newpath
59868 34198.6 moveto
59755.5 34254.8 lineto
59699.3 34311.1 lineto
59643 34423.6 lineto
59643 34761 lineto
59699.3 34873.5 lineto
59755.5 34929.7 lineto
59868 34986 lineto
60036.8 34986 lineto
60149.2 34929.7 lineto
60205.5 34873.5 lineto
60261.7 34761 lineto
60261.7 34423.6 lineto
60205.5 34311.1 lineto
60149.2 34254.8 lineto
60036.8 34198.6 lineto
59868 34198.6 lineto
stroke
newpath
60936.6 34198.6 moveto
60824.2 34254.8 lineto
60767.9 34367.3 lineto
60767.9 35379.7 lineto
stroke
newpath
61836.5 34254.8 moveto
61724 34198.6 lineto
61499.1 34198.6 lineto
61386.6 34254.8 lineto
61330.3 34367.3 lineto
61330.3 34817.3 lineto
61386.6 34929.7 lineto
61499.1 34986 lineto
61724 34986 lineto
61836.5 34929.7 lineto
61892.8 34817.3 lineto
61892.8 34704.8 lineto
61330.3 34592.3 lineto
stroke
newpath
62342.7 34254.8 moveto
62455.2 34198.6 lineto
62680.2 34198.6 lineto
62792.7 34254.8 lineto
62848.9 34367.3 lineto
62848.9 34423.6 lineto
62792.7 34536 lineto
62680.2 34592.3 lineto
62511.4 34592.3 lineto
62399 34648.5 lineto
62342.7 34761 lineto
62342.7 34817.3 lineto
62399 34929.7 lineto
62511.4 34986 lineto
62680.2 34986 lineto
62792.7 34929.7 lineto
stroke
newpath
63242.6 33748.6 moveto
63298.8 33804.9 lineto
63411.3 33973.6 lineto
63467.6 34086.1 lineto
63523.8 34254.8 lineto
63580.1 34536 lineto
63580.1 34761 lineto
63523.8 35042.2 lineto
63467.6 35211 lineto
63411.3 35323.4 lineto
63298.8 35492.2 lineto
63242.6 35548.4 lineto
stroke
newpath
37114.9 33764.4 moveto
37114.9 32583.3 lineto
stroke
newpath
36524.4 33173.8 moveto
37705.5 33173.8 lineto
stroke
0 0 0 setrgbcolor
0 0 0 setrgbcolor
newpath
39451.8 32639.5 moveto
38776.9 32639.5 lineto
stroke
newpath
39114.4 32639.5 moveto
39114.4 33820.6 lineto
39001.9 33651.9 lineto
38889.4 33539.4 lineto
38776.9 33483.2 lineto
stroke
newpath
39958 32752 moveto
40014.3 32695.8 lineto
39958 32639.5 lineto
39901.8 32695.8 lineto
39958 32752 lineto
39958 32639.5 lineto
stroke
newpath
40745.4 33820.6 moveto
40857.9 33820.6 lineto
40970.4 33764.4 lineto
41026.6 33708.2 lineto
41082.9 33595.7 lineto
41139.1 33370.7 lineto
41139.1 33089.5 lineto
41082.9 32864.5 lineto
41026.6 32752 lineto
40970.4 32695.8 lineto
40857.9 32639.5 lineto
40745.4 32639.5 lineto
40632.9 32695.8 lineto
40576.7 32752 lineto
40520.4 32864.5 lineto
40464.2 33089.5 lineto
40464.2 33370.7 lineto
40520.4 33595.7 lineto
40576.7 33708.2 lineto
40632.9 33764.4 lineto
40745.4 33820.6 lineto
stroke
newpath
41870.3 33820.6 moveto
41982.8 33820.6 lineto
42095.2 33764.4 lineto
42151.5 33708.2 lineto
42207.7 33595.7 lineto
42264 33370.7 lineto
42264 33089.5 lineto
42207.7 32864.5 lineto
42151.5 32752 lineto
42095.2 32695.8 lineto
41982.8 32639.5 lineto
41870.3 32639.5 lineto
41757.8 32695.8 lineto
41701.5 32752 lineto
41645.3 32864.5 lineto
41589.1 33089.5 lineto
41589.1 33370.7 lineto
41645.3 33595.7 lineto
41701.5 33708.2 lineto
41757.8 33764.4 lineto
41870.3 33820.6 lineto
stroke
newpath
42770.2 32639.5 moveto
42770.2 33426.9 lineto
stroke
newpath
42770.2 33314.4 moveto
42826.4 33370.7 lineto
42938.9 33426.9 lineto
43107.6 33426.9 lineto
43220.1 33370.7 lineto
43276.3 33258.2 lineto
43276.3 32639.5 lineto
stroke
newpath
43276.3 33258.2 moveto
43332.6 33370.7 lineto
43445.1 33426.9 lineto
43613.8 33426.9 lineto
43726.3 33370.7 lineto
43782.5 33258.2 lineto
43782.5 32639.5 lineto
stroke
newpath
44345 32639.5 moveto
44345 33426.9 lineto
stroke
newpath
44345 33314.4 moveto
44401.2 33370.7 lineto
44513.7 33426.9 lineto
44682.4 33426.9 lineto
44794.9 33370.7 lineto
44851.1 33258.2 lineto
44851.1 32639.5 lineto
stroke
newpath
44851.1 33258.2 moveto
44907.4 33370.7 lineto
45019.9 33426.9 lineto
45188.6 33426.9 lineto
45301.1 33370.7 lineto
45357.3 33258.2 lineto
45357.3 32639.5 lineto
stroke
newpath
47663.3 33876.9 moveto
46650.9 32358.3 lineto
stroke
newpath
49181.9 33820.6 moveto
49294.3 33820.6 lineto
49406.8 33764.4 lineto
49463.1 33708.2 lineto
49519.3 33595.7 lineto
49575.6 33370.7 lineto
49575.6 33089.5 lineto
49519.3 32864.5 lineto
49463.1 32752 lineto
49406.8 32695.8 lineto
49294.3 32639.5 lineto
49181.9 32639.5 lineto
49069.4 32695.8 lineto
49013.1 32752 lineto
48956.9 32864.5 lineto
48900.6 33089.5 lineto
48900.6 33370.7 lineto
48956.9 33595.7 lineto
49013.1 33708.2 lineto
49069.4 33764.4 lineto
49181.9 33820.6 lineto
stroke
newpath
50081.7 32752 moveto
50138 32695.8 lineto
50081.7 32639.5 lineto
50025.5 32695.8 lineto
50081.7 32752 lineto
50081.7 32639.5 lineto
stroke
newpath
50869.1 33820.6 moveto
50981.6 33820.6 lineto
51094.1 33764.4 lineto
51150.4 33708.2 lineto
51206.6 33595.7 lineto
51262.8 33370.7 lineto
51262.8 33089.5 lineto
51206.6 32864.5 lineto
51150.4 32752 lineto
51094.1 32695.8 lineto
50981.6 32639.5 lineto
50869.1 32639.5 lineto
50756.7 32695.8 lineto
50700.4 32752 lineto
50644.2 32864.5 lineto
50587.9 33089.5 lineto
50587.9 33370.7 lineto
50644.2 33595.7 lineto
50700.4 33708.2 lineto
50756.7 33764.4 lineto
50869.1 33820.6 lineto
stroke
newpath
51656.5 33820.6 moveto
52387.7 33820.6 lineto
51994 33370.7 lineto
52162.7 33370.7 lineto
52275.2 33314.4 lineto
52331.5 33258.2 lineto
52387.7 33145.7 lineto
52387.7 32864.5 lineto
52331.5 32752 lineto
52275.2 32695.8 lineto
52162.7 32639.5 lineto
51825.3 32639.5 lineto
51712.8 32695.8 lineto
51656.5 32752 lineto
stroke
newpath
52950.1 32639.5 moveto
53175.1 32639.5 lineto
53287.6 32695.8 lineto
53343.8 32752 lineto
53456.3 32920.7 lineto
53512.6 33145.7 lineto
53512.6 33595.7 lineto
53456.3 33708.2 lineto
53400.1 33764.4 lineto
53287.6 33820.6 lineto
53062.6 33820.6 lineto
52950.1 33764.4 lineto
52893.9 33708.2 lineto
52837.7 33595.7 lineto
52837.7 33314.4 lineto
52893.9 33202 lineto
52950.1 33145.7 lineto
53062.6 33089.5 lineto
53287.6 33089.5 lineto
53400.1 33145.7 lineto
53456.3 33202 lineto
53512.6 33314.4 lineto
stroke
newpath
53962.5 33820.6 moveto
53962.5 33595.7 lineto
stroke
newpath
54412.5 33820.6 moveto
54412.5 33595.7 lineto
stroke
newpath
56156 32189.6 moveto
56099.7 32245.8 lineto
55987.3 32414.6 lineto
55931 32527 lineto
55874.8 32695.8 lineto
55818.5 32977 lineto
55818.5 33202 lineto
55874.8 33483.2 lineto
55931 33651.9 lineto
55987.3 33764.4 lineto
56099.7 33933.1 lineto
56156 33989.4 lineto
stroke
newpath
57224.6 32639.5 moveto
56549.7 32639.5 lineto
stroke
newpath
56887.1 32639.5 moveto
56887.1 33820.6 lineto
56774.7 33651.9 lineto
56662.2 33539.4 lineto
56549.7 33483.2 lineto
stroke
newpath
57674.5 33708.2 moveto
57730.8 33764.4 lineto
57843.3 33820.6 lineto
58124.5 33820.6 lineto
58237 33764.4 lineto
58293.2 33708.2 lineto
58349.5 33595.7 lineto
58349.5 33483.2 lineto
58293.2 33314.4 lineto
57618.3 32639.5 lineto
58349.5 32639.5 lineto
stroke
newpath
59755.5 32639.5 moveto
59755.5 33820.6 lineto
stroke
newpath
60261.7 32639.5 moveto
60261.7 33258.2 lineto
60205.5 33370.7 lineto
60093 33426.9 lineto
59924.3 33426.9 lineto
59811.8 33370.7 lineto
59755.5 33314.4 lineto
stroke
newpath
60992.9 32639.5 moveto
60880.4 32695.8 lineto
60824.2 32752 lineto
60767.9 32864.5 lineto
60767.9 33202 lineto
60824.2 33314.4 lineto
60880.4 33370.7 lineto
60992.9 33426.9 lineto
61161.6 33426.9 lineto
61274.1 33370.7 lineto
61330.3 33314.4 lineto
61386.6 33202 lineto
61386.6 32864.5 lineto
61330.3 32752 lineto
61274.1 32695.8 lineto
61161.6 32639.5 lineto
60992.9 32639.5 lineto
stroke
newpath
62061.5 32639.5 moveto
61949 32695.8 lineto
61892.8 32808.3 lineto
61892.8 33820.6 lineto
stroke
newpath
62961.4 32695.8 moveto
62848.9 32639.5 lineto
62623.9 32639.5 lineto
62511.4 32695.8 lineto
62455.2 32808.3 lineto
62455.2 33258.2 lineto
62511.4 33370.7 lineto
62623.9 33426.9 lineto
62848.9 33426.9 lineto
62961.4 33370.7 lineto
63017.6 33258.2 lineto
63017.6 33145.7 lineto
62455.2 33033.2 lineto
stroke
newpath
63467.6 32695.8 moveto
63580.1 32639.5 lineto
63805 32639.5 lineto
63917.5 32695.8 lineto
63973.8 32808.3 lineto
63973.8 32864.5 lineto
63917.5 32977 lineto
63805 33033.2 lineto
63636.3 33033.2 lineto
63523.8 33089.5 lineto
63467.6 33202 lineto
63467.6 33258.2 lineto
63523.8 33370.7 lineto
63636.3 33426.9 lineto
63805 33426.9 lineto
63917.5 33370.7 lineto
stroke
newpath
64367.5 32189.6 moveto
64423.7 32245.8 lineto
64536.2 32414.6 lineto
64592.4 32527 lineto
64648.7 32695.8 lineto
64704.9 32977 lineto
64704.9 33202 lineto
64648.7 33483.2 lineto
64592.4 33651.9 lineto
64536.2 33764.4 lineto
64423.7 33933.1 lineto
64367.5 33989.4 lineto
stroke
showpage
grestore
%%EOF
