%!PS-Adobe-3.0
%%Creator: PCBNEW
%%CreationDate: Tue Nov 30 13:44:42 2021
%%Title: /home/jaroos/Desktop/EH-GENERIC_BOARD/EH-PCB/EH-GENERIC_BOARD-NPTH-drl_map.ps
%%Pages: 1
%%PageOrder: Ascend
%%BoundingBox: 0 0 596 842
%%DocumentMedia: A4 595 842 0 () ()
%%Orientation: Landscape
%%EndComments
%%BeginProlog
/line { newpath moveto lineto stroke } bind def
/cir0 { newpath 0 360 arc stroke } bind def
/cir1 { newpath 0 360 arc gsave fill grestore stroke } bind def
/cir2 { newpath 0 360 arc gsave fill grestore stroke } bind def
/arc0 { newpath arc stroke } bind def
/arc1 { newpath 4 index 4 index moveto arc closepath gsave fill
    grestore stroke } bind def
/arc2 { newpath 4 index 4 index moveto arc closepath gsave fill
    grestore stroke } bind def
/poly0 { stroke } bind def
/poly1 { closepath gsave fill grestore stroke } bind def
/poly2 { closepath gsave fill grestore stroke } bind def
/rect0 { rectstroke } bind def
/rect1 { rectfill } bind def
/rect2 { rectfill } bind def
/linemode0 { 0 setlinecap 0 setlinejoin 0 setlinewidth } bind def
/linemode1 { 1 setlinecap 1 setlinejoin } bind def
/dashedline { [200] 100 setdash } bind def
/solidline { [] 0 setdash } bind def
/phantomshow { moveto
    /KicadFont findfont 0.000001 scalefont setfont
    show } bind def
/textshow { gsave
    findfont exch scalefont setfont concat 1 scale 0 0 moveto show
    } bind def
/reencodefont {
  findfont dup length dict begin
  { 1 index /FID ne
    { def }
    { pop pop } ifelse
  } forall
  /Encoding ISOLatin1Encoding def
  currentdict
  end } bind def
/KicadFont /Helvetica reencodefont definefont pop
/KicadFont-Bold /Helvetica-Bold reencodefont definefont pop
/KicadFont-Oblique /Helvetica-Oblique reencodefont definefont pop
/KicadFont-BoldOblique /Helvetica-BoldOblique reencodefont definefont pop
%%EndProlog
%%Page: 1 1
%%BeginPageSetup
gsave
0.0072 0.0072 scale
linemode1
82680 0 translate 90 rotate
150 setlinewidth
%%EndPageSetup
0 0 0 setrgbcolor
177.165 setlinewidth
newpath
79135 75081 moveto
79135 40611 lineto
stroke
0 0 0 setrgbcolor
newpath
38245 40161 moveto
78625 40161 lineto
stroke
0 0 0 setrgbcolor
newpath
37795 75141 moveto
37795 40671 lineto
stroke
0 0 0 setrgbcolor
newpath
78685 75591 moveto
38305 75591 lineto
stroke
0 0 0 setrgbcolor
78655 75111 480.937 -3.57633 86.4237 arc0
0 0 0 setrgbcolor
78655 40641 480.937 -93.5763 -3.57633 arc0
0 0 0 setrgbcolor
38275 40641 480.937 176.424 266.424 arc0
0 0 0 setrgbcolor
38275 75111 480.937 86.4237 176.424 arc0
78.7394 setlinewidth
newpath
39704.8 44551.2 moveto
42185.2 42070.8 lineto
stroke
newpath
42185.2 44551.2 moveto
39704.8 42070.8 lineto
stroke
newpath
74485.9 73769.3 moveto
76966.3 71289 lineto
stroke
newpath
76966.3 73769.3 moveto
74485.9 71289 lineto
stroke
118.11 setlinewidth
0 0 0 setrgbcolor
0 0 0 setrgbcolor
newpath
38833.2 38238 moveto
38833.2 39419.1 lineto
39114.4 39419.1 lineto
39283.1 39362.8 lineto
39395.6 39250.3 lineto
39451.8 39137.8 lineto
39508.1 38912.9 lineto
39508.1 38744.1 lineto
39451.8 38519.2 lineto
39395.6 38406.7 lineto
39283.1 38294.2 lineto
39114.4 38238 lineto
38833.2 38238 lineto
stroke
newpath
40014.3 38238 moveto
40014.3 39025.4 lineto
stroke
newpath
40014.3 38800.4 moveto
40070.5 38912.9 lineto
40126.7 38969.1 lineto
40239.2 39025.4 lineto
40351.7 39025.4 lineto
stroke
newpath
40745.4 38238 moveto
40745.4 39025.4 lineto
stroke
newpath
40745.4 39419.1 moveto
40689.2 39362.8 lineto
40745.4 39306.6 lineto
40801.7 39362.8 lineto
40745.4 39419.1 lineto
40745.4 39306.6 lineto
stroke
newpath
41476.6 38238 moveto
41364.1 38294.2 lineto
41307.8 38406.7 lineto
41307.8 39419.1 lineto
stroke
newpath
42095.2 38238 moveto
41982.8 38294.2 lineto
41926.5 38406.7 lineto
41926.5 39419.1 lineto
stroke
newpath
43445.1 38238 moveto
43445.1 39419.1 lineto
43838.8 38575.4 lineto
44232.5 39419.1 lineto
44232.5 38238 lineto
stroke
newpath
45301.1 38238 moveto
45301.1 38856.6 lineto
45244.8 38969.1 lineto
45132.4 39025.4 lineto
44907.4 39025.4 lineto
44794.9 38969.1 lineto
stroke
newpath
45301.1 38294.2 moveto
45188.6 38238 lineto
44907.4 38238 lineto
44794.9 38294.2 lineto
44738.7 38406.7 lineto
44738.7 38519.2 lineto
44794.9 38631.7 lineto
44907.4 38687.9 lineto
45188.6 38687.9 lineto
45301.1 38744.1 lineto
stroke
newpath
45863.5 39025.4 moveto
45863.5 37844.3 lineto
stroke
newpath
45863.5 38969.1 moveto
45976 39025.4 lineto
46201 39025.4 lineto
46313.5 38969.1 lineto
46369.7 38912.9 lineto
46426 38800.4 lineto
46426 38462.9 lineto
46369.7 38350.4 lineto
46313.5 38294.2 lineto
46201 38238 lineto
45976 38238 lineto
45863.5 38294.2 lineto
stroke
newpath
46932.1 38350.4 moveto
46988.4 38294.2 lineto
46932.1 38238 lineto
46875.9 38294.2 lineto
46932.1 38350.4 lineto
46932.1 38238 lineto
stroke
newpath
46932.1 38969.1 moveto
46988.4 38912.9 lineto
46932.1 38856.6 lineto
46875.9 38912.9 lineto
46932.1 38969.1 lineto
46932.1 38856.6 lineto
stroke
newpath
35225.2 37532.1 moveto
37705.5 35051.8 lineto
stroke
newpath
37705.5 37532.1 moveto
35225.2 35051.8 lineto
stroke
0 0 0 setrgbcolor
0 0 0 setrgbcolor
newpath
38776.9 36826.3 moveto
38833.2 36882.5 lineto
38945.6 36938.7 lineto
39226.9 36938.7 lineto
39339.3 36882.5 lineto
39395.6 36826.3 lineto
39451.8 36713.8 lineto
39451.8 36601.3 lineto
39395.6 36432.6 lineto
38720.7 35757.6 lineto
39451.8 35757.6 lineto
stroke
newpath
39958 35870.1 moveto
40014.3 35813.9 lineto
39958 35757.6 lineto
39901.8 35813.9 lineto
39958 35870.1 lineto
39958 35757.6 lineto
stroke
newpath
41139.1 35757.6 moveto
40464.2 35757.6 lineto
stroke
newpath
40801.7 35757.6 moveto
40801.7 36938.7 lineto
40689.2 36770 lineto
40576.7 36657.5 lineto
40464.2 36601.3 lineto
stroke
newpath
41870.3 36938.7 moveto
41982.8 36938.7 lineto
42095.2 36882.5 lineto
42151.5 36826.3 lineto
42207.7 36713.8 lineto
42264 36488.8 lineto
42264 36207.6 lineto
42207.7 35982.6 lineto
42151.5 35870.1 lineto
42095.2 35813.9 lineto
41982.8 35757.6 lineto
41870.3 35757.6 lineto
41757.8 35813.9 lineto
41701.5 35870.1 lineto
41645.3 35982.6 lineto
41589.1 36207.6 lineto
41589.1 36488.8 lineto
41645.3 36713.8 lineto
41701.5 36826.3 lineto
41757.8 36882.5 lineto
41870.3 36938.7 lineto
stroke
newpath
42770.2 35757.6 moveto
42770.2 36545 lineto
stroke
newpath
42770.2 36432.6 moveto
42826.4 36488.8 lineto
42938.9 36545 lineto
43107.6 36545 lineto
43220.1 36488.8 lineto
43276.3 36376.3 lineto
43276.3 35757.6 lineto
stroke
newpath
43276.3 36376.3 moveto
43332.6 36488.8 lineto
43445.1 36545 lineto
43613.8 36545 lineto
43726.3 36488.8 lineto
43782.5 36376.3 lineto
43782.5 35757.6 lineto
stroke
newpath
44345 35757.6 moveto
44345 36545 lineto
stroke
newpath
44345 36432.6 moveto
44401.2 36488.8 lineto
44513.7 36545 lineto
44682.4 36545 lineto
44794.9 36488.8 lineto
44851.1 36376.3 lineto
44851.1 35757.6 lineto
stroke
newpath
44851.1 36376.3 moveto
44907.4 36488.8 lineto
45019.9 36545 lineto
45188.6 36545 lineto
45301.1 36488.8 lineto
45357.3 36376.3 lineto
45357.3 35757.6 lineto
stroke
newpath
47663.3 36995 moveto
46650.9 35476.4 lineto
stroke
newpath
49181.9 36938.7 moveto
49294.3 36938.7 lineto
49406.8 36882.5 lineto
49463.1 36826.3 lineto
49519.3 36713.8 lineto
49575.6 36488.8 lineto
49575.6 36207.6 lineto
49519.3 35982.6 lineto
49463.1 35870.1 lineto
49406.8 35813.9 lineto
49294.3 35757.6 lineto
49181.9 35757.6 lineto
49069.4 35813.9 lineto
49013.1 35870.1 lineto
48956.9 35982.6 lineto
48900.6 36207.6 lineto
48900.6 36488.8 lineto
48956.9 36713.8 lineto
49013.1 36826.3 lineto
49069.4 36882.5 lineto
49181.9 36938.7 lineto
stroke
newpath
50081.7 35870.1 moveto
50138 35813.9 lineto
50081.7 35757.6 lineto
50025.5 35813.9 lineto
50081.7 35870.1 lineto
50081.7 35757.6 lineto
stroke
newpath
50869.1 36938.7 moveto
50981.6 36938.7 lineto
51094.1 36882.5 lineto
51150.4 36826.3 lineto
51206.6 36713.8 lineto
51262.8 36488.8 lineto
51262.8 36207.6 lineto
51206.6 35982.6 lineto
51150.4 35870.1 lineto
51094.1 35813.9 lineto
50981.6 35757.6 lineto
50869.1 35757.6 lineto
50756.7 35813.9 lineto
50700.4 35870.1 lineto
50644.2 35982.6 lineto
50587.9 36207.6 lineto
50587.9 36488.8 lineto
50644.2 36713.8 lineto
50700.4 36826.3 lineto
50756.7 36882.5 lineto
50869.1 36938.7 lineto
stroke
newpath
51937.8 36432.6 moveto
51825.3 36488.8 lineto
51769 36545 lineto
51712.8 36657.5 lineto
51712.8 36713.8 lineto
51769 36826.3 lineto
51825.3 36882.5 lineto
51937.8 36938.7 lineto
52162.7 36938.7 lineto
52275.2 36882.5 lineto
52331.5 36826.3 lineto
52387.7 36713.8 lineto
52387.7 36657.5 lineto
52331.5 36545 lineto
52275.2 36488.8 lineto
52162.7 36432.6 lineto
51937.8 36432.6 lineto
51825.3 36376.3 lineto
51769 36320.1 lineto
51712.8 36207.6 lineto
51712.8 35982.6 lineto
51769 35870.1 lineto
51825.3 35813.9 lineto
51937.8 35757.6 lineto
52162.7 35757.6 lineto
52275.2 35813.9 lineto
52331.5 35870.1 lineto
52387.7 35982.6 lineto
52387.7 36207.6 lineto
52331.5 36320.1 lineto
52275.2 36376.3 lineto
52162.7 36432.6 lineto
stroke
newpath
52781.4 36938.7 moveto
53512.6 36938.7 lineto
53118.9 36488.8 lineto
53287.6 36488.8 lineto
53400.1 36432.6 lineto
53456.3 36376.3 lineto
53512.6 36263.8 lineto
53512.6 35982.6 lineto
53456.3 35870.1 lineto
53400.1 35813.9 lineto
53287.6 35757.6 lineto
52950.1 35757.6 lineto
52837.7 35813.9 lineto
52781.4 35870.1 lineto
stroke
newpath
53962.5 36938.7 moveto
53962.5 36713.8 lineto
stroke
newpath
54412.5 36938.7 moveto
54412.5 36713.8 lineto
stroke
newpath
56156 35307.7 moveto
56099.7 35363.9 lineto
55987.3 35532.7 lineto
55931 35645.2 lineto
55874.8 35813.9 lineto
55818.5 36095.1 lineto
55818.5 36320.1 lineto
55874.8 36601.3 lineto
55931 36770 lineto
55987.3 36882.5 lineto
56099.7 37051.2 lineto
56156 37107.5 lineto
stroke
newpath
56549.7 36826.3 moveto
56605.9 36882.5 lineto
56718.4 36938.7 lineto
56999.6 36938.7 lineto
57112.1 36882.5 lineto
57168.4 36826.3 lineto
57224.6 36713.8 lineto
57224.6 36601.3 lineto
57168.4 36432.6 lineto
56493.4 35757.6 lineto
57224.6 35757.6 lineto
stroke
newpath
58630.7 35757.6 moveto
58630.7 36938.7 lineto
stroke
newpath
59136.9 35757.6 moveto
59136.9 36376.3 lineto
59080.6 36488.8 lineto
58968.1 36545 lineto
58799.4 36545 lineto
58686.9 36488.8 lineto
58630.7 36432.6 lineto
stroke
newpath
59868 35757.6 moveto
59755.5 35813.9 lineto
59699.3 35870.1 lineto
59643 35982.6 lineto
59643 36320.1 lineto
59699.3 36432.6 lineto
59755.5 36488.8 lineto
59868 36545 lineto
60036.8 36545 lineto
60149.2 36488.8 lineto
60205.5 36432.6 lineto
60261.7 36320.1 lineto
60261.7 35982.6 lineto
60205.5 35870.1 lineto
60149.2 35813.9 lineto
60036.8 35757.6 lineto
59868 35757.6 lineto
stroke
newpath
60936.6 35757.6 moveto
60824.2 35813.9 lineto
60767.9 35926.4 lineto
60767.9 36938.7 lineto
stroke
newpath
61836.5 35813.9 moveto
61724 35757.6 lineto
61499.1 35757.6 lineto
61386.6 35813.9 lineto
61330.3 35926.4 lineto
61330.3 36376.3 lineto
61386.6 36488.8 lineto
61499.1 36545 lineto
61724 36545 lineto
61836.5 36488.8 lineto
61892.8 36376.3 lineto
61892.8 36263.8 lineto
61330.3 36151.3 lineto
stroke
newpath
62342.7 35813.9 moveto
62455.2 35757.6 lineto
62680.2 35757.6 lineto
62792.7 35813.9 lineto
62848.9 35926.4 lineto
62848.9 35982.6 lineto
62792.7 36095.1 lineto
62680.2 36151.3 lineto
62511.4 36151.3 lineto
62399 36207.6 lineto
62342.7 36320.1 lineto
62342.7 36376.3 lineto
62399 36488.8 lineto
62511.4 36545 lineto
62680.2 36545 lineto
62792.7 36488.8 lineto
stroke
newpath
63242.6 35307.7 moveto
63298.8 35363.9 lineto
63411.3 35532.7 lineto
63467.6 35645.2 lineto
63523.8 35813.9 lineto
63580.1 36095.1 lineto
63580.1 36320.1 lineto
63523.8 36601.3 lineto
63467.6 36770 lineto
63411.3 36882.5 lineto
63298.8 37051.2 lineto
63242.6 37107.5 lineto
stroke
newpath
65379.8 35307.7 moveto
65323.6 35363.9 lineto
65211.1 35532.7 lineto
65154.9 35645.2 lineto
65098.6 35813.9 lineto
65042.4 36095.1 lineto
65042.4 36320.1 lineto
65098.6 36601.3 lineto
65154.9 36770 lineto
65211.1 36882.5 lineto
65323.6 37051.2 lineto
65379.8 37107.5 lineto
stroke
newpath
65829.8 36545 moveto
65829.8 35757.6 lineto
stroke
newpath
65829.8 36432.6 moveto
65886 36488.8 lineto
65998.5 36545 lineto
66167.2 36545 lineto
66279.7 36488.8 lineto
66336 36376.3 lineto
66336 35757.6 lineto
stroke
newpath
67067.1 35757.6 moveto
66954.6 35813.9 lineto
66898.4 35870.1 lineto
66842.1 35982.6 lineto
66842.1 36320.1 lineto
66898.4 36432.6 lineto
66954.6 36488.8 lineto
67067.1 36545 lineto
67235.9 36545 lineto
67348.3 36488.8 lineto
67404.6 36432.6 lineto
67460.8 36320.1 lineto
67460.8 35982.6 lineto
67404.6 35870.1 lineto
67348.3 35813.9 lineto
67235.9 35757.6 lineto
67067.1 35757.6 lineto
stroke
newpath
67798.3 36545 moveto
68248.2 36545 lineto
stroke
newpath
67967 36938.7 moveto
67967 35926.4 lineto
68023.3 35813.9 lineto
68135.7 35757.6 lineto
68248.2 35757.6 lineto
stroke
newpath
69541.8 36545 moveto
69541.8 35363.9 lineto
stroke
newpath
69541.8 36488.8 moveto
69654.3 36545 lineto
69879.3 36545 lineto
69991.8 36488.8 lineto
70048 36432.6 lineto
70104.2 36320.1 lineto
70104.2 35982.6 lineto
70048 35870.1 lineto
69991.8 35813.9 lineto
69879.3 35757.6 lineto
69654.3 35757.6 lineto
69541.8 35813.9 lineto
stroke
newpath
70779.2 35757.6 moveto
70666.7 35813.9 lineto
70610.4 35926.4 lineto
70610.4 36938.7 lineto
stroke
newpath
71735.3 35757.6 moveto
71735.3 36376.3 lineto
71679 36488.8 lineto
71566.6 36545 lineto
71341.6 36545 lineto
71229.1 36488.8 lineto
stroke
newpath
71735.3 35813.9 moveto
71622.8 35757.6 lineto
71341.6 35757.6 lineto
71229.1 35813.9 lineto
71172.9 35926.4 lineto
71172.9 36038.9 lineto
71229.1 36151.3 lineto
71341.6 36207.6 lineto
71622.8 36207.6 lineto
71735.3 36263.8 lineto
stroke
newpath
72129 36545 moveto
72578.9 36545 lineto
stroke
newpath
72297.7 36938.7 moveto
72297.7 35926.4 lineto
72354 35813.9 lineto
72466.4 35757.6 lineto
72578.9 35757.6 lineto
stroke
newpath
73422.6 35813.9 moveto
73310.1 35757.6 lineto
73085.1 35757.6 lineto
72972.6 35813.9 lineto
72916.4 35926.4 lineto
72916.4 36376.3 lineto
72972.6 36488.8 lineto
73085.1 36545 lineto
73310.1 36545 lineto
73422.6 36488.8 lineto
73478.8 36376.3 lineto
73478.8 36263.8 lineto
72916.4 36151.3 lineto
stroke
newpath
74491.2 35757.6 moveto
74491.2 36938.7 lineto
stroke
newpath
74491.2 35813.9 moveto
74378.7 35757.6 lineto
74153.7 35757.6 lineto
74041.3 35813.9 lineto
73985 35870.1 lineto
73928.8 35982.6 lineto
73928.8 36320.1 lineto
73985 36432.6 lineto
74041.3 36488.8 lineto
74153.7 36545 lineto
74378.7 36545 lineto
74491.2 36488.8 lineto
stroke
newpath
74941.1 35307.7 moveto
74997.4 35363.9 lineto
75109.9 35532.7 lineto
75166.1 35645.2 lineto
75222.4 35813.9 lineto
75278.6 36095.1 lineto
75278.6 36320.1 lineto
75222.4 36601.3 lineto
75166.1 36770 lineto
75109.9 36882.5 lineto
74997.4 37051.2 lineto
74941.1 37107.5 lineto
stroke
showpage
grestore
%%EOF
