M48
; DRILL file {KiCad 5.1.7-a382d34a88~90~ubuntu20.04.1} date Wed Nov  3 09:55:33 2021
; FORMAT={-:-/ absolute / inch / decimal}
; #@! TF.CreationDate,2021-11-03T09:55:33+05:30
; #@! TF.GenerationSoftware,Kicad,Pcbnew,5.1.7-a382d34a88~90~ubuntu20.04.1
; #@! TF.FileFunction,NonPlated,1,2,NPTH
FMAT,2
INCH
T1C0.0827
%
G90
G05
T1
X4.4144Y-2.2211
X3.255Y-3.195
T0
M30
