%TF.GenerationSoftware,KiCad,Pcbnew,5.1.7-a382d34a88~90~ubuntu20.04.1*%
%TF.CreationDate,2021-10-28T14:58:43+05:30*%
%TF.ProjectId,EH-GENERIC_BOARD,45482d47-454e-4455-9249-435f424f4152,rev?*%
%TF.SameCoordinates,Original*%
%TF.FileFunction,Paste,Top*%
%TF.FilePolarity,Positive*%
%FSLAX46Y46*%
G04 Gerber Fmt 4.6, Leading zero omitted, Abs format (unit mm)*
G04 Created by KiCad (PCBNEW 5.1.7-a382d34a88~90~ubuntu20.04.1) date 2021-10-28 14:58:43*
%MOMM*%
%LPD*%
G01*
G04 APERTURE LIST*
%ADD10R,0.800000X0.900000*%
%ADD11C,0.100000*%
%ADD12R,0.250000X0.250000*%
G04 APERTURE END LIST*
%TO.C,L1*%
G36*
G01*
X87757250Y-69826000D02*
X86994750Y-69826000D01*
G75*
G02*
X86776000Y-69607250I0J218750D01*
G01*
X86776000Y-69169750D01*
G75*
G02*
X86994750Y-68951000I218750J0D01*
G01*
X87757250Y-68951000D01*
G75*
G02*
X87976000Y-69169750I0J-218750D01*
G01*
X87976000Y-69607250D01*
G75*
G02*
X87757250Y-69826000I-218750J0D01*
G01*
G37*
G36*
G01*
X87757250Y-67701000D02*
X86994750Y-67701000D01*
G75*
G02*
X86776000Y-67482250I0J218750D01*
G01*
X86776000Y-67044750D01*
G75*
G02*
X86994750Y-66826000I218750J0D01*
G01*
X87757250Y-66826000D01*
G75*
G02*
X87976000Y-67044750I0J-218750D01*
G01*
X87976000Y-67482250D01*
G75*
G02*
X87757250Y-67701000I-218750J0D01*
G01*
G37*
%TD*%
%TO.C,C1*%
G36*
G01*
X85928500Y-73690500D02*
X85928500Y-72740500D01*
G75*
G02*
X86178500Y-72490500I250000J0D01*
G01*
X86678500Y-72490500D01*
G75*
G02*
X86928500Y-72740500I0J-250000D01*
G01*
X86928500Y-73690500D01*
G75*
G02*
X86678500Y-73940500I-250000J0D01*
G01*
X86178500Y-73940500D01*
G75*
G02*
X85928500Y-73690500I0J250000D01*
G01*
G37*
G36*
G01*
X87828500Y-73690500D02*
X87828500Y-72740500D01*
G75*
G02*
X88078500Y-72490500I250000J0D01*
G01*
X88578500Y-72490500D01*
G75*
G02*
X88828500Y-72740500I0J-250000D01*
G01*
X88828500Y-73690500D01*
G75*
G02*
X88578500Y-73940500I-250000J0D01*
G01*
X88078500Y-73940500D01*
G75*
G02*
X87828500Y-73690500I0J250000D01*
G01*
G37*
%TD*%
%TO.C,C2*%
G36*
G01*
X86899000Y-63457001D02*
X86899000Y-61256999D01*
G75*
G02*
X87148999Y-61007000I249999J0D01*
G01*
X87799001Y-61007000D01*
G75*
G02*
X88049000Y-61256999I0J-249999D01*
G01*
X88049000Y-63457001D01*
G75*
G02*
X87799001Y-63707000I-249999J0D01*
G01*
X87148999Y-63707000D01*
G75*
G02*
X86899000Y-63457001I0J249999D01*
G01*
G37*
G36*
G01*
X89849000Y-63457001D02*
X89849000Y-61256999D01*
G75*
G02*
X90098999Y-61007000I249999J0D01*
G01*
X90749001Y-61007000D01*
G75*
G02*
X90999000Y-61256999I0J-249999D01*
G01*
X90999000Y-63457001D01*
G75*
G02*
X90749001Y-63707000I-249999J0D01*
G01*
X90098999Y-63707000D01*
G75*
G02*
X89849000Y-63457001I0J249999D01*
G01*
G37*
%TD*%
%TO.C,C3*%
G36*
G01*
X86850000Y-58758001D02*
X86850000Y-56557999D01*
G75*
G02*
X87099999Y-56308000I249999J0D01*
G01*
X87750001Y-56308000D01*
G75*
G02*
X88000000Y-56557999I0J-249999D01*
G01*
X88000000Y-58758001D01*
G75*
G02*
X87750001Y-59008000I-249999J0D01*
G01*
X87099999Y-59008000D01*
G75*
G02*
X86850000Y-58758001I0J249999D01*
G01*
G37*
G36*
G01*
X89800000Y-58758001D02*
X89800000Y-56557999D01*
G75*
G02*
X90049999Y-56308000I249999J0D01*
G01*
X90700001Y-56308000D01*
G75*
G02*
X90950000Y-56557999I0J-249999D01*
G01*
X90950000Y-58758001D01*
G75*
G02*
X90700001Y-59008000I-249999J0D01*
G01*
X90049999Y-59008000D01*
G75*
G02*
X89800000Y-58758001I0J249999D01*
G01*
G37*
%TD*%
%TO.C,C4*%
G36*
G01*
X106809000Y-74211000D02*
X106809000Y-73871000D01*
G75*
G02*
X106949000Y-73731000I140000J0D01*
G01*
X107229000Y-73731000D01*
G75*
G02*
X107369000Y-73871000I0J-140000D01*
G01*
X107369000Y-74211000D01*
G75*
G02*
X107229000Y-74351000I-140000J0D01*
G01*
X106949000Y-74351000D01*
G75*
G02*
X106809000Y-74211000I0J140000D01*
G01*
G37*
G36*
G01*
X107769000Y-74211000D02*
X107769000Y-73871000D01*
G75*
G02*
X107909000Y-73731000I140000J0D01*
G01*
X108189000Y-73731000D01*
G75*
G02*
X108329000Y-73871000I0J-140000D01*
G01*
X108329000Y-74211000D01*
G75*
G02*
X108189000Y-74351000I-140000J0D01*
G01*
X107909000Y-74351000D01*
G75*
G02*
X107769000Y-74211000I0J140000D01*
G01*
G37*
%TD*%
%TO.C,C5*%
G36*
G01*
X104002000Y-59859999D02*
X104002000Y-62060001D01*
G75*
G02*
X103752001Y-62310000I-249999J0D01*
G01*
X103101999Y-62310000D01*
G75*
G02*
X102852000Y-62060001I0J249999D01*
G01*
X102852000Y-59859999D01*
G75*
G02*
X103101999Y-59610000I249999J0D01*
G01*
X103752001Y-59610000D01*
G75*
G02*
X104002000Y-59859999I0J-249999D01*
G01*
G37*
G36*
G01*
X106952000Y-59859999D02*
X106952000Y-62060001D01*
G75*
G02*
X106702001Y-62310000I-249999J0D01*
G01*
X106051999Y-62310000D01*
G75*
G02*
X105802000Y-62060001I0J249999D01*
G01*
X105802000Y-59859999D01*
G75*
G02*
X106051999Y-59610000I249999J0D01*
G01*
X106702001Y-59610000D01*
G75*
G02*
X106952000Y-59859999I0J-249999D01*
G01*
G37*
%TD*%
%TO.C,L2*%
G36*
G01*
X105434500Y-67227500D02*
X103734500Y-67227500D01*
G75*
G02*
X103484500Y-66977500I0J250000D01*
G01*
X103484500Y-66227500D01*
G75*
G02*
X103734500Y-65977500I250000J0D01*
G01*
X105434500Y-65977500D01*
G75*
G02*
X105684500Y-66227500I0J-250000D01*
G01*
X105684500Y-66977500D01*
G75*
G02*
X105434500Y-67227500I-250000J0D01*
G01*
G37*
G36*
G01*
X105434500Y-65077500D02*
X103734500Y-65077500D01*
G75*
G02*
X103484500Y-64827500I0J250000D01*
G01*
X103484500Y-64077500D01*
G75*
G02*
X103734500Y-63827500I250000J0D01*
G01*
X105434500Y-63827500D01*
G75*
G02*
X105684500Y-64077500I0J-250000D01*
G01*
X105684500Y-64827500D01*
G75*
G02*
X105434500Y-65077500I-250000J0D01*
G01*
G37*
%TD*%
D10*
%TO.C,Q1*%
X86426000Y-78978000D03*
X88326000Y-78978000D03*
X87376000Y-76978000D03*
%TD*%
%TO.C,R1*%
G36*
G01*
X102663500Y-73527500D02*
X102663500Y-73157500D01*
G75*
G02*
X102798500Y-73022500I135000J0D01*
G01*
X103068500Y-73022500D01*
G75*
G02*
X103203500Y-73157500I0J-135000D01*
G01*
X103203500Y-73527500D01*
G75*
G02*
X103068500Y-73662500I-135000J0D01*
G01*
X102798500Y-73662500D01*
G75*
G02*
X102663500Y-73527500I0J135000D01*
G01*
G37*
G36*
G01*
X103683500Y-73527500D02*
X103683500Y-73157500D01*
G75*
G02*
X103818500Y-73022500I135000J0D01*
G01*
X104088500Y-73022500D01*
G75*
G02*
X104223500Y-73157500I0J-135000D01*
G01*
X104223500Y-73527500D01*
G75*
G02*
X104088500Y-73662500I-135000J0D01*
G01*
X103818500Y-73662500D01*
G75*
G02*
X103683500Y-73527500I0J135000D01*
G01*
G37*
%TD*%
%TO.C,R2*%
G36*
G01*
X103679500Y-74861000D02*
X103679500Y-74491000D01*
G75*
G02*
X103814500Y-74356000I135000J0D01*
G01*
X104084500Y-74356000D01*
G75*
G02*
X104219500Y-74491000I0J-135000D01*
G01*
X104219500Y-74861000D01*
G75*
G02*
X104084500Y-74996000I-135000J0D01*
G01*
X103814500Y-74996000D01*
G75*
G02*
X103679500Y-74861000I0J135000D01*
G01*
G37*
G36*
G01*
X102659500Y-74861000D02*
X102659500Y-74491000D01*
G75*
G02*
X102794500Y-74356000I135000J0D01*
G01*
X103064500Y-74356000D01*
G75*
G02*
X103199500Y-74491000I0J-135000D01*
G01*
X103199500Y-74861000D01*
G75*
G02*
X103064500Y-74996000I-135000J0D01*
G01*
X102794500Y-74996000D01*
G75*
G02*
X102659500Y-74861000I0J135000D01*
G01*
G37*
%TD*%
D11*
%TO.C,U1*%
G36*
X91068596Y-67055025D02*
G01*
X91068881Y-67054087D01*
X91069343Y-67053222D01*
X91069964Y-67052464D01*
X91070722Y-67051843D01*
X91071587Y-67051381D01*
X91072525Y-67051096D01*
X91073500Y-67051000D01*
X92773500Y-67051000D01*
X92773561Y-67051006D01*
X92773745Y-67051006D01*
X92774234Y-67051054D01*
X92774415Y-67051090D01*
X92774475Y-67051096D01*
X92774534Y-67051114D01*
X92774715Y-67051150D01*
X92775184Y-67051292D01*
X92775360Y-67051365D01*
X92775413Y-67051381D01*
X92775462Y-67051407D01*
X92775638Y-67051480D01*
X92776071Y-67051711D01*
X92776228Y-67051816D01*
X92776278Y-67051843D01*
X92776324Y-67051881D01*
X92776478Y-67051984D01*
X92776858Y-67052295D01*
X92776986Y-67052423D01*
X92777036Y-67052464D01*
X92777077Y-67052514D01*
X92777205Y-67052642D01*
X92777516Y-67053022D01*
X92777619Y-67053176D01*
X92777657Y-67053222D01*
X92777684Y-67053272D01*
X92777789Y-67053429D01*
X92778020Y-67053862D01*
X92778093Y-67054038D01*
X92778119Y-67054087D01*
X92778135Y-67054139D01*
X92778208Y-67054316D01*
X92778350Y-67054785D01*
X92778386Y-67054967D01*
X92778404Y-67055025D01*
X92778410Y-67055085D01*
X92778446Y-67055266D01*
X92778494Y-67055755D01*
X92778494Y-67055939D01*
X92778500Y-67056000D01*
X92778500Y-69706000D01*
X92778404Y-69706975D01*
X92778119Y-69707913D01*
X92777657Y-69708778D01*
X92777036Y-69709536D01*
X92727036Y-69759536D01*
X92726278Y-69760157D01*
X92725413Y-69760619D01*
X92724475Y-69760904D01*
X92723500Y-69761000D01*
X91911233Y-69761000D01*
X91911233Y-68680699D01*
X91935767Y-68680699D01*
X91960183Y-68678294D01*
X91984245Y-68673508D01*
X92007722Y-68666386D01*
X92030389Y-68656997D01*
X92052026Y-68645432D01*
X92072425Y-68631802D01*
X92091390Y-68616238D01*
X92108738Y-68598890D01*
X92124302Y-68579925D01*
X92137932Y-68559526D01*
X92149497Y-68537889D01*
X92158886Y-68515222D01*
X92166008Y-68491745D01*
X92170794Y-68467683D01*
X92173199Y-68443267D01*
X92173199Y-68418733D01*
X92170794Y-68394317D01*
X92166008Y-68370255D01*
X92158886Y-68346778D01*
X92149497Y-68324111D01*
X92137932Y-68302474D01*
X92124302Y-68282075D01*
X92108738Y-68263110D01*
X92091390Y-68245762D01*
X92072425Y-68230198D01*
X92052026Y-68216568D01*
X92030389Y-68205003D01*
X92007722Y-68195614D01*
X91984245Y-68188492D01*
X91960183Y-68183706D01*
X91935767Y-68181301D01*
X91911233Y-68181301D01*
X91886817Y-68183706D01*
X91862755Y-68188492D01*
X91839278Y-68195614D01*
X91816611Y-68205003D01*
X91794974Y-68216568D01*
X91774575Y-68230198D01*
X91755610Y-68245762D01*
X91738262Y-68263110D01*
X91722698Y-68282075D01*
X91709068Y-68302474D01*
X91697503Y-68324111D01*
X91688114Y-68346778D01*
X91680992Y-68370255D01*
X91676206Y-68394317D01*
X91673801Y-68418733D01*
X91673801Y-68443267D01*
X91676206Y-68467683D01*
X91680992Y-68491745D01*
X91688114Y-68515222D01*
X91697503Y-68537889D01*
X91709068Y-68559526D01*
X91722698Y-68579925D01*
X91738262Y-68598890D01*
X91755610Y-68616238D01*
X91774575Y-68631802D01*
X91794974Y-68645432D01*
X91816611Y-68656997D01*
X91839278Y-68666386D01*
X91862755Y-68673508D01*
X91886817Y-68678294D01*
X91911233Y-68680699D01*
X91911233Y-69761000D01*
X91073500Y-69761000D01*
X91072525Y-69760904D01*
X91071587Y-69760619D01*
X91070722Y-69760157D01*
X91069964Y-69759536D01*
X91069343Y-69758778D01*
X91068881Y-69757913D01*
X91068596Y-69756975D01*
X91068500Y-69756000D01*
X91068500Y-67056000D01*
X91068596Y-67055025D01*
G37*
D12*
X93143500Y-69646000D03*
X93143500Y-69146000D03*
X93143500Y-68646000D03*
X93143500Y-68146000D03*
X93143500Y-67646000D03*
X93143500Y-67146000D03*
X90693500Y-67146000D03*
X90693500Y-67646000D03*
X90693500Y-68146000D03*
X90693500Y-68646000D03*
X90693500Y-69146000D03*
X90693500Y-69646000D03*
%TD*%
%TO.C,U2*%
X106122000Y-68405000D03*
X106622000Y-68405000D03*
X107122000Y-68405000D03*
X107622000Y-68405000D03*
X108122000Y-68405000D03*
X108622000Y-68405000D03*
X108622000Y-70855000D03*
X108122000Y-70855000D03*
X107622000Y-70855000D03*
X107122000Y-70855000D03*
X106622000Y-70855000D03*
X106122000Y-70855000D03*
D11*
G36*
X108712975Y-68780096D02*
G01*
X108713913Y-68780381D01*
X108714778Y-68780843D01*
X108715536Y-68781464D01*
X108716157Y-68782222D01*
X108716619Y-68783087D01*
X108716904Y-68784025D01*
X108717000Y-68785000D01*
X108717000Y-70485000D01*
X108716994Y-70485061D01*
X108716994Y-70485245D01*
X108716946Y-70485734D01*
X108716910Y-70485915D01*
X108716904Y-70485975D01*
X108716886Y-70486034D01*
X108716850Y-70486215D01*
X108716708Y-70486684D01*
X108716635Y-70486860D01*
X108716619Y-70486913D01*
X108716593Y-70486962D01*
X108716520Y-70487138D01*
X108716289Y-70487571D01*
X108716184Y-70487728D01*
X108716157Y-70487778D01*
X108716119Y-70487824D01*
X108716016Y-70487978D01*
X108715705Y-70488358D01*
X108715577Y-70488486D01*
X108715536Y-70488536D01*
X108715486Y-70488577D01*
X108715358Y-70488705D01*
X108714978Y-70489016D01*
X108714824Y-70489119D01*
X108714778Y-70489157D01*
X108714728Y-70489184D01*
X108714571Y-70489289D01*
X108714138Y-70489520D01*
X108713962Y-70489593D01*
X108713913Y-70489619D01*
X108713861Y-70489635D01*
X108713684Y-70489708D01*
X108713215Y-70489850D01*
X108713033Y-70489886D01*
X108712975Y-70489904D01*
X108712915Y-70489910D01*
X108712734Y-70489946D01*
X108712245Y-70489994D01*
X108712061Y-70489994D01*
X108712000Y-70490000D01*
X106062000Y-70490000D01*
X106061025Y-70489904D01*
X106060087Y-70489619D01*
X106059222Y-70489157D01*
X106058464Y-70488536D01*
X106008464Y-70438536D01*
X106007843Y-70437778D01*
X106007381Y-70436913D01*
X106007096Y-70435975D01*
X106007000Y-70435000D01*
X106007000Y-69622733D01*
X107087301Y-69622733D01*
X107087301Y-69647267D01*
X107089706Y-69671683D01*
X107094492Y-69695745D01*
X107101614Y-69719222D01*
X107111003Y-69741889D01*
X107122568Y-69763526D01*
X107136198Y-69783925D01*
X107151762Y-69802890D01*
X107169110Y-69820238D01*
X107188075Y-69835802D01*
X107208474Y-69849432D01*
X107230111Y-69860997D01*
X107252778Y-69870386D01*
X107276255Y-69877508D01*
X107300317Y-69882294D01*
X107324733Y-69884699D01*
X107349267Y-69884699D01*
X107373683Y-69882294D01*
X107397745Y-69877508D01*
X107421222Y-69870386D01*
X107443889Y-69860997D01*
X107465526Y-69849432D01*
X107485925Y-69835802D01*
X107504890Y-69820238D01*
X107522238Y-69802890D01*
X107537802Y-69783925D01*
X107551432Y-69763526D01*
X107562997Y-69741889D01*
X107572386Y-69719222D01*
X107579508Y-69695745D01*
X107584294Y-69671683D01*
X107586699Y-69647267D01*
X107586699Y-69622733D01*
X107584294Y-69598317D01*
X107579508Y-69574255D01*
X107572386Y-69550778D01*
X107562997Y-69528111D01*
X107551432Y-69506474D01*
X107537802Y-69486075D01*
X107522238Y-69467110D01*
X107504890Y-69449762D01*
X107485925Y-69434198D01*
X107465526Y-69420568D01*
X107443889Y-69409003D01*
X107421222Y-69399614D01*
X107397745Y-69392492D01*
X107373683Y-69387706D01*
X107349267Y-69385301D01*
X107324733Y-69385301D01*
X107300317Y-69387706D01*
X107276255Y-69392492D01*
X107252778Y-69399614D01*
X107230111Y-69409003D01*
X107208474Y-69420568D01*
X107188075Y-69434198D01*
X107169110Y-69449762D01*
X107151762Y-69467110D01*
X107136198Y-69486075D01*
X107122568Y-69506474D01*
X107111003Y-69528111D01*
X107101614Y-69550778D01*
X107094492Y-69574255D01*
X107089706Y-69598317D01*
X107087301Y-69622733D01*
X106007000Y-69622733D01*
X106007000Y-68785000D01*
X106007096Y-68784025D01*
X106007381Y-68783087D01*
X106007843Y-68782222D01*
X106008464Y-68781464D01*
X106009222Y-68780843D01*
X106010087Y-68780381D01*
X106011025Y-68780096D01*
X106012000Y-68780000D01*
X108712000Y-68780000D01*
X108712975Y-68780096D01*
G37*
%TD*%
M02*
