%!PS-Adobe-3.0
%%Creator: PCBNEW
%%CreationDate: Tue Nov  3 15:04:49 2020
%%Title: /home/jaison/Documents/Jaison/8_10_2020/Ultrasonic_Level_Sensor_v1.15/Gerber_File_v1.15/Ultrasonic_Level_Sensor-PTH-drl_map.ps
%%Pages: 1
%%PageOrder: Ascend
%%BoundingBox: 0 0 596 842
%%DocumentMedia: A4 595 842 0 () ()
%%Orientation: Landscape
%%EndComments
%%BeginProlog
/line { newpath moveto lineto stroke } bind def
/cir0 { newpath 0 360 arc stroke } bind def
/cir1 { newpath 0 360 arc gsave fill grestore stroke } bind def
/cir2 { newpath 0 360 arc gsave fill grestore stroke } bind def
/arc0 { newpath arc stroke } bind def
/arc1 { newpath 4 index 4 index moveto arc closepath gsave fill
    grestore stroke } bind def
/arc2 { newpath 4 index 4 index moveto arc closepath gsave fill
    grestore stroke } bind def
/poly0 { stroke } bind def
/poly1 { closepath gsave fill grestore stroke } bind def
/poly2 { closepath gsave fill grestore stroke } bind def
/rect0 { rectstroke } bind def
/rect1 { rectfill } bind def
/rect2 { rectfill } bind def
/linemode0 { 0 setlinecap 0 setlinejoin 0 setlinewidth } bind def
/linemode1 { 1 setlinecap 1 setlinejoin } bind def
/dashedline { [200] 100 setdash } bind def
/solidline { [] 0 setdash } bind def
/phantomshow { moveto
    /KicadFont findfont 0.000001 scalefont setfont
    show } bind def
/textshow { gsave
    findfont exch scalefont setfont concat 1 scale 0 0 moveto show
    } bind def
/reencodefont {
  findfont dup length dict begin
  { 1 index /FID ne
    { def }
    { pop pop } ifelse
  } forall
  /Encoding ISOLatin1Encoding def
  currentdict
  end } bind def
/KicadFont /Helvetica reencodefont definefont pop
/KicadFont-Bold /Helvetica-Bold reencodefont definefont pop
/KicadFont-Oblique /Helvetica-Oblique reencodefont definefont pop
/KicadFont-BoldOblique /Helvetica-BoldOblique reencodefont definefont pop
%%EndProlog
%%Page: 1 1
%%BeginPageSetup
gsave
0.0072 0.0072 scale
linemode1
82680 0 translate 90 rotate
80.1606 setlinewidth
%%EndPageSetup
0 0 0 setrgbcolor
75.7423 setlinewidth
58465 57876 20829.1 cir0
78.7398 setlinewidth
newpath
39369.3 62586.6 moveto
39558.6 62397.2 lineto
stroke
newpath
39558.6 62586.6 moveto
39369.3 62397.2 lineto
stroke
newpath
39369.3 62064 moveto
39558.6 61874.6 lineto
stroke
newpath
39558.6 62064 moveto
39369.3 61874.6 lineto
stroke
newpath
39582.5 60197.8 moveto
39771.8 60008.5 lineto
stroke
newpath
39771.8 60197.8 moveto
39582.5 60008.5 lineto
stroke
newpath
39582.8 57402.6 moveto
39772.2 57213.3 lineto
stroke
newpath
39772.2 57402.6 moveto
39582.8 57213.3 lineto
stroke
newpath
39590.5 59636.7 moveto
39779.9 59447.3 lineto
stroke
newpath
39779.9 59636.7 moveto
39590.5 59447.3 lineto
stroke
newpath
39590.5 59083.6 moveto
39779.9 58894.2 lineto
stroke
newpath
39779.9 59083.6 moveto
39590.5 58894.2 lineto
stroke
newpath
39590.5 58466.3 moveto
39779.9 58277 lineto
stroke
newpath
39779.9 58466.3 moveto
39590.5 58277 lineto
stroke
newpath
39598.5 56787.2 moveto
39787.9 56597.8 lineto
stroke
newpath
39787.9 56787.2 moveto
39598.5 56597.8 lineto
stroke
newpath
39598.6 57939.1 moveto
39787.9 57749.8 lineto
stroke
newpath
39787.9 57939.1 moveto
39598.6 57749.8 lineto
stroke
newpath
39598.6 56282.3 moveto
39787.9 56092.9 lineto
stroke
newpath
39787.9 56282.3 moveto
39598.6 56092.9 lineto
stroke
newpath
39614.6 60839.1 moveto
39803.9 60649.7 lineto
stroke
newpath
39803.9 60839.1 moveto
39614.6 60649.7 lineto
stroke
newpath
40111.6 61608.6 moveto
40300.9 61419.3 lineto
stroke
newpath
40300.9 61608.6 moveto
40111.6 61419.3 lineto
stroke
newpath
40166.7 60826.8 moveto
40356 60637.4 lineto
stroke
newpath
40356 60826.8 moveto
40166.7 60637.4 lineto
stroke
newpath
40371.8 57954.9 moveto
40561.1 57765.5 lineto
stroke
newpath
40561.1 57954.9 moveto
40371.8 57765.5 lineto
stroke
newpath
40371.8 57418.4 moveto
40561.1 57229 lineto
stroke
newpath
40561.1 57418.4 moveto
40371.8 57229 lineto
stroke
newpath
40432.2 56771.4 moveto
40621.6 56582.1 lineto
stroke
newpath
40621.6 56771.4 moveto
40432.2 56582.1 lineto
stroke
newpath
40434.9 56266.5 moveto
40624.3 56077.1 lineto
stroke
newpath
40624.3 56266.5 moveto
40434.9 56077.1 lineto
stroke
newpath
40608.5 62594.1 moveto
40797.8 62404.8 lineto
stroke
newpath
40797.8 62594.1 moveto
40608.5 62404.8 lineto
stroke
newpath
40608.5 61616.7 moveto
40797.9 61427.3 lineto
stroke
newpath
40797.9 61616.7 moveto
40608.5 61427.3 lineto
stroke
newpath
40616.6 62049.5 moveto
40805.9 61860.2 lineto
stroke
newpath
40805.9 62049.5 moveto
40616.6 61860.2 lineto
stroke
newpath
40750.5 60842.6 moveto
40939.9 60653.2 lineto
stroke
newpath
40939.9 60842.6 moveto
40750.5 60653.2 lineto
stroke
newpath
41217.8 56775 moveto
41407.1 56585.6 lineto
stroke
newpath
41407.1 56775 moveto
41217.8 56585.6 lineto
stroke
newpath
41217.8 56266.5 moveto
41407.1 56077.1 lineto
stroke
newpath
41407.1 56266.5 moveto
41217.8 56077.1 lineto
stroke
newpath
41855.1 60795.2 moveto
42044.4 60605.9 lineto
stroke
newpath
42044.4 60795.2 moveto
41855.1 60605.9 lineto
stroke
newpath
41859.1 56799 moveto
42048.4 56609.7 lineto
stroke
newpath
42048.4 56799 moveto
41859.1 56609.7 lineto
stroke
newpath
41870.9 56266.5 moveto
42060.2 56077.1 lineto
stroke
newpath
42060.2 56266.5 moveto
41870.9 56077.1 lineto
stroke
newpath
42407.4 60795.2 moveto
42596.7 60605.9 lineto
stroke
newpath
42596.7 60795.2 moveto
42407.4 60605.9 lineto
stroke
newpath
42588.5 56791 moveto
42777.9 56601.6 lineto
stroke
newpath
42777.9 56791 moveto
42588.5 56601.6 lineto
stroke
newpath
42596.7 56266.5 moveto
42786.1 56077.1 lineto
stroke
newpath
42786.1 56266.5 moveto
42596.7 56077.1 lineto
stroke
newpath
43133.2 63604 moveto
43322.6 63414.7 lineto
stroke
newpath
43322.6 63604 moveto
43133.2 63414.7 lineto
stroke
newpath
43149 63146.4 moveto
43338.4 62957 lineto
stroke
newpath
43338.4 63146.4 moveto
43149 62957 lineto
stroke
newpath
43149 56787.2 moveto
43338.4 56597.8 lineto
stroke
newpath
43338.4 56787.2 moveto
43149 56597.8 lineto
stroke
newpath
43164.8 62625.7 moveto
43354.1 62436.3 lineto
stroke
newpath
43354.1 62625.7 moveto
43164.8 62436.3 lineto
stroke
newpath
43164.8 56250.7 moveto
43354.1 56061.3 lineto
stroke
newpath
43354.1 56250.7 moveto
43164.8 56061.3 lineto
stroke
newpath
43669.7 63614.2 moveto
43859.1 63424.9 lineto
stroke
newpath
43859.1 63614.2 moveto
43669.7 63424.9 lineto
stroke
newpath
43669.7 63146.4 moveto
43859.1 62957 lineto
stroke
newpath
43859.1 63146.4 moveto
43669.7 62957 lineto
stroke
newpath
43669.7 62641.5 moveto
43859.1 62452.1 lineto
stroke
newpath
43859.1 62641.5 moveto
43669.7 62452.1 lineto
stroke
newpath
43701.3 62215.4 moveto
43890.6 62026 lineto
stroke
newpath
43890.6 62215.4 moveto
43701.3 62026 lineto
stroke
newpath
43717.1 61742 moveto
43906.4 61552.7 lineto
stroke
newpath
43906.4 61742 moveto
43717.1 61552.7 lineto
stroke
newpath
44184.8 63614.2 moveto
44374.1 63424.9 lineto
stroke
newpath
44374.1 63614.2 moveto
44184.8 63424.9 lineto
stroke
newpath
44190.5 63149.3 moveto
44379.8 62959.9 lineto
stroke
newpath
44379.8 63149.3 moveto
44190.5 62959.9 lineto
stroke
newpath
44190.5 62657.2 moveto
44379.8 62467.9 lineto
stroke
newpath
44379.8 62657.2 moveto
44190.5 62467.9 lineto
stroke
newpath
44237.8 62209.8 moveto
44427.2 62020.5 lineto
stroke
newpath
44427.2 62209.8 moveto
44237.8 62020.5 lineto
stroke
newpath
44237.8 61742 moveto
44427.2 61552.7 lineto
stroke
newpath
44427.2 61742 moveto
44237.8 61552.7 lineto
stroke
newpath
44237.8 61237.1 moveto
44427.2 61047.7 lineto
stroke
newpath
44427.2 61237.1 moveto
44237.8 61047.7 lineto
stroke
newpath
44364 57307.9 moveto
44553.4 57118.6 lineto
stroke
newpath
44553.4 57307.9 moveto
44364 57118.6 lineto
stroke
newpath
44364 56803 moveto
44553.4 56613.6 lineto
stroke
newpath
44553.4 56803 moveto
44364 56613.6 lineto
stroke
newpath
44364 56266.5 moveto
44553.4 56077.1 lineto
stroke
newpath
44553.4 56266.5 moveto
44364 56077.1 lineto
stroke
newpath
44649.7 63622.2 moveto
44839.1 63432.9 lineto
stroke
newpath
44839.1 63622.2 moveto
44649.7 63432.9 lineto
stroke
newpath
44649.7 63141.3 moveto
44839.1 62951.9 lineto
stroke
newpath
44839.1 63141.3 moveto
44649.7 62951.9 lineto
stroke
newpath
44663.9 62657.2 moveto
44853.2 62467.9 lineto
stroke
newpath
44853.2 62657.2 moveto
44663.9 62467.9 lineto
stroke
newpath
44752.8 62209.8 moveto
44942.2 62020.5 lineto
stroke
newpath
44942.2 62209.8 moveto
44752.8 62020.5 lineto
stroke
newpath
44758.5 61744.9 moveto
44947.9 61555.6 lineto
stroke
newpath
44947.9 61744.9 moveto
44758.5 61555.6 lineto
stroke
newpath
44758.5 61252.8 moveto
44947.9 61063.5 lineto
stroke
newpath
44947.9 61252.8 moveto
44758.5 61063.5 lineto
stroke
newpath
44932.1 56803 moveto
45121.5 56613.6 lineto
stroke
newpath
45121.5 56803 moveto
44932.1 56613.6 lineto
stroke
newpath
44932.1 56266.5 moveto
45121.5 56077.1 lineto
stroke
newpath
45121.5 56266.5 moveto
44932.1 56077.1 lineto
stroke
newpath
45070.3 60827.9 moveto
45259.6 60638.5 lineto
stroke
newpath
45259.6 60827.9 moveto
45070.3 60638.5 lineto
stroke
newpath
45216.1 63635.6 moveto
45405.5 63446.2 lineto
stroke
newpath
45405.5 63635.6 moveto
45216.1 63446.2 lineto
stroke
newpath
45217.8 62217.9 moveto
45407.1 62028.5 lineto
stroke
newpath
45407.1 62217.9 moveto
45217.8 62028.5 lineto
stroke
newpath
45217.8 61736.9 moveto
45407.1 61547.5 lineto
stroke
newpath
45407.1 61736.9 moveto
45217.8 61547.5 lineto
stroke
newpath
45231.9 63146.4 moveto
45421.3 62957 lineto
stroke
newpath
45421.3 63146.4 moveto
45231.9 62957 lineto
stroke
newpath
45231.9 62673 moveto
45421.3 62483.7 lineto
stroke
newpath
45421.3 62673 moveto
45231.9 62483.7 lineto
stroke
newpath
45516 56581 moveto
45705.3 56391.6 lineto
stroke
newpath
45705.3 56581 moveto
45516 56391.6 lineto
stroke
newpath
45784.2 62231.2 moveto
45973.6 62041.8 lineto
stroke
newpath
45973.6 62231.2 moveto
45784.2 62041.8 lineto
stroke
newpath
45800 61742 moveto
45989.3 61552.7 lineto
stroke
newpath
45989.3 61742 moveto
45800 61552.7 lineto
stroke
newpath
45800 61268.6 moveto
45989.3 61079.3 lineto
stroke
newpath
45989.3 61268.6 moveto
45800 61079.3 lineto
stroke
newpath
46157.3 69209.5 moveto
46346.6 69020.1 lineto
stroke
newpath
46346.6 69209.5 moveto
46157.3 69020.1 lineto
stroke
newpath
46460.3 61777 moveto
46649.6 61587.6 lineto
stroke
newpath
46649.6 61777 moveto
46460.3 61587.6 lineto
stroke
newpath
46460.3 56734.9 moveto
46649.6 56545.5 lineto
stroke
newpath
46649.6 56734.9 moveto
46460.3 56545.5 lineto
stroke
newpath
47213.8 56734.9 moveto
47403.1 56545.5 lineto
stroke
newpath
47403.1 56734.9 moveto
47213.8 56545.5 lineto
stroke
newpath
47269.9 61760.9 moveto
47459.2 61571.6 lineto
stroke
newpath
47459.2 61760.9 moveto
47269.9 61571.6 lineto
stroke
newpath
48047.4 61785 moveto
48236.8 61595.6 lineto
stroke
newpath
48236.8 61785 moveto
48047.4 61595.6 lineto
stroke
newpath
48304 60574.6 moveto
48493.3 60385.2 lineto
stroke
newpath
48493.3 60574.6 moveto
48304 60385.2 lineto
stroke
newpath
48320 58634.7 moveto
48509.3 58445.3 lineto
stroke
newpath
48509.3 58634.7 moveto
48320 58445.3 lineto
stroke
newpath
49264.3 58179.4 moveto
49453.6 57990 lineto
stroke
newpath
49453.6 58179.4 moveto
49264.3 57990 lineto
stroke
newpath
53038.2 58251.5 moveto
53227.6 58062.2 lineto
stroke
newpath
53227.6 58251.5 moveto
53038.2 58062.2 lineto
stroke
newpath
53610.6 67300 moveto
53799.9 67110.7 lineto
stroke
newpath
53799.9 67300 moveto
53610.6 67110.7 lineto
stroke
newpath
54062.7 46467.9 moveto
54252.1 46278.6 lineto
stroke
newpath
54252.1 46467.9 moveto
54062.7 46278.6 lineto
stroke
newpath
54288.7 68313.3 moveto
54478.1 68123.9 lineto
stroke
newpath
54478.1 68313.3 moveto
54288.7 68123.9 lineto
stroke
newpath
54362.5 72308.5 moveto
54551.9 72119.1 lineto
stroke
newpath
54551.9 72308.5 moveto
54362.5 72119.1 lineto
stroke
newpath
54617.4 61203 moveto
54806.8 61013.7 lineto
stroke
newpath
54806.8 61203 moveto
54617.4 61013.7 lineto
stroke
newpath
54763.3 63463.6 moveto
54952.7 63274.2 lineto
stroke
newpath
54952.7 63463.6 moveto
54763.3 63274.2 lineto
stroke
newpath
55217 61175.8 moveto
55406.4 60986.4 lineto
stroke
newpath
55406.4 61175.8 moveto
55217 60986.4 lineto
stroke
newpath
55412.6 54423 moveto
55602 54233.7 lineto
stroke
newpath
55602 54423 moveto
55412.6 54233.7 lineto
stroke
newpath
56480.3 58969.8 moveto
56669.7 58780.4 lineto
stroke
newpath
56669.7 58969.8 moveto
56480.3 58780.4 lineto
stroke
newpath
56574.9 50669.9 moveto
56764.3 50480.6 lineto
stroke
newpath
56764.3 50669.9 moveto
56574.9 50480.6 lineto
stroke
newpath
56677.5 70601.1 moveto
56866.9 70411.7 lineto
stroke
newpath
56866.9 70601.1 moveto
56677.5 70411.7 lineto
stroke
newpath
56732 53026.7 moveto
56921.4 52837.3 lineto
stroke
newpath
56921.4 53026.7 moveto
56732 52837.3 lineto
stroke
newpath
56850.7 60560.1 moveto
57040 60370.8 lineto
stroke
newpath
57040 60560.1 moveto
56850.7 60370.8 lineto
stroke
newpath
56852.3 62224.3 moveto
57041.6 62034.9 lineto
stroke
newpath
57041.6 62224.3 moveto
56852.3 62034.9 lineto
stroke
newpath
56913.2 73576.6 moveto
57102.6 73387.3 lineto
stroke
newpath
57102.6 73576.6 moveto
56913.2 73387.3 lineto
stroke
newpath
57209.8 68791 moveto
57399.2 68601.7 lineto
stroke
newpath
57399.2 68791 moveto
57209.8 68601.7 lineto
stroke
newpath
57732.4 47599.8 moveto
57921.8 47410.4 lineto
stroke
newpath
57921.8 47599.8 moveto
57732.4 47410.4 lineto
stroke
newpath
57761.3 68322.9 moveto
57950.7 68133.5 lineto
stroke
newpath
57950.7 68322.9 moveto
57761.3 68133.5 lineto
stroke
newpath
57833.4 50783.8 moveto
58022.8 50594.4 lineto
stroke
newpath
58022.8 50783.8 moveto
57833.4 50594.4 lineto
stroke
newpath
57833.4 48696.4 moveto
58022.8 48507 lineto
stroke
newpath
58022.8 48696.4 moveto
57833.4 48507 lineto
stroke
newpath
57888 71412.3 moveto
58077.3 71222.9 lineto
stroke
newpath
58077.3 71412.3 moveto
57888 71222.9 lineto
stroke
newpath
58463.5 46575.3 moveto
58652.9 46386 lineto
stroke
newpath
58652.9 46575.3 moveto
58463.5 46386 lineto
stroke
newpath
58779.3 68781.4 moveto
58968.7 68592.1 lineto
stroke
newpath
58968.7 68781.4 moveto
58779.3 68592.1 lineto
stroke
newpath
59093.6 69741.7 moveto
59282.9 69552.4 lineto
stroke
newpath
59282.9 69741.7 moveto
59093.6 69552.4 lineto
stroke
newpath
59120.8 41480.3 moveto
59310.2 41291 lineto
stroke
newpath
59310.2 41480.3 moveto
59120.8 41291 lineto
stroke
newpath
59909.6 71708.9 moveto
60099 71519.5 lineto
stroke
newpath
60099 71708.9 moveto
59909.6 71519.5 lineto
stroke
newpath
60103.6 41958.1 moveto
60293 41768.7 lineto
stroke
newpath
60293 41958.1 moveto
60103.6 41768.7 lineto
stroke
newpath
60254.3 53692 moveto
60443.7 53502.6 lineto
stroke
newpath
60443.7 53692 moveto
60254.3 53502.6 lineto
stroke
newpath
60384.2 58028.7 moveto
60573.5 57839.3 lineto
stroke
newpath
60573.5 58028.7 moveto
60384.2 57839.3 lineto
stroke
newpath
60642.3 54423 moveto
60831.6 54233.7 lineto
stroke
newpath
60831.6 54423 moveto
60642.3 54233.7 lineto
stroke
newpath
60866.7 72840.7 moveto
61056.1 72651.4 lineto
stroke
newpath
61056.1 72840.7 moveto
60866.7 72651.4 lineto
stroke
newpath
60894 67439.5 moveto
61083.3 67250.2 lineto
stroke
newpath
61083.3 67439.5 moveto
60894 67250.2 lineto
stroke
newpath
60975.7 71460.4 moveto
61165.1 71271 lineto
stroke
newpath
61165.1 71460.4 moveto
60975.7 71271 lineto
stroke
newpath
61392.6 58997 moveto
61581.9 58807.7 lineto
stroke
newpath
61581.9 58997 moveto
61392.6 58807.7 lineto
stroke
newpath
61541.7 68302 moveto
61731 68112.7 lineto
stroke
newpath
61731 68302 moveto
61541.7 68112.7 lineto
stroke
newpath
62426.6 62663.6 moveto
62616 62474.2 lineto
stroke
newpath
62616 62663.6 moveto
62426.6 62474.2 lineto
stroke
newpath
62825.8 71272.8 moveto
63015.2 71083.4 lineto
stroke
newpath
63015.2 71272.8 moveto
62825.8 71083.4 lineto
stroke
newpath
63978.6 64470.4 moveto
64167.9 64281 lineto
stroke
newpath
64167.9 64470.4 moveto
63978.6 64281 lineto
stroke
newpath
64004.2 73756.2 moveto
64193.6 73566.8 lineto
stroke
newpath
64193.6 73756.2 moveto
64004.2 73566.8 lineto
stroke
newpath
64441.9 65982.2 moveto
64631.2 65792.8 lineto
stroke
newpath
64631.2 65982.2 moveto
64441.9 65792.8 lineto
stroke
newpath
65399 72558.6 moveto
65588.4 72369.2 lineto
stroke
newpath
65588.4 72558.6 moveto
65399 72369.2 lineto
stroke
newpath
65559.3 56278 moveto
65748.7 56088.6 lineto
stroke
newpath
65748.7 56278 moveto
65559.3 56088.6 lineto
stroke
newpath
65593 43093.2 moveto
65782.3 42903.8 lineto
stroke
newpath
65782.3 43093.2 moveto
65593 42903.8 lineto
stroke
newpath
65915.2 67678.4 moveto
66104.6 67489 lineto
stroke
newpath
66104.6 67678.4 moveto
65915.2 67489 lineto
stroke
newpath
65960.1 65974.2 moveto
66149.5 65784.8 lineto
stroke
newpath
66149.5 65974.2 moveto
65960.1 65784.8 lineto
stroke
newpath
66117.2 64465.6 moveto
66306.6 64276.2 lineto
stroke
newpath
66306.6 64465.6 moveto
66117.2 64276.2 lineto
stroke
newpath
66479.6 53453.1 moveto
66668.9 53263.8 lineto
stroke
newpath
66668.9 53453.1 moveto
66479.6 53263.8 lineto
stroke
newpath
67295.6 44960.9 moveto
67485 44771.5 lineto
stroke
newpath
67485 44960.9 moveto
67295.6 44771.5 lineto
stroke
newpath
67409.4 48667.5 moveto
67598.8 48478.2 lineto
stroke
newpath
67598.8 48667.5 moveto
67409.4 48478.2 lineto
stroke
newpath
68482 52941.7 moveto
68671.3 52752.3 lineto
stroke
newpath
68671.3 52941.7 moveto
68482 52752.3 lineto
stroke
newpath
69293.2 53607 moveto
69482.6 53417.7 lineto
stroke
newpath
69482.6 53607 moveto
69293.2 53417.7 lineto
stroke
64467.6 62427.8 157.796 cir0
64700.1 59319.2 157.796 cir0
64825.1 61809 157.796 cir0
65054.4 59934.8 157.796 cir0
65179.4 62424.6 157.796 cir0
65371.8 59332 157.796 cir0
65496.9 61821.8 157.796 cir0
65726.1 59934.8 157.796 cir0
65851.2 62424.6 157.796 cir0
66030.8 59332 157.796 cir0
66155.8 61821.8 157.796 cir0
66385.1 59934.8 157.796 cir0
66510.1 62424.6 157.796 cir0
66700.9 59333.6 157.796 cir0
66814.7 61834.6 157.796 cir0
67018.3 59939.6 157.796 cir0
67169 62424.6 157.796 cir0
67486.5 61858.7 157.796 cir0
67879.3 62424.6 157.796 cir0
68145.4 61858.7 157.796 cir0
68549.4 62424.6 157.796 cir0
68817.1 61884.3 157.796 cir0
69056 59357.6 157.796 cir0
69209.9 62424.6 157.796 cir0
69325.4 59912.4 157.796 cir0
69488.9 61871.5 157.796 cir0
69625.2 59351.2 157.796 cir0
69918.5 62424.6 157.796 cir0
70147.8 61858.7 157.796 cir0
70603.1 62424.6 157.796 cir0
70819.5 61871.5 157.796 cir0
71255.6 59335.2 157.796 cir0
71273.3 62424.6 157.796 cir0
71504.1 61871.5 157.796 cir0
71528.2 59881.9 157.796 cir0
71823.2 59335.2 157.796 cir0
71945 62424.6 157.796 cir0
72190.3 59875.5 157.796 cir0
70611.1 65457.9 157.796 cir0
newpath
46240.7 67442.1 moveto
46240.7 66968.7 lineto
stroke
newpath
46004 67205.4 moveto
46477.4 67205.4 lineto
stroke
newpath
47503.1 67442.1 moveto
47503.1 66968.7 lineto
stroke
newpath
47266.4 67205.4 moveto
47739.8 67205.4 lineto
stroke
newpath
48765.5 67442.1 moveto
48765.5 66968.7 lineto
stroke
newpath
48528.8 67205.4 moveto
49002.2 67205.4 lineto
stroke
newpath
63733 51326.6 moveto
63733 50853.2 lineto
stroke
newpath
63496.3 51089.9 moveto
63969.7 51089.9 lineto
stroke
newpath
64995.4 51326.6 moveto
64995.4 50853.2 lineto
stroke
newpath
64758.7 51089.9 moveto
65232.1 51089.9 lineto
stroke
newpath
66257.8 51326.6 moveto
66257.8 50853.2 lineto
stroke
newpath
66021.1 51089.9 moveto
66494.5 51089.9 lineto
stroke
newpath
67520.1 51326.6 moveto
67520.1 50853.2 lineto
stroke
newpath
67283.4 51089.9 moveto
67756.8 51089.9 lineto
stroke
newpath
64111.7 72687.8 moveto
64111.7 72214.4 lineto
stroke
newpath
63875 72451.1 moveto
64348.4 72451.1 lineto
stroke
newpath
64111.7 71425.4 moveto
64111.7 70952 lineto
stroke
newpath
63875 71188.7 moveto
64348.4 71188.7 lineto
stroke
newpath
64111.7 70163 moveto
64111.7 69689.6 lineto
stroke
newpath
63875 69926.3 moveto
64348.4 69926.3 lineto
stroke
newpath
44525.6 50291.6 moveto
44525.6 50737.9 lineto
44079.3 50737.9 lineto
44079.3 50291.6 lineto
44525.6 50291.6 lineto
poly0
newpath
44525.6 48713.6 moveto
44525.6 49159.9 lineto
44079.3 49159.9 lineto
44079.3 48713.6 lineto
44525.6 48713.6 lineto
poly0
newpath
52458.3 48229.4 moveto
52458.3 48675.8 lineto
52012 48675.8 lineto
52012 48229.4 lineto
52458.3 48229.4 lineto
poly0
newpath
54061.5 48229.4 moveto
54061.5 48675.8 lineto
53615.2 48675.8 lineto
53615.2 48229.4 lineto
54061.5 48229.4 lineto
poly0
newpath
56942.7 75326 moveto
56942.7 75772.4 lineto
56496.3 75772.4 lineto
56496.3 75326 lineto
56942.7 75326 lineto
poly0
newpath
58545.9 75326 moveto
58545.9 75772.4 lineto
58099.5 75772.4 lineto
58099.5 75326 lineto
58545.9 75326 lineto
poly0
newpath
60149.1 75326 moveto
60149.1 75772.4 lineto
59702.8 75772.4 lineto
59702.8 75326 lineto
60149.1 75326 lineto
poly0
newpath
61752.3 75326 moveto
61752.3 75772.4 lineto
61306 75772.4 lineto
61306 75326 lineto
61752.3 75326 lineto
poly0
newpath
63355.5 75326 moveto
63355.5 75772.4 lineto
62909.2 75772.4 lineto
62909.2 75326 lineto
63355.5 75326 lineto
poly0
newpath
55398.3 44282.7 moveto
55718.9 44603.3 lineto
55398.3 44923.9 lineto
55077.6 44603.3 lineto
55398.3 44282.7 lineto
poly0
newpath
55398.3 42679.4 moveto
55718.9 43000.1 lineto
55398.3 43320.7 lineto
55077.6 43000.1 lineto
55398.3 42679.4 lineto
poly0
newpath
57001.5 44282.7 moveto
57322.1 44603.3 lineto
57001.5 44923.9 lineto
56680.8 44603.3 lineto
57001.5 44282.7 lineto
poly0
newpath
57001.5 42679.4 moveto
57322.1 43000.1 lineto
57001.5 43320.7 lineto
56680.8 43000.1 lineto
57001.5 42679.4 lineto
poly0
newpath
58604.7 44282.7 moveto
58925.3 44603.3 lineto
58604.7 44923.9 lineto
58284 44603.3 lineto
58604.7 44282.7 lineto
poly0
newpath
58604.7 42679.4 moveto
58925.3 43000.1 lineto
58604.7 43320.7 lineto
58284 43000.1 lineto
58604.7 42679.4 lineto
poly0
newpath
60207.9 44282.7 moveto
60528.5 44603.3 lineto
60207.9 44923.9 lineto
59887.3 44603.3 lineto
60207.9 44282.7 lineto
poly0
newpath
60207.9 42679.4 moveto
60528.5 43000.1 lineto
60207.9 43320.7 lineto
59887.3 43000.1 lineto
60207.9 42679.4 lineto
poly0
newpath
61811.1 44282.7 moveto
62131.7 44603.3 lineto
61811.1 44923.9 lineto
61490.5 44603.3 lineto
61811.1 44282.7 lineto
poly0
newpath
61811.1 42679.4 moveto
62131.7 43000.1 lineto
61811.1 43320.7 lineto
61490.5 43000.1 lineto
61811.1 42679.4 lineto
poly0
newpath
74657.2 61294.8 moveto
75604 60348 lineto
stroke
newpath
75604 61294.8 moveto
74657.2 60348 lineto
stroke
75130.6 60821.4 473.389 cir0
newpath
72990.9 62961.1 moveto
74063.9 61888.1 lineto
stroke
newpath
74063.9 62961.1 moveto
72990.9 61888.1 lineto
stroke
newpath
73527.4 62961.1 moveto
73527.4 61888.1 lineto
stroke
newpath
72990.9 62424.6 moveto
74063.9 62424.6 lineto
stroke
newpath
72990.9 59754.7 moveto
74063.9 58681.7 lineto
stroke
newpath
74063.9 59754.7 moveto
72990.9 58681.7 lineto
stroke
newpath
73527.4 59754.7 moveto
73527.4 58681.7 lineto
stroke
newpath
72990.9 59218.2 moveto
74063.9 59218.2 lineto
stroke
newpath
76197.3 62961.1 moveto
77270.3 61888.1 lineto
stroke
newpath
77270.3 62961.1 moveto
76197.3 61888.1 lineto
stroke
newpath
76733.8 62961.1 moveto
76733.8 61888.1 lineto
stroke
newpath
76197.3 62424.6 moveto
77270.3 62424.6 lineto
stroke
newpath
76197.3 59754.7 moveto
77270.3 58681.7 lineto
stroke
newpath
77270.3 59754.7 moveto
76197.3 58681.7 lineto
stroke
newpath
76733.8 59754.7 moveto
76733.8 58681.7 lineto
stroke
newpath
76197.3 59218.2 moveto
77270.3 59218.2 lineto
stroke
118.11 setlinewidth
0 0 0 setrgbcolor
0 0 0 setrgbcolor
newpath
38725.7 35175.5 moveto
38725.7 36356.6 lineto
39006.9 36356.6 lineto
39175.6 36300.3 lineto
39288.1 36187.9 lineto
39344.4 36075.4 lineto
39400.6 35850.4 lineto
39400.6 35681.7 lineto
39344.4 35456.7 lineto
39288.1 35344.2 lineto
39175.6 35231.7 lineto
39006.9 35175.5 lineto
38725.7 35175.5 lineto
stroke
newpath
39906.8 35175.5 moveto
39906.8 35962.9 lineto
stroke
newpath
39906.8 35737.9 moveto
39963 35850.4 lineto
40019.3 35906.6 lineto
40131.8 35962.9 lineto
40244.2 35962.9 lineto
stroke
newpath
40637.9 35175.5 moveto
40637.9 35962.9 lineto
stroke
newpath
40637.9 36356.6 moveto
40581.7 36300.3 lineto
40637.9 36244.1 lineto
40694.2 36300.3 lineto
40637.9 36356.6 lineto
40637.9 36244.1 lineto
stroke
newpath
41369.1 35175.5 moveto
41256.6 35231.7 lineto
41200.4 35344.2 lineto
41200.4 36356.6 lineto
stroke
newpath
41987.8 35175.5 moveto
41875.3 35231.7 lineto
41819 35344.2 lineto
41819 36356.6 lineto
stroke
newpath
43337.6 35175.5 moveto
43337.6 36356.6 lineto
43731.3 35512.9 lineto
44125 36356.6 lineto
44125 35175.5 lineto
stroke
newpath
45193.6 35175.5 moveto
45193.6 35794.2 lineto
45137.4 35906.6 lineto
45024.9 35962.9 lineto
44799.9 35962.9 lineto
44687.4 35906.6 lineto
stroke
newpath
45193.6 35231.7 moveto
45081.1 35175.5 lineto
44799.9 35175.5 lineto
44687.4 35231.7 lineto
44631.2 35344.2 lineto
44631.2 35456.7 lineto
44687.4 35569.2 lineto
44799.9 35625.4 lineto
45081.1 35625.4 lineto
45193.6 35681.7 lineto
stroke
newpath
45756.1 35962.9 moveto
45756.1 34781.8 lineto
stroke
newpath
45756.1 35906.6 moveto
45868.5 35962.9 lineto
46093.5 35962.9 lineto
46206 35906.6 lineto
46262.2 35850.4 lineto
46318.5 35737.9 lineto
46318.5 35400.5 lineto
46262.2 35288 lineto
46206 35231.7 lineto
46093.5 35175.5 lineto
45868.5 35175.5 lineto
45756.1 35231.7 lineto
stroke
newpath
46824.7 35288 moveto
46880.9 35231.7 lineto
46824.7 35175.5 lineto
46768.4 35231.7 lineto
46824.7 35288 lineto
46824.7 35175.5 lineto
stroke
newpath
46824.7 35906.6 moveto
46880.9 35850.4 lineto
46824.7 35794.2 lineto
46768.4 35850.4 lineto
46824.7 35906.6 lineto
46824.7 35794.2 lineto
stroke
newpath
37408.7 33324.2 moveto
37598 33134.8 lineto
stroke
newpath
37598 33324.2 moveto
37408.7 33134.8 lineto
stroke
0 0 0 setrgbcolor
0 0 0 setrgbcolor
newpath
38950.7 33876.3 moveto
39063.1 33876.3 lineto
39175.6 33820 lineto
39231.9 33763.8 lineto
39288.1 33651.3 lineto
39344.4 33426.3 lineto
39344.4 33145.1 lineto
39288.1 32920.1 lineto
39231.9 32807.7 lineto
39175.6 32751.4 lineto
39063.1 32695.2 lineto
38950.7 32695.2 lineto
38838.2 32751.4 lineto
38781.9 32807.7 lineto
38725.7 32920.1 lineto
38669.4 33145.1 lineto
38669.4 33426.3 lineto
38725.7 33651.3 lineto
38781.9 33763.8 lineto
38838.2 33820 lineto
38950.7 33876.3 lineto
stroke
newpath
39850.5 32807.7 moveto
39906.8 32751.4 lineto
39850.5 32695.2 lineto
39794.3 32751.4 lineto
39850.5 32807.7 lineto
39850.5 32695.2 lineto
stroke
newpath
40300.5 33876.3 moveto
41031.6 33876.3 lineto
40637.9 33426.3 lineto
40806.7 33426.3 lineto
40919.2 33370.1 lineto
40975.4 33313.8 lineto
41031.6 33201.4 lineto
41031.6 32920.1 lineto
40975.4 32807.7 lineto
40919.2 32751.4 lineto
40806.7 32695.2 lineto
40469.2 32695.2 lineto
40356.7 32751.4 lineto
40300.5 32807.7 lineto
stroke
newpath
41762.8 33876.3 moveto
41875.3 33876.3 lineto
41987.8 33820 lineto
42044 33763.8 lineto
42100.3 33651.3 lineto
42156.5 33426.3 lineto
42156.5 33145.1 lineto
42100.3 32920.1 lineto
42044 32807.7 lineto
41987.8 32751.4 lineto
41875.3 32695.2 lineto
41762.8 32695.2 lineto
41650.3 32751.4 lineto
41594.1 32807.7 lineto
41537.8 32920.1 lineto
41481.6 33145.1 lineto
41481.6 33426.3 lineto
41537.8 33651.3 lineto
41594.1 33763.8 lineto
41650.3 33820 lineto
41762.8 33876.3 lineto
stroke
newpath
42662.7 32695.2 moveto
42662.7 33482.6 lineto
stroke
newpath
42662.7 33370.1 moveto
42718.9 33426.3 lineto
42831.4 33482.6 lineto
43000.1 33482.6 lineto
43112.6 33426.3 lineto
43168.9 33313.8 lineto
43168.9 32695.2 lineto
stroke
newpath
43168.9 33313.8 moveto
43225.1 33426.3 lineto
43337.6 33482.6 lineto
43506.3 33482.6 lineto
43618.8 33426.3 lineto
43675.1 33313.8 lineto
43675.1 32695.2 lineto
stroke
newpath
44237.5 32695.2 moveto
44237.5 33482.6 lineto
stroke
newpath
44237.5 33370.1 moveto
44293.7 33426.3 lineto
44406.2 33482.6 lineto
44574.9 33482.6 lineto
44687.4 33426.3 lineto
44743.7 33313.8 lineto
44743.7 32695.2 lineto
stroke
newpath
44743.7 33313.8 moveto
44799.9 33426.3 lineto
44912.4 33482.6 lineto
45081.1 33482.6 lineto
45193.6 33426.3 lineto
45249.9 33313.8 lineto
45249.9 32695.2 lineto
stroke
newpath
47555.8 33932.5 moveto
46543.5 32414 lineto
stroke
newpath
49074.4 33876.3 moveto
49186.9 33876.3 lineto
49299.4 33820 lineto
49355.6 33763.8 lineto
49411.8 33651.3 lineto
49468.1 33426.3 lineto
49468.1 33145.1 lineto
49411.8 32920.1 lineto
49355.6 32807.7 lineto
49299.4 32751.4 lineto
49186.9 32695.2 lineto
49074.4 32695.2 lineto
48961.9 32751.4 lineto
48905.7 32807.7 lineto
48849.4 32920.1 lineto
48793.2 33145.1 lineto
48793.2 33426.3 lineto
48849.4 33651.3 lineto
48905.7 33763.8 lineto
48961.9 33820 lineto
49074.4 33876.3 lineto
stroke
newpath
49974.3 32807.7 moveto
50030.5 32751.4 lineto
49974.3 32695.2 lineto
49918 32751.4 lineto
49974.3 32807.7 lineto
49974.3 32695.2 lineto
stroke
newpath
50761.7 33876.3 moveto
50874.2 33876.3 lineto
50986.6 33820 lineto
51042.9 33763.8 lineto
51099.1 33651.3 lineto
51155.4 33426.3 lineto
51155.4 33145.1 lineto
51099.1 32920.1 lineto
51042.9 32807.7 lineto
50986.6 32751.4 lineto
50874.2 32695.2 lineto
50761.7 32695.2 lineto
50649.2 32751.4 lineto
50592.9 32807.7 lineto
50536.7 32920.1 lineto
50480.5 33145.1 lineto
50480.5 33426.3 lineto
50536.7 33651.3 lineto
50592.9 33763.8 lineto
50649.2 33820 lineto
50761.7 33876.3 lineto
stroke
newpath
52280.2 32695.2 moveto
51605.3 32695.2 lineto
stroke
newpath
51942.8 32695.2 moveto
51942.8 33876.3 lineto
51830.3 33707.5 lineto
51717.8 33595.1 lineto
51605.3 33538.8 lineto
stroke
newpath
52730.2 33763.8 moveto
52786.4 33820 lineto
52898.9 33876.3 lineto
53180.1 33876.3 lineto
53292.6 33820 lineto
53348.9 33763.8 lineto
53405.1 33651.3 lineto
53405.1 33538.8 lineto
53348.9 33370.1 lineto
52673.9 32695.2 lineto
53405.1 32695.2 lineto
stroke
newpath
53855 33876.3 moveto
53855 33651.3 lineto
stroke
newpath
54305 33876.3 moveto
54305 33651.3 lineto
stroke
newpath
56048.5 32245.2 moveto
55992.3 32301.5 lineto
55879.8 32470.2 lineto
55823.5 32582.7 lineto
55767.3 32751.4 lineto
55711.1 33032.6 lineto
55711.1 33257.6 lineto
55767.3 33538.8 lineto
55823.5 33707.5 lineto
55879.8 33820 lineto
55992.3 33988.8 lineto
56048.5 34045 lineto
stroke
newpath
57117.1 32695.2 moveto
56442.2 32695.2 lineto
stroke
newpath
56779.7 32695.2 moveto
56779.7 33876.3 lineto
56667.2 33707.5 lineto
56554.7 33595.1 lineto
56442.2 33538.8 lineto
stroke
newpath
57567.1 33763.8 moveto
57623.3 33820 lineto
57735.8 33876.3 lineto
58017 33876.3 lineto
58129.5 33820 lineto
58185.8 33763.8 lineto
58242 33651.3 lineto
58242 33538.8 lineto
58185.8 33370.1 lineto
57510.8 32695.2 lineto
58242 32695.2 lineto
stroke
newpath
58635.7 33876.3 moveto
59423.1 33876.3 lineto
58916.9 32695.2 lineto
stroke
newpath
60772.9 32695.2 moveto
60772.9 33876.3 lineto
stroke
newpath
61279.1 32695.2 moveto
61279.1 33313.8 lineto
61222.9 33426.3 lineto
61110.4 33482.6 lineto
60941.7 33482.6 lineto
60829.2 33426.3 lineto
60772.9 33370.1 lineto
stroke
newpath
62010.3 32695.2 moveto
61897.8 32751.4 lineto
61841.5 32807.7 lineto
61785.3 32920.1 lineto
61785.3 33257.6 lineto
61841.5 33370.1 lineto
61897.8 33426.3 lineto
62010.3 33482.6 lineto
62179 33482.6 lineto
62291.5 33426.3 lineto
62347.7 33370.1 lineto
62404 33257.6 lineto
62404 32920.1 lineto
62347.7 32807.7 lineto
62291.5 32751.4 lineto
62179 32695.2 lineto
62010.3 32695.2 lineto
stroke
newpath
63078.9 32695.2 moveto
62966.4 32751.4 lineto
62910.2 32863.9 lineto
62910.2 33876.3 lineto
stroke
newpath
63978.8 32751.4 moveto
63866.3 32695.2 lineto
63641.3 32695.2 lineto
63528.8 32751.4 lineto
63472.6 32863.9 lineto
63472.6 33313.8 lineto
63528.8 33426.3 lineto
63641.3 33482.6 lineto
63866.3 33482.6 lineto
63978.8 33426.3 lineto
64035 33313.8 lineto
64035 33201.4 lineto
63472.6 33088.9 lineto
stroke
newpath
64485 32751.4 moveto
64597.5 32695.2 lineto
64822.4 32695.2 lineto
64934.9 32751.4 lineto
64991.2 32863.9 lineto
64991.2 32920.1 lineto
64934.9 33032.6 lineto
64822.4 33088.9 lineto
64653.7 33088.9 lineto
64541.2 33145.1 lineto
64485 33257.6 lineto
64485 33313.8 lineto
64541.2 33426.3 lineto
64653.7 33482.6 lineto
64822.4 33482.6 lineto
64934.9 33426.3 lineto
stroke
newpath
65384.9 32245.2 moveto
65441.1 32301.5 lineto
65553.6 32470.2 lineto
65609.8 32582.7 lineto
65666.1 32751.4 lineto
65722.3 33032.6 lineto
65722.3 33257.6 lineto
65666.1 33538.8 lineto
65609.8 33707.5 lineto
65553.6 33820 lineto
65441.1 33988.8 lineto
65384.9 34045 lineto
stroke
37440.2 31670.4 157.796 cir0
0 0 0 setrgbcolor
0 0 0 setrgbcolor
newpath
38950.7 32317.2 moveto
39063.1 32317.2 lineto
39175.6 32261 lineto
39231.9 32204.7 lineto
39288.1 32092.2 lineto
39344.4 31867.3 lineto
39344.4 31586.1 lineto
39288.1 31361.1 lineto
39231.9 31248.6 lineto
39175.6 31192.4 lineto
39063.1 31136.1 lineto
38950.7 31136.1 lineto
38838.2 31192.4 lineto
38781.9 31248.6 lineto
38725.7 31361.1 lineto
38669.4 31586.1 lineto
38669.4 31867.3 lineto
38725.7 32092.2 lineto
38781.9 32204.7 lineto
38838.2 32261 lineto
38950.7 32317.2 lineto
stroke
newpath
39850.5 31248.6 moveto
39906.8 31192.4 lineto
39850.5 31136.1 lineto
39794.3 31192.4 lineto
39850.5 31248.6 lineto
39850.5 31136.1 lineto
stroke
newpath
40975.4 32317.2 moveto
40413 32317.2 lineto
40356.7 31754.8 lineto
40413 31811 lineto
40525.5 31867.3 lineto
40806.7 31867.3 lineto
40919.2 31811 lineto
40975.4 31754.8 lineto
41031.6 31642.3 lineto
41031.6 31361.1 lineto
40975.4 31248.6 lineto
40919.2 31192.4 lineto
40806.7 31136.1 lineto
40525.5 31136.1 lineto
40413 31192.4 lineto
40356.7 31248.6 lineto
stroke
newpath
41762.8 32317.2 moveto
41875.3 32317.2 lineto
41987.8 32261 lineto
42044 32204.7 lineto
42100.3 32092.2 lineto
42156.5 31867.3 lineto
42156.5 31586.1 lineto
42100.3 31361.1 lineto
42044 31248.6 lineto
41987.8 31192.4 lineto
41875.3 31136.1 lineto
41762.8 31136.1 lineto
41650.3 31192.4 lineto
41594.1 31248.6 lineto
41537.8 31361.1 lineto
41481.6 31586.1 lineto
41481.6 31867.3 lineto
41537.8 32092.2 lineto
41594.1 32204.7 lineto
41650.3 32261 lineto
41762.8 32317.2 lineto
stroke
newpath
42662.7 31136.1 moveto
42662.7 31923.5 lineto
stroke
newpath
42662.7 31811 moveto
42718.9 31867.3 lineto
42831.4 31923.5 lineto
43000.1 31923.5 lineto
43112.6 31867.3 lineto
43168.9 31754.8 lineto
43168.9 31136.1 lineto
stroke
newpath
43168.9 31754.8 moveto
43225.1 31867.3 lineto
43337.6 31923.5 lineto
43506.3 31923.5 lineto
43618.8 31867.3 lineto
43675.1 31754.8 lineto
43675.1 31136.1 lineto
stroke
newpath
44237.5 31136.1 moveto
44237.5 31923.5 lineto
stroke
newpath
44237.5 31811 moveto
44293.7 31867.3 lineto
44406.2 31923.5 lineto
44574.9 31923.5 lineto
44687.4 31867.3 lineto
44743.7 31754.8 lineto
44743.7 31136.1 lineto
stroke
newpath
44743.7 31754.8 moveto
44799.9 31867.3 lineto
44912.4 31923.5 lineto
45081.1 31923.5 lineto
45193.6 31867.3 lineto
45249.9 31754.8 lineto
45249.9 31136.1 lineto
stroke
newpath
47555.8 32373.5 moveto
46543.5 30854.9 lineto
stroke
newpath
49074.4 32317.2 moveto
49186.9 32317.2 lineto
49299.4 32261 lineto
49355.6 32204.7 lineto
49411.8 32092.2 lineto
49468.1 31867.3 lineto
49468.1 31586.1 lineto
49411.8 31361.1 lineto
49355.6 31248.6 lineto
49299.4 31192.4 lineto
49186.9 31136.1 lineto
49074.4 31136.1 lineto
48961.9 31192.4 lineto
48905.7 31248.6 lineto
48849.4 31361.1 lineto
48793.2 31586.1 lineto
48793.2 31867.3 lineto
48849.4 32092.2 lineto
48905.7 32204.7 lineto
48961.9 32261 lineto
49074.4 32317.2 lineto
stroke
newpath
49974.3 31248.6 moveto
50030.5 31192.4 lineto
49974.3 31136.1 lineto
49918 31192.4 lineto
49974.3 31248.6 lineto
49974.3 31136.1 lineto
stroke
newpath
50761.7 32317.2 moveto
50874.2 32317.2 lineto
50986.6 32261 lineto
51042.9 32204.7 lineto
51099.1 32092.2 lineto
51155.4 31867.3 lineto
51155.4 31586.1 lineto
51099.1 31361.1 lineto
51042.9 31248.6 lineto
50986.6 31192.4 lineto
50874.2 31136.1 lineto
50761.7 31136.1 lineto
50649.2 31192.4 lineto
50592.9 31248.6 lineto
50536.7 31361.1 lineto
50480.5 31586.1 lineto
50480.5 31867.3 lineto
50536.7 32092.2 lineto
50592.9 32204.7 lineto
50649.2 32261 lineto
50761.7 32317.2 lineto
stroke
newpath
51605.3 32204.7 moveto
51661.6 32261 lineto
51774.1 32317.2 lineto
52055.3 32317.2 lineto
52167.8 32261 lineto
52224 32204.7 lineto
52280.2 32092.2 lineto
52280.2 31979.8 lineto
52224 31811 lineto
51549.1 31136.1 lineto
52280.2 31136.1 lineto
stroke
newpath
53011.4 32317.2 moveto
53123.9 32317.2 lineto
53236.4 32261 lineto
53292.6 32204.7 lineto
53348.9 32092.2 lineto
53405.1 31867.3 lineto
53405.1 31586.1 lineto
53348.9 31361.1 lineto
53292.6 31248.6 lineto
53236.4 31192.4 lineto
53123.9 31136.1 lineto
53011.4 31136.1 lineto
52898.9 31192.4 lineto
52842.7 31248.6 lineto
52786.4 31361.1 lineto
52730.2 31586.1 lineto
52730.2 31867.3 lineto
52786.4 32092.2 lineto
52842.7 32204.7 lineto
52898.9 32261 lineto
53011.4 32317.2 lineto
stroke
newpath
53855 32317.2 moveto
53855 32092.2 lineto
stroke
newpath
54305 32317.2 moveto
54305 32092.2 lineto
stroke
newpath
56048.5 30686.2 moveto
55992.3 30742.4 lineto
55879.8 30911.1 lineto
55823.5 31023.6 lineto
55767.3 31192.4 lineto
55711.1 31473.6 lineto
55711.1 31698.5 lineto
55767.3 31979.8 lineto
55823.5 32148.5 lineto
55879.8 32261 lineto
55992.3 32429.7 lineto
56048.5 32485.9 lineto
stroke
newpath
56386 32317.2 moveto
57117.1 32317.2 lineto
56723.4 31867.3 lineto
56892.2 31867.3 lineto
57004.6 31811 lineto
57060.9 31754.8 lineto
57117.1 31642.3 lineto
57117.1 31361.1 lineto
57060.9 31248.6 lineto
57004.6 31192.4 lineto
56892.2 31136.1 lineto
56554.7 31136.1 lineto
56442.2 31192.4 lineto
56386 31248.6 lineto
stroke
newpath
57679.6 31136.1 moveto
57904.5 31136.1 lineto
58017 31192.4 lineto
58073.3 31248.6 lineto
58185.8 31417.3 lineto
58242 31642.3 lineto
58242 32092.2 lineto
58185.8 32204.7 lineto
58129.5 32261 lineto
58017 32317.2 lineto
57792.1 32317.2 lineto
57679.6 32261 lineto
57623.3 32204.7 lineto
57567.1 32092.2 lineto
57567.1 31811 lineto
57623.3 31698.5 lineto
57679.6 31642.3 lineto
57792.1 31586.1 lineto
58017 31586.1 lineto
58129.5 31642.3 lineto
58185.8 31698.5 lineto
58242 31811 lineto
stroke
newpath
59648.1 31136.1 moveto
59648.1 32317.2 lineto
stroke
newpath
60154.3 31136.1 moveto
60154.3 31754.8 lineto
60098 31867.3 lineto
59985.5 31923.5 lineto
59816.8 31923.5 lineto
59704.3 31867.3 lineto
59648.1 31811 lineto
stroke
newpath
60885.4 31136.1 moveto
60772.9 31192.4 lineto
60716.7 31248.6 lineto
60660.4 31361.1 lineto
60660.4 31698.5 lineto
60716.7 31811 lineto
60772.9 31867.3 lineto
60885.4 31923.5 lineto
61054.1 31923.5 lineto
61166.6 31867.3 lineto
61222.9 31811 lineto
61279.1 31698.5 lineto
61279.1 31361.1 lineto
61222.9 31248.6 lineto
61166.6 31192.4 lineto
61054.1 31136.1 lineto
60885.4 31136.1 lineto
stroke
newpath
61954 31136.1 moveto
61841.5 31192.4 lineto
61785.3 31304.8 lineto
61785.3 32317.2 lineto
stroke
newpath
62853.9 31192.4 moveto
62741.4 31136.1 lineto
62516.5 31136.1 lineto
62404 31192.4 lineto
62347.7 31304.8 lineto
62347.7 31754.8 lineto
62404 31867.3 lineto
62516.5 31923.5 lineto
62741.4 31923.5 lineto
62853.9 31867.3 lineto
62910.2 31754.8 lineto
62910.2 31642.3 lineto
62347.7 31529.8 lineto
stroke
newpath
63360.1 31192.4 moveto
63472.6 31136.1 lineto
63697.6 31136.1 lineto
63810 31192.4 lineto
63866.3 31304.8 lineto
63866.3 31361.1 lineto
63810 31473.6 lineto
63697.6 31529.8 lineto
63528.8 31529.8 lineto
63416.3 31586.1 lineto
63360.1 31698.5 lineto
63360.1 31754.8 lineto
63416.3 31867.3 lineto
63528.8 31923.5 lineto
63697.6 31923.5 lineto
63810 31867.3 lineto
stroke
newpath
64260 30686.2 moveto
64316.2 30742.4 lineto
64428.7 30911.1 lineto
64485 31023.6 lineto
64541.2 31192.4 lineto
64597.5 31473.6 lineto
64597.5 31698.5 lineto
64541.2 31979.8 lineto
64485 32148.5 lineto
64428.7 32261 lineto
64316.2 32429.7 lineto
64260 32485.9 lineto
stroke
newpath
37361.3 30348.1 moveto
37361.3 29874.7 lineto
stroke
newpath
37124.6 30111.4 moveto
37598 30111.4 lineto
stroke
0 0 0 setrgbcolor
0 0 0 setrgbcolor
newpath
38950.7 30758.2 moveto
39063.1 30758.2 lineto
39175.6 30701.9 lineto
39231.9 30645.7 lineto
39288.1 30533.2 lineto
39344.4 30308.2 lineto
39344.4 30027 lineto
39288.1 29802 lineto
39231.9 29689.5 lineto
39175.6 29633.3 lineto
39063.1 29577.1 lineto
38950.7 29577.1 lineto
38838.2 29633.3 lineto
38781.9 29689.5 lineto
38725.7 29802 lineto
38669.4 30027 lineto
38669.4 30308.2 lineto
38725.7 30533.2 lineto
38781.9 30645.7 lineto
38838.2 30701.9 lineto
38950.7 30758.2 lineto
stroke
newpath
39850.5 29689.5 moveto
39906.8 29633.3 lineto
39850.5 29577.1 lineto
39794.3 29633.3 lineto
39850.5 29689.5 lineto
39850.5 29577.1 lineto
stroke
newpath
40300.5 30758.2 moveto
41087.9 30758.2 lineto
40581.7 29577.1 lineto
stroke
newpath
42100.3 30758.2 moveto
41537.8 30758.2 lineto
41481.6 30195.7 lineto
41537.8 30252 lineto
41650.3 30308.2 lineto
41931.5 30308.2 lineto
42044 30252 lineto
42100.3 30195.7 lineto
42156.5 30083.2 lineto
42156.5 29802 lineto
42100.3 29689.5 lineto
42044 29633.3 lineto
41931.5 29577.1 lineto
41650.3 29577.1 lineto
41537.8 29633.3 lineto
41481.6 29689.5 lineto
stroke
newpath
42662.7 29577.1 moveto
42662.7 30364.5 lineto
stroke
newpath
42662.7 30252 moveto
42718.9 30308.2 lineto
42831.4 30364.5 lineto
43000.1 30364.5 lineto
43112.6 30308.2 lineto
43168.9 30195.7 lineto
43168.9 29577.1 lineto
stroke
newpath
43168.9 30195.7 moveto
43225.1 30308.2 lineto
43337.6 30364.5 lineto
43506.3 30364.5 lineto
43618.8 30308.2 lineto
43675.1 30195.7 lineto
43675.1 29577.1 lineto
stroke
newpath
44237.5 29577.1 moveto
44237.5 30364.5 lineto
stroke
newpath
44237.5 30252 moveto
44293.7 30308.2 lineto
44406.2 30364.5 lineto
44574.9 30364.5 lineto
44687.4 30308.2 lineto
44743.7 30195.7 lineto
44743.7 29577.1 lineto
stroke
newpath
44743.7 30195.7 moveto
44799.9 30308.2 lineto
44912.4 30364.5 lineto
45081.1 30364.5 lineto
45193.6 30308.2 lineto
45249.9 30195.7 lineto
45249.9 29577.1 lineto
stroke
newpath
47555.8 30814.4 moveto
46543.5 29295.8 lineto
stroke
newpath
49074.4 30758.2 moveto
49186.9 30758.2 lineto
49299.4 30701.9 lineto
49355.6 30645.7 lineto
49411.8 30533.2 lineto
49468.1 30308.2 lineto
49468.1 30027 lineto
49411.8 29802 lineto
49355.6 29689.5 lineto
49299.4 29633.3 lineto
49186.9 29577.1 lineto
49074.4 29577.1 lineto
48961.9 29633.3 lineto
48905.7 29689.5 lineto
48849.4 29802 lineto
48793.2 30027 lineto
48793.2 30308.2 lineto
48849.4 30533.2 lineto
48905.7 30645.7 lineto
48961.9 30701.9 lineto
49074.4 30758.2 lineto
stroke
newpath
49974.3 29689.5 moveto
50030.5 29633.3 lineto
49974.3 29577.1 lineto
49918 29633.3 lineto
49974.3 29689.5 lineto
49974.3 29577.1 lineto
stroke
newpath
50761.7 30758.2 moveto
50874.2 30758.2 lineto
50986.6 30701.9 lineto
51042.9 30645.7 lineto
51099.1 30533.2 lineto
51155.4 30308.2 lineto
51155.4 30027 lineto
51099.1 29802 lineto
51042.9 29689.5 lineto
50986.6 29633.3 lineto
50874.2 29577.1 lineto
50761.7 29577.1 lineto
50649.2 29633.3 lineto
50592.9 29689.5 lineto
50536.7 29802 lineto
50480.5 30027 lineto
50480.5 30308.2 lineto
50536.7 30533.2 lineto
50592.9 30645.7 lineto
50649.2 30701.9 lineto
50761.7 30758.2 lineto
stroke
newpath
51549.1 30758.2 moveto
52280.2 30758.2 lineto
51886.5 30308.2 lineto
52055.3 30308.2 lineto
52167.8 30252 lineto
52224 30195.7 lineto
52280.2 30083.2 lineto
52280.2 29802 lineto
52224 29689.5 lineto
52167.8 29633.3 lineto
52055.3 29577.1 lineto
51717.8 29577.1 lineto
51605.3 29633.3 lineto
51549.1 29689.5 lineto
stroke
newpath
53011.4 30758.2 moveto
53123.9 30758.2 lineto
53236.4 30701.9 lineto
53292.6 30645.7 lineto
53348.9 30533.2 lineto
53405.1 30308.2 lineto
53405.1 30027 lineto
53348.9 29802 lineto
53292.6 29689.5 lineto
53236.4 29633.3 lineto
53123.9 29577.1 lineto
53011.4 29577.1 lineto
52898.9 29633.3 lineto
52842.7 29689.5 lineto
52786.4 29802 lineto
52730.2 30027 lineto
52730.2 30308.2 lineto
52786.4 30533.2 lineto
52842.7 30645.7 lineto
52898.9 30701.9 lineto
53011.4 30758.2 lineto
stroke
newpath
53855 30758.2 moveto
53855 30533.2 lineto
stroke
newpath
54305 30758.2 moveto
54305 30533.2 lineto
stroke
newpath
56048.5 29127.1 moveto
55992.3 29183.4 lineto
55879.8 29352.1 lineto
55823.5 29464.6 lineto
55767.3 29633.3 lineto
55711.1 29914.5 lineto
55711.1 30139.5 lineto
55767.3 30420.7 lineto
55823.5 30589.4 lineto
55879.8 30701.9 lineto
55992.3 30870.7 lineto
56048.5 30926.9 lineto
stroke
newpath
57117.1 29577.1 moveto
56442.2 29577.1 lineto
stroke
newpath
56779.7 29577.1 moveto
56779.7 30758.2 lineto
56667.2 30589.4 lineto
56554.7 30477 lineto
56442.2 30420.7 lineto
stroke
newpath
57848.3 30758.2 moveto
57960.8 30758.2 lineto
58073.3 30701.9 lineto
58129.5 30645.7 lineto
58185.8 30533.2 lineto
58242 30308.2 lineto
58242 30027 lineto
58185.8 29802 lineto
58129.5 29689.5 lineto
58073.3 29633.3 lineto
57960.8 29577.1 lineto
57848.3 29577.1 lineto
57735.8 29633.3 lineto
57679.6 29689.5 lineto
57623.3 29802 lineto
57567.1 30027 lineto
57567.1 30308.2 lineto
57623.3 30533.2 lineto
57679.6 30645.7 lineto
57735.8 30701.9 lineto
57848.3 30758.2 lineto
stroke
newpath
59648.1 29577.1 moveto
59648.1 30758.2 lineto
stroke
newpath
60154.3 29577.1 moveto
60154.3 30195.7 lineto
60098 30308.2 lineto
59985.5 30364.5 lineto
59816.8 30364.5 lineto
59704.3 30308.2 lineto
59648.1 30252 lineto
stroke
newpath
60885.4 29577.1 moveto
60772.9 29633.3 lineto
60716.7 29689.5 lineto
60660.4 29802 lineto
60660.4 30139.5 lineto
60716.7 30252 lineto
60772.9 30308.2 lineto
60885.4 30364.5 lineto
61054.1 30364.5 lineto
61166.6 30308.2 lineto
61222.9 30252 lineto
61279.1 30139.5 lineto
61279.1 29802 lineto
61222.9 29689.5 lineto
61166.6 29633.3 lineto
61054.1 29577.1 lineto
60885.4 29577.1 lineto
stroke
newpath
61954 29577.1 moveto
61841.5 29633.3 lineto
61785.3 29745.8 lineto
61785.3 30758.2 lineto
stroke
newpath
62853.9 29633.3 moveto
62741.4 29577.1 lineto
62516.5 29577.1 lineto
62404 29633.3 lineto
62347.7 29745.8 lineto
62347.7 30195.7 lineto
62404 30308.2 lineto
62516.5 30364.5 lineto
62741.4 30364.5 lineto
62853.9 30308.2 lineto
62910.2 30195.7 lineto
62910.2 30083.2 lineto
62347.7 29970.8 lineto
stroke
newpath
63360.1 29633.3 moveto
63472.6 29577.1 lineto
63697.6 29577.1 lineto
63810 29633.3 lineto
63866.3 29745.8 lineto
63866.3 29802 lineto
63810 29914.5 lineto
63697.6 29970.8 lineto
63528.8 29970.8 lineto
63416.3 30027 lineto
63360.1 30139.5 lineto
63360.1 30195.7 lineto
63416.3 30308.2 lineto
63528.8 30364.5 lineto
63697.6 30364.5 lineto
63810 30308.2 lineto
stroke
newpath
64260 29127.1 moveto
64316.2 29183.4 lineto
64428.7 29352.1 lineto
64485 29464.6 lineto
64541.2 29633.3 lineto
64597.5 29914.5 lineto
64597.5 30139.5 lineto
64541.2 30420.7 lineto
64485 30589.4 lineto
64428.7 30701.9 lineto
64316.2 30870.7 lineto
64260 30926.9 lineto
stroke
newpath
37505.6 28329.2 moveto
37505.6 28775.5 lineto
37059.3 28775.5 lineto
37059.3 28329.2 lineto
37505.6 28329.2 lineto
poly0
0 0 0 setrgbcolor
0 0 0 setrgbcolor
newpath
39344.4 28018 moveto
38669.4 28018 lineto
stroke
newpath
39006.9 28018 moveto
39006.9 29199.1 lineto
38894.4 29030.4 lineto
38781.9 28917.9 lineto
38669.4 28861.7 lineto
stroke
newpath
39850.5 28130.5 moveto
39906.8 28074.3 lineto
39850.5 28018 lineto
39794.3 28074.3 lineto
39850.5 28130.5 lineto
39850.5 28018 lineto
stroke
newpath
40637.9 29199.1 moveto
40750.4 29199.1 lineto
40862.9 29142.9 lineto
40919.2 29086.6 lineto
40975.4 28974.1 lineto
41031.6 28749.2 lineto
41031.6 28468 lineto
40975.4 28243 lineto
40919.2 28130.5 lineto
40862.9 28074.3 lineto
40750.4 28018 lineto
40637.9 28018 lineto
40525.5 28074.3 lineto
40469.2 28130.5 lineto
40413 28243 lineto
40356.7 28468 lineto
40356.7 28749.2 lineto
40413 28974.1 lineto
40469.2 29086.6 lineto
40525.5 29142.9 lineto
40637.9 29199.1 lineto
stroke
newpath
41762.8 29199.1 moveto
41875.3 29199.1 lineto
41987.8 29142.9 lineto
42044 29086.6 lineto
42100.3 28974.1 lineto
42156.5 28749.2 lineto
42156.5 28468 lineto
42100.3 28243 lineto
42044 28130.5 lineto
41987.8 28074.3 lineto
41875.3 28018 lineto
41762.8 28018 lineto
41650.3 28074.3 lineto
41594.1 28130.5 lineto
41537.8 28243 lineto
41481.6 28468 lineto
41481.6 28749.2 lineto
41537.8 28974.1 lineto
41594.1 29086.6 lineto
41650.3 29142.9 lineto
41762.8 29199.1 lineto
stroke
newpath
42662.7 28018 moveto
42662.7 28805.4 lineto
stroke
newpath
42662.7 28692.9 moveto
42718.9 28749.2 lineto
42831.4 28805.4 lineto
43000.1 28805.4 lineto
43112.6 28749.2 lineto
43168.9 28636.7 lineto
43168.9 28018 lineto
stroke
newpath
43168.9 28636.7 moveto
43225.1 28749.2 lineto
43337.6 28805.4 lineto
43506.3 28805.4 lineto
43618.8 28749.2 lineto
43675.1 28636.7 lineto
43675.1 28018 lineto
stroke
newpath
44237.5 28018 moveto
44237.5 28805.4 lineto
stroke
newpath
44237.5 28692.9 moveto
44293.7 28749.2 lineto
44406.2 28805.4 lineto
44574.9 28805.4 lineto
44687.4 28749.2 lineto
44743.7 28636.7 lineto
44743.7 28018 lineto
stroke
newpath
44743.7 28636.7 moveto
44799.9 28749.2 lineto
44912.4 28805.4 lineto
45081.1 28805.4 lineto
45193.6 28749.2 lineto
45249.9 28636.7 lineto
45249.9 28018 lineto
stroke
newpath
47555.8 29255.4 moveto
46543.5 27736.8 lineto
stroke
newpath
49074.4 29199.1 moveto
49186.9 29199.1 lineto
49299.4 29142.9 lineto
49355.6 29086.6 lineto
49411.8 28974.1 lineto
49468.1 28749.2 lineto
49468.1 28468 lineto
49411.8 28243 lineto
49355.6 28130.5 lineto
49299.4 28074.3 lineto
49186.9 28018 lineto
49074.4 28018 lineto
48961.9 28074.3 lineto
48905.7 28130.5 lineto
48849.4 28243 lineto
48793.2 28468 lineto
48793.2 28749.2 lineto
48849.4 28974.1 lineto
48905.7 29086.6 lineto
48961.9 29142.9 lineto
49074.4 29199.1 lineto
stroke
newpath
49974.3 28130.5 moveto
50030.5 28074.3 lineto
49974.3 28018 lineto
49918 28074.3 lineto
49974.3 28130.5 lineto
49974.3 28018 lineto
stroke
newpath
50761.7 29199.1 moveto
50874.2 29199.1 lineto
50986.6 29142.9 lineto
51042.9 29086.6 lineto
51099.1 28974.1 lineto
51155.4 28749.2 lineto
51155.4 28468 lineto
51099.1 28243 lineto
51042.9 28130.5 lineto
50986.6 28074.3 lineto
50874.2 28018 lineto
50761.7 28018 lineto
50649.2 28074.3 lineto
50592.9 28130.5 lineto
50536.7 28243 lineto
50480.5 28468 lineto
50480.5 28749.2 lineto
50536.7 28974.1 lineto
50592.9 29086.6 lineto
50649.2 29142.9 lineto
50761.7 29199.1 lineto
stroke
newpath
51549.1 29199.1 moveto
52280.2 29199.1 lineto
51886.5 28749.2 lineto
52055.3 28749.2 lineto
52167.8 28692.9 lineto
52224 28636.7 lineto
52280.2 28524.2 lineto
52280.2 28243 lineto
52224 28130.5 lineto
52167.8 28074.3 lineto
52055.3 28018 lineto
51717.8 28018 lineto
51605.3 28074.3 lineto
51549.1 28130.5 lineto
stroke
newpath
52842.7 28018 moveto
53067.6 28018 lineto
53180.1 28074.3 lineto
53236.4 28130.5 lineto
53348.9 28299.2 lineto
53405.1 28524.2 lineto
53405.1 28974.1 lineto
53348.9 29086.6 lineto
53292.6 29142.9 lineto
53180.1 29199.1 lineto
52955.2 29199.1 lineto
52842.7 29142.9 lineto
52786.4 29086.6 lineto
52730.2 28974.1 lineto
52730.2 28692.9 lineto
52786.4 28580.4 lineto
52842.7 28524.2 lineto
52955.2 28468 lineto
53180.1 28468 lineto
53292.6 28524.2 lineto
53348.9 28580.4 lineto
53405.1 28692.9 lineto
stroke
newpath
53855 29199.1 moveto
53855 28974.1 lineto
stroke
newpath
54305 29199.1 moveto
54305 28974.1 lineto
stroke
newpath
56048.5 27568.1 moveto
55992.3 27624.3 lineto
55879.8 27793 lineto
55823.5 27905.5 lineto
55767.3 28074.3 lineto
55711.1 28355.5 lineto
55711.1 28580.4 lineto
55767.3 28861.7 lineto
55823.5 29030.4 lineto
55879.8 29142.9 lineto
55992.3 29311.6 lineto
56048.5 29367.8 lineto
stroke
newpath
56554.7 28018 moveto
56779.7 28018 lineto
56892.2 28074.3 lineto
56948.4 28130.5 lineto
57060.9 28299.2 lineto
57117.1 28524.2 lineto
57117.1 28974.1 lineto
57060.9 29086.6 lineto
57004.6 29142.9 lineto
56892.2 29199.1 lineto
56667.2 29199.1 lineto
56554.7 29142.9 lineto
56498.5 29086.6 lineto
56442.2 28974.1 lineto
56442.2 28692.9 lineto
56498.5 28580.4 lineto
56554.7 28524.2 lineto
56667.2 28468 lineto
56892.2 28468 lineto
57004.6 28524.2 lineto
57060.9 28580.4 lineto
57117.1 28692.9 lineto
stroke
newpath
58523.2 28018 moveto
58523.2 29199.1 lineto
stroke
newpath
59029.4 28018 moveto
59029.4 28636.7 lineto
58973.2 28749.2 lineto
58860.7 28805.4 lineto
58691.9 28805.4 lineto
58579.5 28749.2 lineto
58523.2 28692.9 lineto
stroke
newpath
59760.6 28018 moveto
59648.1 28074.3 lineto
59591.8 28130.5 lineto
59535.6 28243 lineto
59535.6 28580.4 lineto
59591.8 28692.9 lineto
59648.1 28749.2 lineto
59760.6 28805.4 lineto
59929.3 28805.4 lineto
60041.8 28749.2 lineto
60098 28692.9 lineto
60154.3 28580.4 lineto
60154.3 28243 lineto
60098 28130.5 lineto
60041.8 28074.3 lineto
59929.3 28018 lineto
59760.6 28018 lineto
stroke
newpath
60829.2 28018 moveto
60716.7 28074.3 lineto
60660.4 28186.7 lineto
60660.4 29199.1 lineto
stroke
newpath
61729.1 28074.3 moveto
61616.6 28018 lineto
61391.6 28018 lineto
61279.1 28074.3 lineto
61222.9 28186.7 lineto
61222.9 28636.7 lineto
61279.1 28749.2 lineto
61391.6 28805.4 lineto
61616.6 28805.4 lineto
61729.1 28749.2 lineto
61785.3 28636.7 lineto
61785.3 28524.2 lineto
61222.9 28411.7 lineto
stroke
newpath
62235.2 28074.3 moveto
62347.7 28018 lineto
62572.7 28018 lineto
62685.2 28074.3 lineto
62741.4 28186.7 lineto
62741.4 28243 lineto
62685.2 28355.5 lineto
62572.7 28411.7 lineto
62404 28411.7 lineto
62291.5 28468 lineto
62235.2 28580.4 lineto
62235.2 28636.7 lineto
62291.5 28749.2 lineto
62404 28805.4 lineto
62572.7 28805.4 lineto
62685.2 28749.2 lineto
stroke
newpath
63135.1 27568.1 moveto
63191.4 27624.3 lineto
63303.9 27793 lineto
63360.1 27905.5 lineto
63416.3 28074.3 lineto
63472.6 28355.5 lineto
63472.6 28580.4 lineto
63416.3 28861.7 lineto
63360.1 29030.4 lineto
63303.9 29142.9 lineto
63191.4 29311.6 lineto
63135.1 29367.8 lineto
stroke
newpath
37277.4 26672.6 moveto
37598 26993.3 lineto
37277.4 27313.9 lineto
36956.7 26993.3 lineto
37277.4 26672.6 lineto
poly0
0 0 0 setrgbcolor
0 0 0 setrgbcolor
newpath
39344.4 26459 moveto
38669.4 26459 lineto
stroke
newpath
39006.9 26459 moveto
39006.9 27640.1 lineto
38894.4 27471.3 lineto
38781.9 27358.8 lineto
38669.4 27302.6 lineto
stroke
newpath
39850.5 26571.4 moveto
39906.8 26515.2 lineto
39850.5 26459 lineto
39794.3 26515.2 lineto
39850.5 26571.4 lineto
39850.5 26459 lineto
stroke
newpath
40637.9 27640.1 moveto
40750.4 27640.1 lineto
40862.9 27583.8 lineto
40919.2 27527.6 lineto
40975.4 27415.1 lineto
41031.6 27190.1 lineto
41031.6 26908.9 lineto
40975.4 26683.9 lineto
40919.2 26571.4 lineto
40862.9 26515.2 lineto
40750.4 26459 lineto
40637.9 26459 lineto
40525.5 26515.2 lineto
40469.2 26571.4 lineto
40413 26683.9 lineto
40356.7 26908.9 lineto
40356.7 27190.1 lineto
40413 27415.1 lineto
40469.2 27527.6 lineto
40525.5 27583.8 lineto
40637.9 27640.1 lineto
stroke
newpath
41481.6 27527.6 moveto
41537.8 27583.8 lineto
41650.3 27640.1 lineto
41931.5 27640.1 lineto
42044 27583.8 lineto
42100.3 27527.6 lineto
42156.5 27415.1 lineto
42156.5 27302.6 lineto
42100.3 27133.9 lineto
41425.3 26459 lineto
42156.5 26459 lineto
stroke
newpath
42662.7 26459 moveto
42662.7 27246.4 lineto
stroke
newpath
42662.7 27133.9 moveto
42718.9 27190.1 lineto
42831.4 27246.4 lineto
43000.1 27246.4 lineto
43112.6 27190.1 lineto
43168.9 27077.6 lineto
43168.9 26459 lineto
stroke
newpath
43168.9 27077.6 moveto
43225.1 27190.1 lineto
43337.6 27246.4 lineto
43506.3 27246.4 lineto
43618.8 27190.1 lineto
43675.1 27077.6 lineto
43675.1 26459 lineto
stroke
newpath
44237.5 26459 moveto
44237.5 27246.4 lineto
stroke
newpath
44237.5 27133.9 moveto
44293.7 27190.1 lineto
44406.2 27246.4 lineto
44574.9 27246.4 lineto
44687.4 27190.1 lineto
44743.7 27077.6 lineto
44743.7 26459 lineto
stroke
newpath
44743.7 27077.6 moveto
44799.9 27190.1 lineto
44912.4 27246.4 lineto
45081.1 27246.4 lineto
45193.6 27190.1 lineto
45249.9 27077.6 lineto
45249.9 26459 lineto
stroke
newpath
47555.8 27696.3 moveto
46543.5 26177.7 lineto
stroke
newpath
49074.4 27640.1 moveto
49186.9 27640.1 lineto
49299.4 27583.8 lineto
49355.6 27527.6 lineto
49411.8 27415.1 lineto
49468.1 27190.1 lineto
49468.1 26908.9 lineto
49411.8 26683.9 lineto
49355.6 26571.4 lineto
49299.4 26515.2 lineto
49186.9 26459 lineto
49074.4 26459 lineto
48961.9 26515.2 lineto
48905.7 26571.4 lineto
48849.4 26683.9 lineto
48793.2 26908.9 lineto
48793.2 27190.1 lineto
48849.4 27415.1 lineto
48905.7 27527.6 lineto
48961.9 27583.8 lineto
49074.4 27640.1 lineto
stroke
newpath
49974.3 26571.4 moveto
50030.5 26515.2 lineto
49974.3 26459 lineto
49918 26515.2 lineto
49974.3 26571.4 lineto
49974.3 26459 lineto
stroke
newpath
50761.7 27640.1 moveto
50874.2 27640.1 lineto
50986.6 27583.8 lineto
51042.9 27527.6 lineto
51099.1 27415.1 lineto
51155.4 27190.1 lineto
51155.4 26908.9 lineto
51099.1 26683.9 lineto
51042.9 26571.4 lineto
50986.6 26515.2 lineto
50874.2 26459 lineto
50761.7 26459 lineto
50649.2 26515.2 lineto
50592.9 26571.4 lineto
50536.7 26683.9 lineto
50480.5 26908.9 lineto
50480.5 27190.1 lineto
50536.7 27415.1 lineto
50592.9 27527.6 lineto
50649.2 27583.8 lineto
50761.7 27640.1 lineto
stroke
newpath
52167.8 27246.4 moveto
52167.8 26459 lineto
stroke
newpath
51886.5 27696.3 moveto
51605.3 26852.7 lineto
52336.5 26852.7 lineto
stroke
newpath
53011.4 27640.1 moveto
53123.9 27640.1 lineto
53236.4 27583.8 lineto
53292.6 27527.6 lineto
53348.9 27415.1 lineto
53405.1 27190.1 lineto
53405.1 26908.9 lineto
53348.9 26683.9 lineto
53292.6 26571.4 lineto
53236.4 26515.2 lineto
53123.9 26459 lineto
53011.4 26459 lineto
52898.9 26515.2 lineto
52842.7 26571.4 lineto
52786.4 26683.9 lineto
52730.2 26908.9 lineto
52730.2 27190.1 lineto
52786.4 27415.1 lineto
52842.7 27527.6 lineto
52898.9 27583.8 lineto
53011.4 27640.1 lineto
stroke
newpath
53855 27640.1 moveto
53855 27415.1 lineto
stroke
newpath
54305 27640.1 moveto
54305 27415.1 lineto
stroke
newpath
56048.5 26009 moveto
55992.3 26065.3 lineto
55879.8 26234 lineto
55823.5 26346.5 lineto
55767.3 26515.2 lineto
55711.1 26796.4 lineto
55711.1 27021.4 lineto
55767.3 27302.6 lineto
55823.5 27471.3 lineto
55879.8 27583.8 lineto
55992.3 27752.5 lineto
56048.5 27808.8 lineto
stroke
newpath
57117.1 26459 moveto
56442.2 26459 lineto
stroke
newpath
56779.7 26459 moveto
56779.7 27640.1 lineto
56667.2 27471.3 lineto
56554.7 27358.8 lineto
56442.2 27302.6 lineto
stroke
newpath
57848.3 27640.1 moveto
57960.8 27640.1 lineto
58073.3 27583.8 lineto
58129.5 27527.6 lineto
58185.8 27415.1 lineto
58242 27190.1 lineto
58242 26908.9 lineto
58185.8 26683.9 lineto
58129.5 26571.4 lineto
58073.3 26515.2 lineto
57960.8 26459 lineto
57848.3 26459 lineto
57735.8 26515.2 lineto
57679.6 26571.4 lineto
57623.3 26683.9 lineto
57567.1 26908.9 lineto
57567.1 27190.1 lineto
57623.3 27415.1 lineto
57679.6 27527.6 lineto
57735.8 27583.8 lineto
57848.3 27640.1 lineto
stroke
newpath
59648.1 26459 moveto
59648.1 27640.1 lineto
stroke
newpath
60154.3 26459 moveto
60154.3 27077.6 lineto
60098 27190.1 lineto
59985.5 27246.4 lineto
59816.8 27246.4 lineto
59704.3 27190.1 lineto
59648.1 27133.9 lineto
stroke
newpath
60885.4 26459 moveto
60772.9 26515.2 lineto
60716.7 26571.4 lineto
60660.4 26683.9 lineto
60660.4 27021.4 lineto
60716.7 27133.9 lineto
60772.9 27190.1 lineto
60885.4 27246.4 lineto
61054.1 27246.4 lineto
61166.6 27190.1 lineto
61222.9 27133.9 lineto
61279.1 27021.4 lineto
61279.1 26683.9 lineto
61222.9 26571.4 lineto
61166.6 26515.2 lineto
61054.1 26459 lineto
60885.4 26459 lineto
stroke
newpath
61954 26459 moveto
61841.5 26515.2 lineto
61785.3 26627.7 lineto
61785.3 27640.1 lineto
stroke
newpath
62853.9 26515.2 moveto
62741.4 26459 lineto
62516.5 26459 lineto
62404 26515.2 lineto
62347.7 26627.7 lineto
62347.7 27077.6 lineto
62404 27190.1 lineto
62516.5 27246.4 lineto
62741.4 27246.4 lineto
62853.9 27190.1 lineto
62910.2 27077.6 lineto
62910.2 26965.1 lineto
62347.7 26852.7 lineto
stroke
newpath
63360.1 26515.2 moveto
63472.6 26459 lineto
63697.6 26459 lineto
63810 26515.2 lineto
63866.3 26627.7 lineto
63866.3 26683.9 lineto
63810 26796.4 lineto
63697.6 26852.7 lineto
63528.8 26852.7 lineto
63416.3 26908.9 lineto
63360.1 27021.4 lineto
63360.1 27077.6 lineto
63416.3 27190.1 lineto
63528.8 27246.4 lineto
63697.6 27246.4 lineto
63810 27190.1 lineto
stroke
newpath
64260 26009 moveto
64316.2 26065.3 lineto
64428.7 26234 lineto
64485 26346.5 lineto
64541.2 26515.2 lineto
64597.5 26796.4 lineto
64597.5 27021.4 lineto
64541.2 27302.6 lineto
64485 27471.3 lineto
64428.7 27583.8 lineto
64316.2 27752.5 lineto
64260 27808.8 lineto
stroke
newpath
36651.2 25907.6 moveto
37598 24960.8 lineto
stroke
newpath
37598 25907.6 moveto
36651.2 24960.8 lineto
stroke
37124.6 25434.2 473.389 cir0
0 0 0 setrgbcolor
0 0 0 setrgbcolor
newpath
39344.4 24899.9 moveto
38669.4 24899.9 lineto
stroke
newpath
39006.9 24899.9 moveto
39006.9 26081 lineto
38894.4 25912.3 lineto
38781.9 25799.8 lineto
38669.4 25743.5 lineto
stroke
newpath
39850.5 25012.4 moveto
39906.8 24956.1 lineto
39850.5 24899.9 lineto
39794.3 24956.1 lineto
39850.5 25012.4 lineto
39850.5 24899.9 lineto
stroke
newpath
40975.4 26081 moveto
40413 26081 lineto
40356.7 25518.6 lineto
40413 25574.8 lineto
40525.5 25631.1 lineto
40806.7 25631.1 lineto
40919.2 25574.8 lineto
40975.4 25518.6 lineto
41031.6 25406.1 lineto
41031.6 25124.9 lineto
40975.4 25012.4 lineto
40919.2 24956.1 lineto
40806.7 24899.9 lineto
40525.5 24899.9 lineto
40413 24956.1 lineto
40356.7 25012.4 lineto
stroke
newpath
41762.8 26081 moveto
41875.3 26081 lineto
41987.8 26024.8 lineto
42044 25968.5 lineto
42100.3 25856 lineto
42156.5 25631.1 lineto
42156.5 25349.8 lineto
42100.3 25124.9 lineto
42044 25012.4 lineto
41987.8 24956.1 lineto
41875.3 24899.9 lineto
41762.8 24899.9 lineto
41650.3 24956.1 lineto
41594.1 25012.4 lineto
41537.8 25124.9 lineto
41481.6 25349.8 lineto
41481.6 25631.1 lineto
41537.8 25856 lineto
41594.1 25968.5 lineto
41650.3 26024.8 lineto
41762.8 26081 lineto
stroke
newpath
42662.7 24899.9 moveto
42662.7 25687.3 lineto
stroke
newpath
42662.7 25574.8 moveto
42718.9 25631.1 lineto
42831.4 25687.3 lineto
43000.1 25687.3 lineto
43112.6 25631.1 lineto
43168.9 25518.6 lineto
43168.9 24899.9 lineto
stroke
newpath
43168.9 25518.6 moveto
43225.1 25631.1 lineto
43337.6 25687.3 lineto
43506.3 25687.3 lineto
43618.8 25631.1 lineto
43675.1 25518.6 lineto
43675.1 24899.9 lineto
stroke
newpath
44237.5 24899.9 moveto
44237.5 25687.3 lineto
stroke
newpath
44237.5 25574.8 moveto
44293.7 25631.1 lineto
44406.2 25687.3 lineto
44574.9 25687.3 lineto
44687.4 25631.1 lineto
44743.7 25518.6 lineto
44743.7 24899.9 lineto
stroke
newpath
44743.7 25518.6 moveto
44799.9 25631.1 lineto
44912.4 25687.3 lineto
45081.1 25687.3 lineto
45193.6 25631.1 lineto
45249.9 25518.6 lineto
45249.9 24899.9 lineto
stroke
newpath
47555.8 26137.2 moveto
46543.5 24618.7 lineto
stroke
newpath
49074.4 26081 moveto
49186.9 26081 lineto
49299.4 26024.8 lineto
49355.6 25968.5 lineto
49411.8 25856 lineto
49468.1 25631.1 lineto
49468.1 25349.8 lineto
49411.8 25124.9 lineto
49355.6 25012.4 lineto
49299.4 24956.1 lineto
49186.9 24899.9 lineto
49074.4 24899.9 lineto
48961.9 24956.1 lineto
48905.7 25012.4 lineto
48849.4 25124.9 lineto
48793.2 25349.8 lineto
48793.2 25631.1 lineto
48849.4 25856 lineto
48905.7 25968.5 lineto
48961.9 26024.8 lineto
49074.4 26081 lineto
stroke
newpath
49974.3 25012.4 moveto
50030.5 24956.1 lineto
49974.3 24899.9 lineto
49918 24956.1 lineto
49974.3 25012.4 lineto
49974.3 24899.9 lineto
stroke
newpath
50761.7 26081 moveto
50874.2 26081 lineto
50986.6 26024.8 lineto
51042.9 25968.5 lineto
51099.1 25856 lineto
51155.4 25631.1 lineto
51155.4 25349.8 lineto
51099.1 25124.9 lineto
51042.9 25012.4 lineto
50986.6 24956.1 lineto
50874.2 24899.9 lineto
50761.7 24899.9 lineto
50649.2 24956.1 lineto
50592.9 25012.4 lineto
50536.7 25124.9 lineto
50480.5 25349.8 lineto
50480.5 25631.1 lineto
50536.7 25856 lineto
50592.9 25968.5 lineto
50649.2 26024.8 lineto
50761.7 26081 lineto
stroke
newpath
52224 26081 moveto
51661.6 26081 lineto
51605.3 25518.6 lineto
51661.6 25574.8 lineto
51774.1 25631.1 lineto
52055.3 25631.1 lineto
52167.8 25574.8 lineto
52224 25518.6 lineto
52280.2 25406.1 lineto
52280.2 25124.9 lineto
52224 25012.4 lineto
52167.8 24956.1 lineto
52055.3 24899.9 lineto
51774.1 24899.9 lineto
51661.6 24956.1 lineto
51605.3 25012.4 lineto
stroke
newpath
52842.7 24899.9 moveto
53067.6 24899.9 lineto
53180.1 24956.1 lineto
53236.4 25012.4 lineto
53348.9 25181.1 lineto
53405.1 25406.1 lineto
53405.1 25856 lineto
53348.9 25968.5 lineto
53292.6 26024.8 lineto
53180.1 26081 lineto
52955.2 26081 lineto
52842.7 26024.8 lineto
52786.4 25968.5 lineto
52730.2 25856 lineto
52730.2 25574.8 lineto
52786.4 25462.3 lineto
52842.7 25406.1 lineto
52955.2 25349.8 lineto
53180.1 25349.8 lineto
53292.6 25406.1 lineto
53348.9 25462.3 lineto
53405.1 25574.8 lineto
stroke
newpath
53855 26081 moveto
53855 25856 lineto
stroke
newpath
54305 26081 moveto
54305 25856 lineto
stroke
newpath
56048.5 24450 moveto
55992.3 24506.2 lineto
55879.8 24674.9 lineto
55823.5 24787.4 lineto
55767.3 24956.1 lineto
55711.1 25237.4 lineto
55711.1 25462.3 lineto
55767.3 25743.5 lineto
55823.5 25912.3 lineto
55879.8 26024.8 lineto
55992.3 26193.5 lineto
56048.5 26249.7 lineto
stroke
newpath
57117.1 24899.9 moveto
56442.2 24899.9 lineto
stroke
newpath
56779.7 24899.9 moveto
56779.7 26081 lineto
56667.2 25912.3 lineto
56554.7 25799.8 lineto
56442.2 25743.5 lineto
stroke
newpath
58523.2 24899.9 moveto
58523.2 26081 lineto
stroke
newpath
59029.4 24899.9 moveto
59029.4 25518.6 lineto
58973.2 25631.1 lineto
58860.7 25687.3 lineto
58691.9 25687.3 lineto
58579.5 25631.1 lineto
58523.2 25574.8 lineto
stroke
newpath
59760.6 24899.9 moveto
59648.1 24956.1 lineto
59591.8 25012.4 lineto
59535.6 25124.9 lineto
59535.6 25462.3 lineto
59591.8 25574.8 lineto
59648.1 25631.1 lineto
59760.6 25687.3 lineto
59929.3 25687.3 lineto
60041.8 25631.1 lineto
60098 25574.8 lineto
60154.3 25462.3 lineto
60154.3 25124.9 lineto
60098 25012.4 lineto
60041.8 24956.1 lineto
59929.3 24899.9 lineto
59760.6 24899.9 lineto
stroke
newpath
60829.2 24899.9 moveto
60716.7 24956.1 lineto
60660.4 25068.6 lineto
60660.4 26081 lineto
stroke
newpath
61729.1 24956.1 moveto
61616.6 24899.9 lineto
61391.6 24899.9 lineto
61279.1 24956.1 lineto
61222.9 25068.6 lineto
61222.9 25518.6 lineto
61279.1 25631.1 lineto
61391.6 25687.3 lineto
61616.6 25687.3 lineto
61729.1 25631.1 lineto
61785.3 25518.6 lineto
61785.3 25406.1 lineto
61222.9 25293.6 lineto
stroke
newpath
62179 24450 moveto
62235.2 24506.2 lineto
62347.7 24674.9 lineto
62404 24787.4 lineto
62460.2 24956.1 lineto
62516.5 25237.4 lineto
62516.5 25462.3 lineto
62460.2 25743.5 lineto
62404 25912.3 lineto
62347.7 26024.8 lineto
62235.2 26193.5 lineto
62179 26249.7 lineto
stroke
newpath
36525 24411.7 moveto
37598 23338.6 lineto
stroke
newpath
37598 24411.7 moveto
36525 23338.6 lineto
stroke
newpath
37061.5 24411.7 moveto
37061.5 23338.6 lineto
stroke
newpath
36525 23875.2 moveto
37598 23875.2 lineto
stroke
0 0 0 setrgbcolor
0 0 0 setrgbcolor
newpath
39344.4 23340.8 moveto
38669.4 23340.8 lineto
stroke
newpath
39006.9 23340.8 moveto
39006.9 24521.9 lineto
38894.4 24353.2 lineto
38781.9 24240.7 lineto
38669.4 24184.5 lineto
stroke
newpath
39850.5 23453.3 moveto
39906.8 23397.1 lineto
39850.5 23340.8 lineto
39794.3 23397.1 lineto
39850.5 23453.3 lineto
39850.5 23340.8 lineto
stroke
newpath
40300.5 24521.9 moveto
41087.9 24521.9 lineto
40581.7 23340.8 lineto
stroke
newpath
41762.8 24521.9 moveto
41875.3 24521.9 lineto
41987.8 24465.7 lineto
42044 24409.5 lineto
42100.3 24297 lineto
42156.5 24072 lineto
42156.5 23790.8 lineto
42100.3 23565.8 lineto
42044 23453.3 lineto
41987.8 23397.1 lineto
41875.3 23340.8 lineto
41762.8 23340.8 lineto
41650.3 23397.1 lineto
41594.1 23453.3 lineto
41537.8 23565.8 lineto
41481.6 23790.8 lineto
41481.6 24072 lineto
41537.8 24297 lineto
41594.1 24409.5 lineto
41650.3 24465.7 lineto
41762.8 24521.9 lineto
stroke
newpath
42662.7 23340.8 moveto
42662.7 24128.2 lineto
stroke
newpath
42662.7 24015.8 moveto
42718.9 24072 lineto
42831.4 24128.2 lineto
43000.1 24128.2 lineto
43112.6 24072 lineto
43168.9 23959.5 lineto
43168.9 23340.8 lineto
stroke
newpath
43168.9 23959.5 moveto
43225.1 24072 lineto
43337.6 24128.2 lineto
43506.3 24128.2 lineto
43618.8 24072 lineto
43675.1 23959.5 lineto
43675.1 23340.8 lineto
stroke
newpath
44237.5 23340.8 moveto
44237.5 24128.2 lineto
stroke
newpath
44237.5 24015.8 moveto
44293.7 24072 lineto
44406.2 24128.2 lineto
44574.9 24128.2 lineto
44687.4 24072 lineto
44743.7 23959.5 lineto
44743.7 23340.8 lineto
stroke
newpath
44743.7 23959.5 moveto
44799.9 24072 lineto
44912.4 24128.2 lineto
45081.1 24128.2 lineto
45193.6 24072 lineto
45249.9 23959.5 lineto
45249.9 23340.8 lineto
stroke
newpath
47555.8 24578.2 moveto
46543.5 23059.6 lineto
stroke
newpath
49074.4 24521.9 moveto
49186.9 24521.9 lineto
49299.4 24465.7 lineto
49355.6 24409.5 lineto
49411.8 24297 lineto
49468.1 24072 lineto
49468.1 23790.8 lineto
49411.8 23565.8 lineto
49355.6 23453.3 lineto
49299.4 23397.1 lineto
49186.9 23340.8 lineto
49074.4 23340.8 lineto
48961.9 23397.1 lineto
48905.7 23453.3 lineto
48849.4 23565.8 lineto
48793.2 23790.8 lineto
48793.2 24072 lineto
48849.4 24297 lineto
48905.7 24409.5 lineto
48961.9 24465.7 lineto
49074.4 24521.9 lineto
stroke
newpath
49974.3 23453.3 moveto
50030.5 23397.1 lineto
49974.3 23340.8 lineto
49918 23397.1 lineto
49974.3 23453.3 lineto
49974.3 23340.8 lineto
stroke
newpath
50761.7 24521.9 moveto
50874.2 24521.9 lineto
50986.6 24465.7 lineto
51042.9 24409.5 lineto
51099.1 24297 lineto
51155.4 24072 lineto
51155.4 23790.8 lineto
51099.1 23565.8 lineto
51042.9 23453.3 lineto
50986.6 23397.1 lineto
50874.2 23340.8 lineto
50761.7 23340.8 lineto
50649.2 23397.1 lineto
50592.9 23453.3 lineto
50536.7 23565.8 lineto
50480.5 23790.8 lineto
50480.5 24072 lineto
50536.7 24297 lineto
50592.9 24409.5 lineto
50649.2 24465.7 lineto
50761.7 24521.9 lineto
stroke
newpath
52167.8 24521.9 moveto
51942.8 24521.9 lineto
51830.3 24465.7 lineto
51774.1 24409.5 lineto
51661.6 24240.7 lineto
51605.3 24015.8 lineto
51605.3 23565.8 lineto
51661.6 23453.3 lineto
51717.8 23397.1 lineto
51830.3 23340.8 lineto
52055.3 23340.8 lineto
52167.8 23397.1 lineto
52224 23453.3 lineto
52280.2 23565.8 lineto
52280.2 23847 lineto
52224 23959.5 lineto
52167.8 24015.8 lineto
52055.3 24072 lineto
51830.3 24072 lineto
51717.8 24015.8 lineto
51661.6 23959.5 lineto
51605.3 23847 lineto
stroke
newpath
52673.9 24521.9 moveto
53461.3 24521.9 lineto
52955.2 23340.8 lineto
stroke
newpath
53855 24521.9 moveto
53855 24297 lineto
stroke
newpath
54305 24521.9 moveto
54305 24297 lineto
stroke
newpath
56048.5 22890.9 moveto
55992.3 22947.1 lineto
55879.8 23115.9 lineto
55823.5 23228.4 lineto
55767.3 23397.1 lineto
55711.1 23678.3 lineto
55711.1 23903.3 lineto
55767.3 24184.5 lineto
55823.5 24353.2 lineto
55879.8 24465.7 lineto
55992.3 24634.4 lineto
56048.5 24690.7 lineto
stroke
newpath
57004.6 24128.2 moveto
57004.6 23340.8 lineto
stroke
newpath
56723.4 24578.2 moveto
56442.2 23734.5 lineto
57173.4 23734.5 lineto
stroke
newpath
58523.2 23340.8 moveto
58523.2 24521.9 lineto
stroke
newpath
59029.4 23340.8 moveto
59029.4 23959.5 lineto
58973.2 24072 lineto
58860.7 24128.2 lineto
58691.9 24128.2 lineto
58579.5 24072 lineto
58523.2 24015.8 lineto
stroke
newpath
59760.6 23340.8 moveto
59648.1 23397.1 lineto
59591.8 23453.3 lineto
59535.6 23565.8 lineto
59535.6 23903.3 lineto
59591.8 24015.8 lineto
59648.1 24072 lineto
59760.6 24128.2 lineto
59929.3 24128.2 lineto
60041.8 24072 lineto
60098 24015.8 lineto
60154.3 23903.3 lineto
60154.3 23565.8 lineto
60098 23453.3 lineto
60041.8 23397.1 lineto
59929.3 23340.8 lineto
59760.6 23340.8 lineto
stroke
newpath
60829.2 23340.8 moveto
60716.7 23397.1 lineto
60660.4 23509.6 lineto
60660.4 24521.9 lineto
stroke
newpath
61729.1 23397.1 moveto
61616.6 23340.8 lineto
61391.6 23340.8 lineto
61279.1 23397.1 lineto
61222.9 23509.6 lineto
61222.9 23959.5 lineto
61279.1 24072 lineto
61391.6 24128.2 lineto
61616.6 24128.2 lineto
61729.1 24072 lineto
61785.3 23959.5 lineto
61785.3 23847 lineto
61222.9 23734.5 lineto
stroke
newpath
62235.2 23397.1 moveto
62347.7 23340.8 lineto
62572.7 23340.8 lineto
62685.2 23397.1 lineto
62741.4 23509.6 lineto
62741.4 23565.8 lineto
62685.2 23678.3 lineto
62572.7 23734.5 lineto
62404 23734.5 lineto
62291.5 23790.8 lineto
62235.2 23903.3 lineto
62235.2 23959.5 lineto
62291.5 24072 lineto
62404 24128.2 lineto
62572.7 24128.2 lineto
62685.2 24072 lineto
stroke
newpath
63135.1 22890.9 moveto
63191.4 22947.1 lineto
63303.9 23115.9 lineto
63360.1 23228.4 lineto
63416.3 23397.1 lineto
63472.6 23678.3 lineto
63472.6 23903.3 lineto
63416.3 24184.5 lineto
63360.1 24353.2 lineto
63303.9 24465.7 lineto
63191.4 24634.4 lineto
63135.1 24690.7 lineto
stroke
showpage
grestore
%%EOF
