EESchema Schematic File Version 4
EELAYER 30 0
EELAYER END
$Descr A4 11693 8268
encoding utf-8
Sheet 1 1
Title "C1- Ultrasonic Sensor"
Date "2020-02-25"
Rev "1.1"
Comp "ICFOSS"
Comment1 ""
Comment2 ""
Comment3 ""
Comment4 ""
$EndDescr
$Comp
L Ultrasonic_Level_Sensor-rescue:RP-604-RP-604 U1
U 1 1 5E52CC37
P 1950 3100
F 0 "U1" H 2450 3700 50  0000 C CNN
F 1 "RP604K331A" H 2400 3800 50  0000 L CNN
F 2 "User:DFN-12-1EP_2.7x3mm_Pitch0.5mm" H 1440 2315 50  0001 L CNN
F 3 "" H 1920 3905 50  0001 C CNN
	1    1950 3100
	1    0    0    -1  
$EndComp
$Comp
L Device:Q_PMOS_GSD Q1
U 1 1 5E52E6AA
P 2050 1250
F 0 "Q1" H 2254 1296 50  0000 L CNN
F 1 "DMG3415U-7" H 2254 1205 50  0000 L CNN
F 2 "Package_TO_SOT_SMD:TSOT-23" H 2250 1350 50  0001 C CNN
F 3 "~" H 2050 1250 50  0001 C CNN
	1    2050 1250
	1    0    0    -1  
$EndComp
$Comp
L Connector_Generic:Conn_02x01 J1
U 1 1 5E52F7DA
P 950 1300
F 0 "J1" V 950 1100 50  0000 L CNN
F 1 "JST-XH-2.54" V 1050 700 50  0000 L CNN
F 2 "Connector_JST:JST_XH_B2B-XH-AM_1x02_P2.50mm_Vertical" H 950 1300 50  0001 C CNN
F 3 "~" H 950 1300 50  0001 C CNN
	1    950  1300
	0    -1   -1   0   
$EndComp
Wire Wire Line
	950  1000 950  900 
Text Label 950  900  0    50   ~ 0
Vin
$Comp
L power:GND #PWR0101
U 1 1 5E530A2A
P 950 1550
F 0 "#PWR0101" H 950 1300 50  0001 C CNN
F 1 "GND" H 955 1377 50  0000 C CNN
F 2 "" H 950 1550 50  0001 C CNN
F 3 "" H 950 1550 50  0001 C CNN
	1    950  1550
	1    0    0    -1  
$EndComp
$Comp
L power:GND #PWR0102
U 1 1 5E530EDC
P 1700 1500
F 0 "#PWR0102" H 1700 1250 50  0001 C CNN
F 1 "GND" H 1705 1327 50  0000 C CNN
F 2 "" H 1700 1500 50  0001 C CNN
F 3 "" H 1700 1500 50  0001 C CNN
	1    1700 1500
	1    0    0    -1  
$EndComp
Wire Wire Line
	2150 1050 2150 900 
Text Label 2150 900  0    50   ~ 0
Vin
Wire Wire Line
	2150 1450 2150 1600
Wire Wire Line
	1850 1250 1700 1250
Wire Wire Line
	1700 1250 1700 1500
Text Label 2150 1600 0    50   ~ 0
BAT+
$Comp
L power:PWR_FLAG #FLG0101
U 1 1 5E54016B
P 850 2700
F 0 "#FLG0101" H 850 2775 50  0001 C CNN
F 1 "PWR_FLAG" H 850 2873 50  0000 C CNN
F 2 "" H 850 2700 50  0001 C CNN
F 3 "~" H 850 2700 50  0001 C CNN
	1    850  2700
	1    0    0    -1  
$EndComp
Text Label 850  2850 0    50   ~ 0
BAT+
$Comp
L power:GND #PWR0103
U 1 1 5E5484E6
P 1500 2300
F 0 "#PWR0103" H 1500 2050 50  0001 C CNN
F 1 "GND" H 1505 2127 50  0000 C CNN
F 2 "" H 1500 2300 50  0001 C CNN
F 3 "" H 1500 2300 50  0001 C CNN
	1    1500 2300
	1    0    0    -1  
$EndComp
Wire Wire Line
	1950 2400 1950 2200
Wire Wire Line
	1950 2200 1500 2200
Wire Wire Line
	1500 2200 1500 2300
Wire Wire Line
	1300 2800 1200 2800
Wire Wire Line
	1200 2800 1200 3000
Wire Wire Line
	1200 3250 1300 3250
Wire Wire Line
	1300 3000 1200 3000
Connection ~ 1200 3000
Wire Wire Line
	1200 3000 1200 3250
$Comp
L Device:C_Small C4
U 1 1 5E549E46
P 850 3100
F 0 "C4" H 942 3146 50  0000 L CNN
F 1 "10uF" H 942 3055 50  0000 L CNN
F 2 "Capacitor_SMD:C_0805_2012Metric" H 850 3100 50  0001 C CNN
F 3 "~" H 850 3100 50  0001 C CNN
	1    850  3100
	1    0    0    -1  
$EndComp
Wire Wire Line
	1200 3000 850  3000
$Comp
L power:GND #PWR0104
U 1 1 5E54ACCA
P 850 3200
F 0 "#PWR0104" H 850 2950 50  0001 C CNN
F 1 "GND" H 855 3027 50  0000 C CNN
F 2 "" H 850 3200 50  0001 C CNN
F 3 "" H 850 3200 50  0001 C CNN
	1    850  3200
	1    0    0    -1  
$EndComp
Wire Wire Line
	850  2700 850  3000
Connection ~ 850  3000
$Comp
L power:GND #PWR0105
U 1 1 5E54C4A7
P 1200 3500
F 0 "#PWR0105" H 1200 3250 50  0001 C CNN
F 1 "GND" H 1205 3327 50  0000 C CNN
F 2 "" H 1200 3500 50  0001 C CNN
F 3 "" H 1200 3500 50  0001 C CNN
	1    1200 3500
	1    0    0    -1  
$EndComp
Wire Wire Line
	1300 3450 1200 3450
Wire Wire Line
	1200 3450 1200 3500
Wire Wire Line
	1750 3700 1950 3700
Wire Wire Line
	1950 3700 2150 3700
Connection ~ 1950 3700
Wire Wire Line
	2150 3700 2600 3700
Wire Wire Line
	2600 3700 2600 3450
Connection ~ 2150 3700
$Comp
L power:GND #PWR0106
U 1 1 5E54E184
P 2800 3500
F 0 "#PWR0106" H 2800 3250 50  0001 C CNN
F 1 "GND" H 2805 3327 50  0000 C CNN
F 2 "" H 2800 3500 50  0001 C CNN
F 3 "" H 2800 3500 50  0001 C CNN
	1    2800 3500
	1    0    0    -1  
$EndComp
Wire Wire Line
	2600 3450 2800 3450
Wire Wire Line
	2800 3450 2800 3500
Connection ~ 2600 3450
Text Notes 1450 2050 0    50   ~ 0
DC-DC Converter
$Comp
L Device:L_Small L1
U 1 1 5E5525C8
P 2750 2850
F 0 "L1" H 2798 2896 50  0000 L CNN
F 1 "2.2uH" H 2798 2805 50  0000 L CNN
F 2 "Inductor_SMD:L_1210_3225Metric_Pad1.42x2.65mm_HandSolder" H 2750 2850 50  0001 C CNN
F 3 "~" H 2750 2850 50  0001 C CNN
	1    2750 2850
	1    0    0    -1  
$EndComp
Wire Wire Line
	2600 2750 2750 2750
Wire Wire Line
	2600 3000 2750 3000
Wire Wire Line
	2750 3000 2750 2950
$Comp
L power:+3V3 #PWR0107
U 1 1 5E553BFA
P 3100 3250
F 0 "#PWR0107" H 3100 3100 50  0001 C CNN
F 1 "+3V3" H 3115 3423 50  0000 C CNN
F 2 "" H 3100 3250 50  0001 C CNN
F 3 "" H 3100 3250 50  0001 C CNN
	1    3100 3250
	1    0    0    -1  
$EndComp
Wire Wire Line
	2600 3300 2700 3300
$Comp
L Device:C_Small C12
U 1 1 5E556470
P 3100 3450
F 0 "C12" H 3192 3496 50  0000 L CNN
F 1 "22uF" H 3192 3405 50  0000 L CNN
F 2 "Capacitor_SMD:C_0805_2012Metric" H 3100 3450 50  0001 C CNN
F 3 "~" H 3100 3450 50  0001 C CNN
	1    3100 3450
	1    0    0    -1  
$EndComp
Connection ~ 3100 3300
$Comp
L power:GND #PWR0108
U 1 1 5E55717F
P 3100 3600
F 0 "#PWR0108" H 3100 3350 50  0001 C CNN
F 1 "GND" H 3105 3427 50  0000 C CNN
F 2 "" H 3100 3600 50  0001 C CNN
F 3 "" H 3100 3600 50  0001 C CNN
	1    3100 3600
	1    0    0    -1  
$EndComp
$Comp
L Device:R_Small R1
U 1 1 5E5664D0
P 4200 1700
F 0 "R1" H 4259 1746 50  0000 L CNN
F 1 "10K" H 4259 1655 50  0000 L CNN
F 2 "Resistor_SMD:R_0603_1608Metric" H 4200 1700 50  0001 C CNN
F 3 "~" H 4200 1700 50  0001 C CNN
	1    4200 1700
	1    0    0    -1  
$EndComp
$Comp
L Device:R_Small R2
U 1 1 5E566C42
P 4200 2000
F 0 "R2" H 4259 2046 50  0000 L CNN
F 1 "10K" H 4259 1955 50  0000 L CNN
F 2 "Resistor_SMD:R_0603_1608Metric" H 4200 2000 50  0001 C CNN
F 3 "~" H 4200 2000 50  0001 C CNN
	1    4200 2000
	1    0    0    -1  
$EndComp
Wire Wire Line
	4200 1800 4200 1850
Connection ~ 4200 1850
Wire Wire Line
	4200 1850 4200 1900
Text Label 4550 1850 0    50   ~ 0
BATV
Wire Wire Line
	4200 1850 4550 1850
$Comp
L Device:C_Small C13
U 1 1 5E56C635
P 3800 1950
F 0 "C13" H 3892 1996 50  0000 L CNN
F 1 "100nF" H 3892 1905 50  0000 L CNN
F 2 "Capacitor_SMD:C_0603_1608Metric" H 3800 1950 50  0001 C CNN
F 3 "~" H 3800 1950 50  0001 C CNN
	1    3800 1950
	1    0    0    -1  
$EndComp
Wire Wire Line
	3800 1850 4200 1850
$Comp
L power:GND #PWR0109
U 1 1 5E572B87
P 3800 2100
F 0 "#PWR0109" H 3800 1850 50  0001 C CNN
F 1 "GND" H 3805 1927 50  0000 C CNN
F 2 "" H 3800 2100 50  0001 C CNN
F 3 "" H 3800 2100 50  0001 C CNN
	1    3800 2100
	1    0    0    -1  
$EndComp
$Comp
L power:GND #PWR0110
U 1 1 5E572DE5
P 4200 2150
F 0 "#PWR0110" H 4200 1900 50  0001 C CNN
F 1 "GND" H 4205 1977 50  0000 C CNN
F 2 "" H 4200 2150 50  0001 C CNN
F 3 "" H 4200 2150 50  0001 C CNN
	1    4200 2150
	1    0    0    -1  
$EndComp
Wire Wire Line
	3800 2050 3800 2100
Text Notes 4250 650  0    50   ~ 0
ADC Level Shifter
$Comp
L Device:C_Small C1
U 1 1 5E58FB37
P 800 4650
F 0 "C1" H 892 4696 50  0000 L CNN
F 1 "10uF" H 892 4605 50  0000 L CNN
F 2 "Capacitor_SMD:C_0603_1608Metric" H 800 4650 50  0001 C CNN
F 3 "~" H 800 4650 50  0001 C CNN
	1    800  4650
	1    0    0    -1  
$EndComp
$Comp
L Device:C_Small C5
U 1 1 5E58FEDD
P 1200 4650
F 0 "C5" H 1292 4696 50  0000 L CNN
F 1 "100nF" H 1292 4605 50  0000 L CNN
F 2 "Capacitor_SMD:C_0603_1608Metric" H 1200 4650 50  0001 C CNN
F 3 "~" H 1200 4650 50  0001 C CNN
	1    1200 4650
	1    0    0    -1  
$EndComp
Wire Wire Line
	800  4550 1200 4550
Wire Wire Line
	800  4750 1200 4750
$Comp
L power:GND #PWR0111
U 1 1 5E591CFD
P 800 4750
F 0 "#PWR0111" H 800 4500 50  0001 C CNN
F 1 "GND" H 805 4577 50  0000 C CNN
F 2 "" H 800 4750 50  0001 C CNN
F 3 "" H 800 4750 50  0001 C CNN
	1    800  4750
	1    0    0    -1  
$EndComp
Connection ~ 800  4750
Wire Wire Line
	800  4550 700  4550
Connection ~ 800  4550
Wire Wire Line
	1200 4550 1250 4550
Connection ~ 1200 4550
Wire Wire Line
	700  4550 700  4500
$Comp
L power:+3V3 #PWR0112
U 1 1 5E594FDF
P 700 4500
F 0 "#PWR0112" H 700 4350 50  0001 C CNN
F 1 "+3V3" H 715 4673 50  0000 C CNN
F 2 "" H 700 4500 50  0001 C CNN
F 3 "" H 700 4500 50  0001 C CNN
	1    700  4500
	1    0    0    -1  
$EndComp
Text Label 1250 4400 0    50   ~ 0
VDD_USB
Wire Wire Line
	1250 4400 1250 4550
$Comp
L Device:C_Small C9
U 1 1 5E5A1CF7
P 2050 4650
F 0 "C9" H 2142 4696 50  0000 L CNN
F 1 "10uF" H 2142 4605 50  0000 L CNN
F 2 "Capacitor_SMD:C_0603_1608Metric" H 2050 4650 50  0001 C CNN
F 3 "~" H 2050 4650 50  0001 C CNN
	1    2050 4650
	1    0    0    -1  
$EndComp
$Comp
L power:GND #PWR0113
U 1 1 5E5A1D0D
P 2050 4750
F 0 "#PWR0113" H 2050 4500 50  0001 C CNN
F 1 "GND" H 2055 4577 50  0000 C CNN
F 2 "" H 2050 4750 50  0001 C CNN
F 3 "" H 2050 4750 50  0001 C CNN
	1    2050 4750
	1    0    0    -1  
$EndComp
Wire Wire Line
	2050 4550 1950 4550
Wire Wire Line
	1950 4550 1950 4500
$Comp
L power:+3V3 #PWR0114
U 1 1 5E5A1D1D
P 1950 4500
F 0 "#PWR0114" H 1950 4350 50  0001 C CNN
F 1 "+3V3" H 1965 4673 50  0000 C CNN
F 2 "" H 1950 4500 50  0001 C CNN
F 3 "" H 1950 4500 50  0001 C CNN
	1    1950 4500
	1    0    0    -1  
$EndComp
$Comp
L Device:C_Small C2
U 1 1 5E5A8D50
P 800 5400
F 0 "C2" H 892 5446 50  0000 L CNN
F 1 "10uF" H 892 5355 50  0000 L CNN
F 2 "Capacitor_SMD:C_0603_1608Metric" H 800 5400 50  0001 C CNN
F 3 "~" H 800 5400 50  0001 C CNN
	1    800  5400
	1    0    0    -1  
$EndComp
$Comp
L Device:C_Small C6
U 1 1 5E5A8D5A
P 1200 5400
F 0 "C6" H 1292 5446 50  0000 L CNN
F 1 "100nF" H 1292 5355 50  0000 L CNN
F 2 "Capacitor_SMD:C_0603_1608Metric" H 1200 5400 50  0001 C CNN
F 3 "~" H 1200 5400 50  0001 C CNN
	1    1200 5400
	1    0    0    -1  
$EndComp
Wire Wire Line
	800  5300 1200 5300
Wire Wire Line
	800  5500 1200 5500
$Comp
L power:GND #PWR0115
U 1 1 5E5A8D66
P 800 5500
F 0 "#PWR0115" H 800 5250 50  0001 C CNN
F 1 "GND" H 805 5327 50  0000 C CNN
F 2 "" H 800 5500 50  0001 C CNN
F 3 "" H 800 5500 50  0001 C CNN
	1    800  5500
	1    0    0    -1  
$EndComp
Connection ~ 800  5500
Wire Wire Line
	800  5300 700  5300
Connection ~ 800  5300
Wire Wire Line
	1200 5300 1250 5300
Connection ~ 1200 5300
Wire Wire Line
	700  5300 700  5250
$Comp
L power:+3V3 #PWR0116
U 1 1 5E5A8D76
P 700 5250
F 0 "#PWR0116" H 700 5100 50  0001 C CNN
F 1 "+3V3" H 715 5423 50  0000 C CNN
F 2 "" H 700 5250 50  0001 C CNN
F 3 "" H 700 5250 50  0001 C CNN
	1    700  5250
	1    0    0    -1  
$EndComp
Wire Wire Line
	1250 5150 1250 5300
Wire Wire Line
	3000 4400 3000 4550
Connection ~ 2950 4550
Wire Wire Line
	2950 4550 3000 4550
Wire Wire Line
	2550 4750 2950 4750
Wire Wire Line
	2550 4550 2950 4550
$Comp
L Device:C_Small C11
U 1 1 5E5A1D01
P 2950 4650
F 0 "C11" H 3042 4696 50  0000 L CNN
F 1 "100nF" H 3042 4605 50  0000 L CNN
F 2 "Capacitor_SMD:C_0603_1608Metric" H 2950 4650 50  0001 C CNN
F 3 "~" H 2950 4650 50  0001 C CNN
	1    2950 4650
	1    0    0    -1  
$EndComp
Text Label 1250 5150 0    50   ~ 0
VDD_MCU
Text Label 3000 4400 0    50   ~ 0
VDD_RF
$Comp
L Device:C_Small C10
U 1 1 5E5D79B7
P 2550 4650
F 0 "C10" H 2642 4696 50  0000 L CNN
F 1 "1uF" H 2642 4605 50  0000 L CNN
F 2 "Capacitor_SMD:C_0603_1608Metric" H 2550 4650 50  0001 C CNN
F 3 "~" H 2550 4650 50  0001 C CNN
	1    2550 4650
	1    0    0    -1  
$EndComp
Wire Wire Line
	2550 4550 2050 4550
Connection ~ 2550 4550
Connection ~ 2050 4550
Wire Wire Line
	2550 4750 2050 4750
Connection ~ 2550 4750
Connection ~ 2050 4750
$Comp
L Jumper:SolderJumper_2_Bridged JP1
U 1 1 5E5F2D99
P 2500 5350
F 0 "JP1" H 2500 5555 50  0000 C CNN
F 1 "SJ_Closed" H 2500 5464 50  0000 C CNN
F 2 "Jumper:SolderJumper-2_P1.3mm_Bridged_RoundedPad1.0x1.5mm" H 2500 5350 50  0001 C CNN
F 3 "~" H 2500 5350 50  0001 C CNN
	1    2500 5350
	1    0    0    -1  
$EndComp
Wire Wire Line
	2350 5350 2100 5350
Wire Wire Line
	2650 5350 2750 5350
Text Label 3000 5350 0    50   ~ 0
VREF+
Text Label 2100 5350 2    50   ~ 0
VDD_MCU
Wire Wire Line
	2750 5350 2750 5650
Connection ~ 2750 5350
Wire Wire Line
	2750 5350 3000 5350
Text Label 2750 5650 0    50   ~ 0
AREF
Text Notes 1550 4150 0    50   ~ 0
Power Inputs
$Comp
L power:GND #PWR0117
U 1 1 5E64F34D
P 3250 1500
F 0 "#PWR0117" H 3250 1250 50  0001 C CNN
F 1 "GND" H 3255 1327 50  0000 C CNN
F 2 "" H 3250 1500 50  0001 C CNN
F 3 "" H 3250 1500 50  0001 C CNN
	1    3250 1500
	1    0    0    -1  
$EndComp
Text Label 3250 1300 0    50   ~ 0
GND
Wire Wire Line
	3250 1300 3250 1500
$Comp
L Switch:SW_Push SW1
U 1 1 5E686772
P 4250 3250
F 0 "SW1" H 4250 3535 50  0000 C CNN
F 1 "RESET" H 4250 3444 50  0000 C CNN
F 2 "User:3x6x2.5mm_tact_switch" H 4250 3450 50  0001 C CNN
F 3 "~" H 4250 3450 50  0001 C CNN
	1    4250 3250
	1    0    0    -1  
$EndComp
$Comp
L Device:C_Small C14
U 1 1 5E6A68AB
P 4250 3450
F 0 "C14" V 4500 3450 50  0000 C CNN
F 1 "10uF" V 4400 3450 50  0000 C CNN
F 2 "Capacitor_SMD:C_0603_1608Metric" H 4250 3450 50  0001 C CNN
F 3 "~" H 4250 3450 50  0001 C CNN
	1    4250 3450
	0    1    1    0   
$EndComp
Wire Wire Line
	4050 3250 4050 3450
Wire Wire Line
	4050 3450 4150 3450
Wire Wire Line
	4450 3450 4350 3450
Text Label 4450 3350 0    50   ~ 0
MCU_RST
Wire Wire Line
	4450 3250 4450 3450
Text Label 4050 3350 2    50   ~ 0
GND
Text Notes 4100 2750 0    50   ~ 0
RESET
Text Notes 800  600  0    50   ~ 0
Battery Connector and Reverse Polarity Protection
$Comp
L Connector:TestPoint TP1
U 1 1 5E6C2967
P 5500 5300
F 0 "TP1" H 5558 5418 50  0000 L CNN
F 1 "Clock" H 5558 5327 50  0000 L CNN
F 2 "TestPoint:TestPoint_Pad_D1.5mm" H 5700 5300 50  0001 C CNN
F 3 "~" H 5700 5300 50  0001 C CNN
	1    5500 5300
	1    0    0    -1  
$EndComp
Wire Wire Line
	5500 5300 5500 5400
Text Notes 4200 1500 0    39   ~ 0
D
Text Notes 4200 1150 0    39   ~ 0
S
Wire Wire Line
	4200 1600 4200 1500
Text Label 5200 1300 0    50   ~ 0
BAT_E
Wire Wire Line
	4200 1100 4200 950 
$Comp
L Device:R_Small R3
U 1 1 5E8B05D8
P 4550 1050
F 0 "R3" H 4609 1096 50  0000 L CNN
F 1 "100K" H 4609 1005 50  0000 L CNN
F 2 "Resistor_SMD:R_0603_1608Metric" H 4550 1050 50  0001 C CNN
F 3 "~" H 4550 1050 50  0001 C CNN
	1    4550 1050
	1    0    0    -1  
$EndComp
Wire Wire Line
	4500 1300 4550 1300
Wire Wire Line
	4550 1150 4550 1300
Connection ~ 4550 1300
Wire Wire Line
	4200 950  4550 950 
Text Label 4200 950  2    50   ~ 0
BAT+
Wire Notes Line
	500  1850 3600 1850
Wire Notes Line
	5500 2500 5500 500 
Wire Notes Line
	500  3950 4900 3950
$Comp
L Device:L_Small L2
U 1 1 5E9CC134
P 9300 3500
F 0 "L2" H 9348 3546 50  0000 L CNN
F 1 "L" H 9348 3455 50  0000 L CNN
F 2 "Inductor_SMD:L_0402_1005Metric" H 9300 3500 50  0001 C CNN
F 3 "~" H 9300 3500 50  0001 C CNN
	1    9300 3500
	1    0    0    -1  
$EndComp
$Comp
L Device:L_Small L3
U 1 1 5E9CC6B7
P 9950 3500
F 0 "L3" H 9998 3546 50  0000 L CNN
F 1 "L" H 9998 3455 50  0000 L CNN
F 2 "Inductor_SMD:L_0402_1005Metric" H 9950 3500 50  0001 C CNN
F 3 "~" H 9950 3500 50  0001 C CNN
	1    9950 3500
	1    0    0    -1  
$EndComp
Wire Wire Line
	9100 3250 9300 3250
Wire Wire Line
	9300 3400 9300 3250
Connection ~ 9300 3250
Wire Wire Line
	9300 3250 9500 3250
Wire Wire Line
	9300 3600 9300 3700
Wire Wire Line
	9950 3600 9950 3700
$Comp
L power:GND #PWR0125
U 1 1 5E9E4D69
P 9300 3700
F 0 "#PWR0125" H 9300 3450 50  0001 C CNN
F 1 "GND" H 9305 3527 50  0000 C CNN
F 2 "" H 9300 3700 50  0001 C CNN
F 3 "" H 9300 3700 50  0001 C CNN
	1    9300 3700
	1    0    0    -1  
$EndComp
$Comp
L power:GND #PWR0126
U 1 1 5E9E502F
P 9950 3700
F 0 "#PWR0126" H 9950 3450 50  0001 C CNN
F 1 "GND" H 9955 3527 50  0000 C CNN
F 2 "" H 9950 3700 50  0001 C CNN
F 3 "" H 9950 3700 50  0001 C CNN
	1    9950 3700
	1    0    0    -1  
$EndComp
Text Label 8800 3250 2    50   ~ 0
ANT
Wire Wire Line
	9700 3250 9950 3250
Wire Wire Line
	9950 3400 9950 3250
Connection ~ 9950 3250
$Comp
L Connector:Conn_Coaxial J5
U 1 1 5E9F2930
P 10700 3250
F 0 "J5" H 10800 3225 50  0000 L CNN
F 1 "SMA/uFL" H 10800 3134 50  0000 L CNN
F 2 "Connector_Coaxial:SMA_Amphenol_132134-11_Vertical" H 10700 3250 50  0001 C CNN
F 3 " ~" H 10700 3250 50  0001 C CNN
	1    10700 3250
	1    0    0    -1  
$EndComp
$Comp
L power:GND #PWR0127
U 1 1 5E9F30B8
P 10700 3700
F 0 "#PWR0127" H 10700 3450 50  0001 C CNN
F 1 "GND" H 10705 3527 50  0000 C CNN
F 2 "" H 10700 3700 50  0001 C CNN
F 3 "" H 10700 3700 50  0001 C CNN
	1    10700 3700
	1    0    0    -1  
$EndComp
Wire Wire Line
	9950 3250 10500 3250
Wire Wire Line
	10700 3450 10700 3700
Text Notes 8000 650  0    50   ~ 0
Interfaces/Connectors
Wire Wire Line
	5950 4700 5600 4700
NoConn ~ 5950 5700
Wire Wire Line
	5850 5400 5950 5400
Wire Wire Line
	5850 5200 5850 5400
Wire Wire Line
	5950 5200 5850 5200
Wire Wire Line
	5500 5400 5850 5400
Connection ~ 5850 5400
$Comp
L power:GND #PWR0128
U 1 1 5E915ED9
P 5600 6150
F 0 "#PWR0128" H 5600 5900 50  0001 C CNN
F 1 "GND" H 5605 5977 50  0000 C CNN
F 2 "" H 5600 6150 50  0001 C CNN
F 3 "" H 5600 6150 50  0001 C CNN
	1    5600 6150
	1    0    0    -1  
$EndComp
Wire Wire Line
	5950 5900 5600 5900
NoConn ~ 5950 5500
NoConn ~ 5950 4100
Text Label 7900 3700 0    50   ~ 0
BAT_E
Text Label 7950 5900 0    50   ~ 0
ANT
Wire Wire Line
	5600 5900 5600 5950
$Comp
L Device:R_Small R4
U 1 1 5E914A95
P 5600 6050
F 0 "R4" H 5659 6096 50  0000 L CNN
F 1 "10K" H 5659 6005 50  0000 L CNN
F 2 "Resistor_SMD:R_0603_1608Metric" H 5600 6050 50  0001 C CNN
F 3 "~" H 5600 6050 50  0001 C CNN
	1    5600 6050
	1    0    0    -1  
$EndComp
Text Label 5600 3900 2    50   ~ 0
UART_H_RX
Text Label 5600 3800 2    50   ~ 0
UART_H_TX
Text Label 5600 4300 2    50   ~ 0
UART_TX
Text Label 5600 4400 2    50   ~ 0
UART_RX
Text Label 5600 5000 2    50   ~ 0
MCU_RST
Text Label 5600 4700 2    50   ~ 0
SWDIO
Text Label 5600 4800 2    50   ~ 0
SWCLK
Wire Wire Line
	5950 5000 5600 5000
Wire Wire Line
	5950 4800 5600 4800
Wire Wire Line
	5950 4400 5600 4400
Wire Wire Line
	5950 4300 5600 4300
Wire Wire Line
	5950 3900 5600 3900
Wire Wire Line
	5600 3800 5950 3800
Wire Wire Line
	5950 3700 5600 3700
Wire Wire Line
	7750 5900 7950 5900
Wire Wire Line
	7750 3700 7900 3700
NoConn ~ 7750 5000
NoConn ~ 7750 4900
NoConn ~ 7750 4800
$Comp
L RF_Module:CMWX1ZZABZ-091 U3
U 1 1 5E521902
P 6850 4600
F 0 "U3" H 7200 3000 50  0000 C CNN
F 1 "CMWX1ZZABZ-091" H 7500 3100 50  0000 C CNN
F 2 "RF_Module:CMWX1ZZABZ" H 6850 4600 50  0001 C CNN
F 3 "https://wireless.murata.com/RFM/data/type_abz.pdf" H 9300 3100 50  0001 C CNN
	1    6850 4600
	1    0    0    -1  
$EndComp
Wire Wire Line
	6650 3100 6650 2950
Wire Wire Line
	6750 3100 6750 2950
Wire Wire Line
	6850 3100 6850 2950
Wire Wire Line
	6950 3100 6950 2950
Text Label 6650 2950 1    50   ~ 0
VDD_USB
Text Label 6750 2950 1    50   ~ 0
VDD_MCU
Text Label 6950 2950 1    50   ~ 0
VREF+
NoConn ~ 7750 3900
NoConn ~ 7750 4000
$Comp
L power:GND #PWR0129
U 1 1 5E587CB2
P 6850 6100
F 0 "#PWR0129" H 6850 5850 50  0001 C CNN
F 1 "GND" H 6855 5927 50  0000 C CNN
F 2 "" H 6850 6100 50  0001 C CNN
F 3 "" H 6850 6100 50  0001 C CNN
	1    6850 6100
	1    0    0    -1  
$EndComp
Text Notes 9550 2700 0    50   ~ 0
Antenna Section
NoConn ~ 7750 5700
NoConn ~ 7750 5600
NoConn ~ 7750 5500
NoConn ~ 7750 5400
NoConn ~ 7750 5300
NoConn ~ 7750 5200
Text Label 6350 2050 2    50   ~ 0
AREF
$Comp
L power:PWR_FLAG #FLG0102
U 1 1 5EB22AEF
P 3000 5150
F 0 "#FLG0102" H 3000 5225 50  0001 C CNN
F 1 "PWR_FLAG" H 3000 5323 50  0000 C CNN
F 2 "" H 3000 5150 50  0001 C CNN
F 3 "~" H 3000 5150 50  0001 C CNN
	1    3000 5150
	1    0    0    -1  
$EndComp
Wire Wire Line
	3000 5150 3000 5350
Wire Notes Line
	3600 6100 3600 500 
Wire Wire Line
	7750 4600 7950 4600
Wire Wire Line
	7750 4500 7950 4500
Wire Wire Line
	7750 4400 7950 4400
Wire Wire Line
	7750 4300 7950 4300
Wire Wire Line
	7750 4200 7950 4200
Wire Wire Line
	7750 4100 7950 4100
Text Label 7950 4100 0    50   ~ 0
SCL
Text Label 7950 4200 0    50   ~ 0
SDA
Text Label 7950 4300 0    50   ~ 0
NSS
Text Label 7950 4400 0    50   ~ 0
SCK
Text Label 7950 4500 0    50   ~ 0
MISO
Text Label 7950 4600 0    50   ~ 0
MOSI
Wire Wire Line
	5950 4000 5600 4000
Text Label 5600 4000 2    50   ~ 0
BATV
Text Label 5600 3700 2    50   ~ 0
SFT_RST
$Comp
L Connector_Generic:Conn_01x01 J8
U 1 1 5EC3796D
P 6550 2050
F 0 "J8" H 6630 2092 50  0000 L CNN
F 1 "Ext_Aref" H 6630 2001 50  0000 L CNN
F 2 "Connector_PinHeader_1.00mm:PinHeader_1x01_P1.00mm_Vertical" H 6550 2050 50  0001 C CNN
F 3 "~" H 6550 2050 50  0001 C CNN
	1    6550 2050
	1    0    0    -1  
$EndComp
$Comp
L Connector_Generic:Conn_01x03 J4
U 1 1 5EC42100
P 6550 1050
F 0 "J4" H 6630 1092 50  0000 L CNN
F 1 "RST" H 6630 1001 50  0000 L CNN
F 2 "Connector_JST:JST_PH_B3B-PH-K_1x03_P2.00mm_Vertical" H 6550 1050 50  0001 C CNN
F 3 "~" H 6550 1050 50  0001 C CNN
	1    6550 1050
	1    0    0    -1  
$EndComp
$Comp
L Connector_Generic:Conn_01x03 J6
U 1 1 5EC425AB
P 6550 1600
F 0 "J6" H 6630 1642 50  0000 L CNN
F 1 "SFT_RST" H 6630 1551 50  0000 L CNN
F 2 "Connector_JST:JST_PH_B3B-PH-K_1x03_P2.00mm_Vertical" H 6550 1600 50  0001 C CNN
F 3 "~" H 6550 1600 50  0001 C CNN
	1    6550 1600
	1    0    0    -1  
$EndComp
Wire Wire Line
	6350 1050 6050 1050
Wire Wire Line
	6350 1150 6050 1150
Wire Wire Line
	6350 1600 6050 1600
Wire Wire Line
	6350 1700 6050 1700
Text Label 6050 1700 2    50   ~ 0
SFT_RST
Text Label 6050 1600 2    50   ~ 0
GND
$Comp
L power:+3V3 #PWR02
U 1 1 5EC7030C
P 5800 1500
F 0 "#PWR02" H 5800 1350 50  0001 C CNN
F 1 "+3V3" H 5815 1673 50  0000 C CNN
F 2 "" H 5800 1500 50  0001 C CNN
F 3 "" H 5800 1500 50  0001 C CNN
	1    5800 1500
	1    0    0    -1  
$EndComp
Wire Wire Line
	5800 1500 6350 1500
$Comp
L power:+3V3 #PWR01
U 1 1 5EC7C6CA
P 5750 950
F 0 "#PWR01" H 5750 800 50  0001 C CNN
F 1 "+3V3" H 5765 1123 50  0000 C CNN
F 2 "" H 5750 950 50  0001 C CNN
F 3 "" H 5750 950 50  0001 C CNN
	1    5750 950 
	1    0    0    -1  
$EndComp
Wire Wire Line
	5750 950  6350 950 
Text Label 6050 1050 2    50   ~ 0
GND
Text Label 6050 1150 2    50   ~ 0
MCU_RST
$Comp
L Connector_Generic:Conn_01x05 J3
U 1 1 5E6DD01B
P 8050 1950
F 0 "J3" H 8130 1992 50  0000 L CNN
F 1 "SWD" H 8130 1901 50  0000 L CNN
F 2 "Connector_PinHeader_2.54mm:PinHeader_1x05_P2.54mm_Vertical" H 8050 1950 50  0001 C CNN
F 3 "~" H 8050 1950 50  0001 C CNN
	1    8050 1950
	1    0    0    -1  
$EndComp
Wire Wire Line
	7850 2150 7500 2150
Text Label 7500 2150 2    50   ~ 0
MCU_RST
$Comp
L Connector_Generic:Conn_01x04 J2
U 1 1 5E62CD0D
P 8050 1050
F 0 "J2" H 8130 1042 50  0000 L CNN
F 1 "UART_1_Sensor" H 8130 951 50  0000 L CNN
F 2 "Connector_JST:JST_PH_B4B-PH-K_1x04_P2.00mm_Vertical" H 8050 1050 50  0001 C CNN
F 3 "~" H 8050 1050 50  0001 C CNN
	1    8050 1050
	1    0    0    -1  
$EndComp
Wire Wire Line
	7500 1250 7850 1250
Wire Wire Line
	7500 1150 7850 1150
$Comp
L power:+3V3 #PWR0119
U 1 1 5E6E89FB
P 7250 1750
F 0 "#PWR0119" H 7250 1600 50  0001 C CNN
F 1 "+3V3" H 7265 1923 50  0000 C CNN
F 2 "" H 7250 1750 50  0001 C CNN
F 3 "" H 7250 1750 50  0001 C CNN
	1    7250 1750
	1    0    0    -1  
$EndComp
Wire Wire Line
	7550 1750 7250 1750
$Comp
L Jumper:SolderJumper_2_Bridged JP2
U 1 1 5E6F24C5
P 7700 1750
F 0 "JP2" H 7700 1955 50  0000 C CNN
F 1 "SJ_Closed" H 7700 1864 50  0000 C CNN
F 2 "Jumper:SolderJumper-2_P1.3mm_Bridged_RoundedPad1.0x1.5mm" H 7700 1750 50  0001 C CNN
F 3 "~" H 7700 1750 50  0001 C CNN
	1    7700 1750
	1    0    0    -1  
$EndComp
Text Label 7500 1950 2    50   ~ 0
GND
Text Label 7500 1850 2    50   ~ 0
SWCLK
Text Label 7500 2050 2    50   ~ 0
SWDIO
Wire Wire Line
	7850 2050 7500 2050
Wire Wire Line
	7850 1950 7500 1950
Wire Wire Line
	7850 1850 7500 1850
Text Label 7500 1150 2    50   ~ 0
UART_TX
Text Label 7500 1250 2    50   ~ 0
UART_RX
$Comp
L power:+3V3 #PWR0118
U 1 1 5E6652DA
P 7700 950
F 0 "#PWR0118" H 7700 800 50  0001 C CNN
F 1 "+3V3" H 7715 1123 50  0000 C CNN
F 2 "" H 7700 950 50  0001 C CNN
F 3 "" H 7700 950 50  0001 C CNN
	1    7700 950 
	1    0    0    -1  
$EndComp
Wire Wire Line
	7850 950  7700 950 
Wire Notes Line
	3600 2500 11200 2500
$Comp
L Device:C_Small C3
U 1 1 5ED17833
P 9000 3250
F 0 "C3" V 8771 3250 50  0000 C CNN
F 1 "0R" V 8862 3250 50  0000 C CNN
F 2 "Capacitor_SMD:C_0402_1005Metric" H 9000 3250 50  0001 C CNN
F 3 "~" H 9000 3250 50  0001 C CNN
	1    9000 3250
	0    1    1    0   
$EndComp
$Comp
L Device:C_Small C15
U 1 1 5E9CB84B
P 9600 3250
F 0 "C15" V 9371 3250 50  0000 C CNN
F 1 "0R" V 9462 3250 50  0000 C CNN
F 2 "Capacitor_SMD:C_0402_1005Metric" H 9600 3250 50  0001 C CNN
F 3 "~" H 9600 3250 50  0001 C CNN
	1    9600 3250
	0    1    1    0   
$EndComp
Wire Wire Line
	8900 3250 8800 3250
Wire Notes Line
	8400 2500 8400 4200
Wire Notes Line
	8400 4200 11200 4200
$Comp
L Connector:TestPoint TP2
U 1 1 5ED4FF7B
P 3150 2150
F 0 "TP2" H 3208 2268 50  0000 L CNN
F 1 "3V3" H 3208 2177 50  0000 L CNN
F 2 "TestPoint:TestPoint_Pad_D1.5mm" H 3350 2150 50  0001 C CNN
F 3 "~" H 3350 2150 50  0001 C CNN
	1    3150 2150
	1    0    0    -1  
$EndComp
$Comp
L power:+3V3 #PWR03
U 1 1 5ED5324D
P 3150 2150
F 0 "#PWR03" H 3150 2000 50  0001 C CNN
F 1 "+3V3" H 3165 2323 50  0000 C CNN
F 2 "" H 3150 2150 50  0001 C CNN
F 3 "" H 3150 2150 50  0001 C CNN
	1    3150 2150
	-1   0    0    1   
$EndComp
$Comp
L Device:C_Small C7
U 1 1 5ED6B87F
P 5000 1300
F 0 "C7" V 4771 1300 50  0000 C CNN
F 1 "100nF" V 4862 1300 50  0000 C CNN
F 2 "Capacitor_SMD:C_0603_1608Metric" H 5000 1300 50  0001 C CNN
F 3 "~" H 5000 1300 50  0001 C CNN
	1    5000 1300
	0    1    1    0   
$EndComp
Wire Wire Line
	5200 1300 5100 1300
Wire Wire Line
	4550 1300 4900 1300
Text Label 8900 1450 2    50   ~ 0
UART_H_TX
Text Label 8900 1550 2    50   ~ 0
UART_H_RX
Text Label 8900 1850 2    50   ~ 0
SCL
Text Label 8900 1750 2    50   ~ 0
SDA
Text Label 10400 1950 3    50   ~ 0
UART_H_RX
$Comp
L power:+3V3 #PWR04
U 1 1 5EDAEF8B
P 9500 4850
F 0 "#PWR04" H 9500 4700 50  0001 C CNN
F 1 "+3V3" H 9515 5023 50  0000 C CNN
F 2 "" H 9500 4850 50  0001 C CNN
F 3 "" H 9500 4850 50  0001 C CNN
	1    9500 4850
	1    0    0    -1  
$EndComp
$Comp
L Device:R_Small R5
U 1 1 5EDA01B3
P 9500 6000
F 0 "R5" H 9550 6050 50  0000 L CNN
F 1 "330" H 9550 5950 50  0000 L CNN
F 2 "Resistor_SMD:R_0603_1608Metric" H 9500 6000 50  0001 C CNN
F 3 "~" H 9500 6000 50  0001 C CNN
	1    9500 6000
	1    0    0    -1  
$EndComp
$Comp
L Jumper:SolderJumper_2_Open JP3
U 1 1 5EE7E6A7
P 10400 1650
F 0 "JP3" V 10354 1718 50  0000 L CNN
F 1 "SJ_Open" H 10250 1550 50  0000 L CNN
F 2 "Jumper:SolderJumper-2_P1.3mm_Open_RoundedPad1.0x1.5mm" H 10400 1650 50  0001 C CNN
F 3 "~" H 10400 1650 50  0001 C CNN
	1    10400 1650
	0    1    1    0   
$EndComp
Text Label 10850 1950 3    50   ~ 0
UART_H_TX
$Comp
L Jumper:SolderJumper_2_Open JP4
U 1 1 5EEB9F73
P 10850 1650
F 0 "JP4" V 10896 1562 50  0000 R CNN
F 1 "SJ_Open" H 11000 1750 50  0000 R CNN
F 2 "Jumper:SolderJumper-2_P1.3mm_Open_RoundedPad1.0x1.5mm" H 10850 1650 50  0001 C CNN
F 3 "~" H 10850 1650 50  0001 C CNN
	1    10850 1650
	0    -1   -1   0   
$EndComp
$Comp
L Connector:UEXT_Host J7
U 1 1 5EBCAAC8
P 9400 1650
F 0 "J7" H 8900 2250 50  0000 C CNN
F 1 "UEXT_Host" H 9050 2150 50  0000 C CNN
F 2 "Connector_IDC:IDC-Header_2x05_P2.54mm_Vertical" H 9250 1650 50  0001 C CNN
F 3 "https://www.olimex.com/Products/Modules/UEXT/resources/UEXT_rev_B.pdf" H 9250 1650 50  0001 C CNN
	1    9400 1650
	1    0    0    -1  
$EndComp
$Comp
L power:+3V3 #PWR0121
U 1 1 5EBF283C
P 9400 1150
F 0 "#PWR0121" H 9400 1000 50  0001 C CNN
F 1 "+3V3" H 9415 1323 50  0000 C CNN
F 2 "" H 9400 1150 50  0001 C CNN
F 3 "" H 9400 1150 50  0001 C CNN
	1    9400 1150
	1    0    0    -1  
$EndComp
Text Label 9900 1750 0    50   ~ 0
NSS
Text Label 9900 1550 0    50   ~ 0
MOSI
Text Label 9900 1450 0    50   ~ 0
MISO
Text Label 9900 1650 0    50   ~ 0
SCK
$Comp
L power:GND #PWR0120
U 1 1 5EC06FDB
P 9400 2150
F 0 "#PWR0120" H 9400 1900 50  0001 C CNN
F 1 "GND" H 9405 1977 50  0000 C CNN
F 2 "" H 9400 2150 50  0001 C CNN
F 3 "" H 9400 2150 50  0001 C CNN
	1    9400 2150
	1    0    0    -1  
$EndComp
Wire Wire Line
	10850 1800 10850 1950
Wire Wire Line
	10400 1800 10400 1950
Text Notes 10000 4150 0    31   ~ 0
L2 & L3 are Ferrite Beads. Eg : BLM15HB121SN1 
$Comp
L Transistor_FET:BSS84 Q2
U 1 1 5E5896AC
P 4300 1300
F 0 "Q2" H 4505 1254 50  0000 L CNN
F 1 "BSS84" H 4505 1345 50  0000 L CNN
F 2 "Package_TO_SOT_SMD:SOT-23" H 4500 1225 50  0001 L CIN
F 3 "http://assets.nexperia.com/documents/data-sheet/BSS84.pdf" H 4300 1300 50  0001 L CNN
	1    4300 1300
	-1   0    0    1   
$EndComp
Text Notes 4900 1550 0    39   ~ 0
C7 Replaced With \n0R for prototype
$Comp
L Device:LED D1
U 1 1 5E5C3541
P 9500 5600
F 0 "D1" V 9539 5482 50  0000 R CNN
F 1 "RED" V 9448 5482 50  0000 R CNN
F 2 "LED_SMD:LED_0603_1608Metric" H 9500 5600 50  0001 C CNN
F 3 "~" H 9500 5600 50  0001 C CNN
	1    9500 5600
	0    -1   -1   0   
$EndComp
$Comp
L Device:LED D2
U 1 1 5E5C44C3
P 10100 5550
F 0 "D2" V 10139 5432 50  0000 R CNN
F 1 "GREEN" V 10048 5432 50  0000 R CNN
F 2 "LED_SMD:LED_0603_1608Metric" H 10100 5550 50  0001 C CNN
F 3 "~" H 10100 5550 50  0001 C CNN
	1    10100 5550
	0    -1   -1   0   
$EndComp
Wire Wire Line
	7750 3800 7900 3800
Text Label 7900 3800 0    50   ~ 0
LED_E
$Comp
L Device:R_Small R7
U 1 1 5E5F9CB3
P 10100 5950
F 0 "R7" H 10150 6000 50  0000 L CNN
F 1 "330" H 10150 5900 50  0000 L CNN
F 2 "Resistor_SMD:R_0603_1608Metric" H 10100 5950 50  0001 C CNN
F 3 "~" H 10100 5950 50  0001 C CNN
	1    10100 5950
	1    0    0    -1  
$EndComp
Wire Wire Line
	9500 5750 9500 5900
Wire Wire Line
	10100 5700 10100 5850
Wire Wire Line
	9500 6100 9500 6200
Wire Wire Line
	10100 6150 10100 6050
$Comp
L power:GND #PWR0122
U 1 1 5E606FEF
P 9500 6200
F 0 "#PWR0122" H 9500 5950 50  0001 C CNN
F 1 "GND" H 9505 6027 50  0000 C CNN
F 2 "" H 9500 6200 50  0001 C CNN
F 3 "" H 9500 6200 50  0001 C CNN
	1    9500 6200
	1    0    0    -1  
$EndComp
$Comp
L power:GND #PWR0123
U 1 1 5E60A5BF
P 10100 6150
F 0 "#PWR0123" H 10100 5900 50  0001 C CNN
F 1 "GND" H 10105 5977 50  0000 C CNN
F 2 "" H 10100 6150 50  0001 C CNN
F 3 "" H 10100 6150 50  0001 C CNN
	1    10100 6150
	1    0    0    -1  
$EndComp
$Comp
L Device:Jumper JP5
U 1 1 5E6101DC
P 9500 5150
F 0 "JP5" V 9454 5277 50  0000 L CNN
F 1 "Jumper" V 9545 5277 50  0000 L CNN
F 2 "Connector_PinSocket_2.54mm:PinSocket_1x02_P2.54mm_Vertical" H 9500 5150 50  0001 C CNN
F 3 "~" H 9500 5150 50  0001 C CNN
	1    9500 5150
	0    1    1    0   
$EndComp
$Comp
L Jumper:SolderJumper_2_Bridged JP6
U 1 1 5E632DF0
P 10100 5250
F 0 "JP6" H 10100 5455 50  0000 C CNN
F 1 "SJ_Closed" H 10100 5364 50  0000 C CNN
F 2 "Jumper:SolderJumper-2_P1.3mm_Bridged_RoundedPad1.0x1.5mm" H 10100 5250 50  0001 C CNN
F 3 "~" H 10100 5250 50  0001 C CNN
	1    10100 5250
	0    1    1    0   
$EndComp
Text Label 10100 4900 0    50   ~ 0
LED_E
Wire Wire Line
	10100 5100 10100 4900
Text Notes 9600 4450 0    50   ~ 0
LED Indicators
Wire Notes Line
	8950 4200 8950 6500
$Comp
L power:+3V3 #PWR05
U 1 1 5EE0DAE0
P 10850 1200
F 0 "#PWR05" H 10850 1050 50  0001 C CNN
F 1 "+3V3" H 10865 1373 50  0000 C CNN
F 2 "" H 10850 1200 50  0001 C CNN
F 3 "" H 10850 1200 50  0001 C CNN
	1    10850 1200
	1    0    0    -1  
$EndComp
$Comp
L Device:R_Small R6
U 1 1 5EDA04A6
P 10850 1300
F 0 "R6" H 10791 1254 50  0000 R CNN
F 1 "10K" H 10791 1345 50  0000 R CNN
F 2 "Resistor_SMD:R_0603_1608Metric" H 10850 1300 50  0001 C CNN
F 3 "~" H 10850 1300 50  0001 C CNN
	1    10850 1300
	-1   0    0    1   
$EndComp
Wire Wire Line
	10850 1500 10850 1400
$Comp
L Device:R_Small R8
U 1 1 5E5979D3
P 10400 1300
F 0 "R8" H 10341 1254 50  0000 R CNN
F 1 "10K" H 10341 1345 50  0000 R CNN
F 2 "Resistor_SMD:R_0603_1608Metric" H 10400 1300 50  0001 C CNN
F 3 "~" H 10400 1300 50  0001 C CNN
	1    10400 1300
	-1   0    0    1   
$EndComp
Wire Wire Line
	10400 1400 10400 1500
$Comp
L power:+3V3 #PWR0124
U 1 1 5E59CB03
P 10400 1200
F 0 "#PWR0124" H 10400 1050 50  0001 C CNN
F 1 "+3V3" H 10415 1373 50  0000 C CNN
F 2 "" H 10400 1200 50  0001 C CNN
F 3 "" H 10400 1200 50  0001 C CNN
	1    10400 1200
	1    0    0    -1  
$EndComp
Wire Wire Line
	950  1550 950  1500
Wire Wire Line
	2600 3150 2700 3150
Wire Wire Line
	2700 3150 2700 3300
Connection ~ 2700 3300
Wire Wire Line
	2700 3300 3100 3300
Wire Wire Line
	3100 3350 3100 3300
Wire Wire Line
	3100 3300 3100 3250
Wire Wire Line
	3100 3600 3100 3550
Wire Wire Line
	5600 4600 5950 4600
Text Label 5600 4600 2    50   ~ 0
VDD_TCXO
Text Label 6850 2950 1    50   ~ 0
VDD_RF
Text Label 7050 2950 1    50   ~ 0
VDD_TCXO
Wire Wire Line
	7050 2950 7050 3100
Text Notes 3950 4100 0    50   ~ 0
MOSFET_Connection
NoConn ~ 5950 4500
Text Label 5600 4200 2    50   ~ 0
MOSFET
Wire Wire Line
	5950 4200 5600 4200
$Comp
L Transistor_FET:2N7002 Q3
U 1 1 5F8A7C77
P 4350 4900
F 0 "Q3" H 4554 4946 50  0000 L CNN
F 1 "2N7002" H 4554 4855 50  0000 L CNN
F 2 "Package_TO_SOT_SMD:SOT-23" H 4550 4825 50  0001 L CIN
F 3 "https://www.onsemi.com/pub/Collateral/NDS7002A-D.PDF" H 4350 4900 50  0001 L CNN
	1    4350 4900
	1    0    0    -1  
$EndComp
$Comp
L Device:R_Small R9
U 1 1 5F8AAF48
P 4000 4900
F 0 "R9" H 4059 4946 50  0000 L CNN
F 1 "150E" H 4059 4855 50  0000 L CNN
F 2 "Resistor_SMD:R_0603_1608Metric" H 4000 4900 50  0001 C CNN
F 3 "~" H 4000 4900 50  0001 C CNN
	1    4000 4900
	0    1    1    0   
$EndComp
Wire Wire Line
	4200 2150 4200 2100
Text Label 3750 4900 1    50   ~ 0
MOSFET
Wire Wire Line
	3750 4900 3900 4900
Wire Wire Line
	4100 4900 4150 4900
Wire Notes Line
	500  6100 4900 6100
Wire Notes Line
	4900 2500 4900 6100
Text Label 7500 1050 2    50   ~ 0
M_GND
Wire Wire Line
	7850 1050 7500 1050
Text Label 4450 4600 1    50   ~ 0
M_GND
$Comp
L power:GND #PWR0130
U 1 1 5FA18561
P 4450 5350
F 0 "#PWR0130" H 4450 5100 50  0001 C CNN
F 1 "GND" H 4455 5177 50  0000 C CNN
F 2 "" H 4450 5350 50  0001 C CNN
F 3 "" H 4450 5350 50  0001 C CNN
	1    4450 5350
	1    0    0    -1  
$EndComp
Wire Wire Line
	4450 4700 4450 4600
Wire Wire Line
	4450 5100 4450 5350
$EndSCHEMATC
