/home/shafeekpm/Music/stm_experiments/Bl-072z lrwan/TF-Luna/Software/Core/Src/stm32_lpm_if.c:80:6:PWR_EnterOffMode	0	static
/home/shafeekpm/Music/stm_experiments/Bl-072z lrwan/TF-Luna/Software/Core/Src/stm32_lpm_if.c:94:6:PWR_EnterStopMode	8	static,ignoring_inline_asm
/home/shafeekpm/Music/stm_experiments/Bl-072z lrwan/TF-Luna/Software/Core/Src/stm32_lpm_if.c:119:6:PWR_ExitStopMode	8	static,ignoring_inline_asm
/home/shafeekpm/Music/stm_experiments/Bl-072z lrwan/TF-Luna/Software/Core/Src/stm32_lpm_if.c:155:6:PWR_EnterSleepMode	8	static
/home/shafeekpm/Music/stm_experiments/Bl-072z lrwan/TF-Luna/Software/Core/Src/stm32_lpm_if.c:169:6:PWR_ExitSleepMode	0	static
/home/shafeekpm/Music/stm_experiments/Bl-072z lrwan/TF-Luna/Software/Core/Src/stm32_lpm_if.c:87:6:PWR_ExitOffMode	0	static
