/home/shafeekpm/Music/stm_experiments/Bl-072z lrwan/TF-Luna/Software/Core/Src/adc.c:30:6:MX_ADC_Init	8	static
/home/shafeekpm/Music/stm_experiments/Bl-072z lrwan/TF-Luna/Software/Core/Src/adc.c:74:6:HAL_ADC_MspInit	0	static
/home/shafeekpm/Music/stm_experiments/Bl-072z lrwan/TF-Luna/Software/Core/Src/adc.c:90:6:HAL_ADC_MspDeInit	0	static
