/home/zero/Projects/STM/Experiments/c1-dev_firmware_updation/LoRaWAN_End_Node/Core/Src/rtc.c:30:6:MX_RTC_Init	80	static
/home/zero/Projects/STM/Experiments/c1-dev_firmware_updation/LoRaWAN_End_Node/Core/Src/rtc.c:109:6:HAL_RTC_MspInit	64	static
/home/zero/Projects/STM/Experiments/c1-dev_firmware_updation/LoRaWAN_End_Node/Core/Src/rtc.c:142:6:HAL_RTC_MspDeInit	8	static
