/home/zero/Projects/STM/Experiments/c1-dev_firmware_updation/LoRaWAN_End_Node/Core/Src/map_api.c:15:9:map_int32	24	static
/home/zero/Projects/STM/Experiments/c1-dev_firmware_updation/LoRaWAN_End_Node/Core/Src/map_api.c:40:10:map_uint32	16	static
/home/zero/Projects/STM/Experiments/c1-dev_firmware_updation/LoRaWAN_End_Node/Core/Src/map_api.c:53:7:map_float	32	static
/home/zero/Projects/STM/Experiments/c1-dev_firmware_updation/LoRaWAN_End_Node/Core/Src/map_api.c:64:8:map_double	40	static
