/home/zero/Projects/STM/Experiments/c1-dev_firmware_updation/LoRaWAN_End_Node/Middlewares/Third_Party/LoRaWAN/Mac/Region/RegionBaseUS.c:75:17:RegionBaseUSComputeNext125kHzJoinChannel	40	static
/home/zero/Projects/STM/Experiments/c1-dev_firmware_updation/LoRaWAN_End_Node/Middlewares/Third_Party/LoRaWAN/Mac/Region/RegionBaseUS.c:137:6:RegionBaseUSVerifyFrequencyGroup	16	static
/home/zero/Projects/STM/Experiments/c1-dev_firmware_updation/LoRaWAN_End_Node/Middlewares/Third_Party/LoRaWAN/Mac/Region/RegionBaseUS.c:148:10:RegionBaseUSCalcDownlinkFrequency	0	static
