/home/shafeekpm/Videos/GITLAB_PROJECTS/C-1_dev_LoRaWAN_air_quality_monitoring_system_v1.0/Software/Air_Quality_Node/Core/Src/adc_if.c:105:6:SYS_InitMeasurement	0	static
/home/shafeekpm/Videos/GITLAB_PROJECTS/C-1_dev_LoRaWAN_air_quality_monitoring_system_v1.0/Software/Air_Quality_Node/Core/Src/adc_if.c:116:6:SYS_DeInitMeasurement	0	static
/home/shafeekpm/Videos/GITLAB_PROJECTS/C-1_dev_LoRaWAN_air_quality_monitoring_system_v1.0/Software/Air_Quality_Node/Core/Src/adc_if.c:174:11:ADC_ReadChannels	24	static
/home/shafeekpm/Videos/GITLAB_PROJECTS/C-1_dev_LoRaWAN_air_quality_monitoring_system_v1.0/Software/Air_Quality_Node/Core/Src/adc_if.c:144:10:SYS_GetBatteryLevel	8	static
/home/shafeekpm/Videos/GITLAB_PROJECTS/C-1_dev_LoRaWAN_air_quality_monitoring_system_v1.0/Software/Air_Quality_Node/Core/Src/adc_if.c:123:9:SYS_GetTemperatureLevel	24	static
