/home/shafeekpm/Videos/GITLAB_PROJECTS/C-1_dev_LoRaWAN_air_quality_monitoring_system_v1.0/Software/Air_Quality_Node/Middlewares/Third_Party/LoRaWAN/Crypto/lorawan_aes.c:349:13:xor_block	0	static
/home/shafeekpm/Videos/GITLAB_PROJECTS/C-1_dev_LoRaWAN_air_quality_monitoring_system_v1.0/Software/Air_Quality_Node/Middlewares/Third_Party/LoRaWAN/Crypto/lorawan_aes.c:376:13:copy_and_key	8	static
/home/shafeekpm/Videos/GITLAB_PROJECTS/C-1_dev_LoRaWAN_air_quality_monitoring_system_v1.0/Software/Air_Quality_Node/Middlewares/Third_Party/LoRaWAN/Crypto/lorawan_aes.c:513:13:lorawan_aes_set_key	48	static
/home/shafeekpm/Videos/GITLAB_PROJECTS/C-1_dev_LoRaWAN_air_quality_monitoring_system_v1.0/Software/Air_Quality_Node/Middlewares/Third_Party/LoRaWAN/Crypto/lorawan_aes.c:568:13:lorawan_aes_encrypt	120	static
/home/shafeekpm/Videos/GITLAB_PROJECTS/C-1_dev_LoRaWAN_air_quality_monitoring_system_v1.0/Software/Air_Quality_Node/Middlewares/Third_Party/LoRaWAN/Crypto/lorawan_aes.c:597:13:lorawan_aes_cbc_encrypt	24	static
