/home/shafeekpm/Videos/GITLAB_PROJECTS/C-1_dev_LoRaWAN_air_quality_monitoring_system_v1.0/Software/Air_Quality_Node/Core/Src/stm32l0xx_it.c:73:6:NMI_Handler	0	static
/home/shafeekpm/Videos/GITLAB_PROJECTS/C-1_dev_LoRaWAN_air_quality_monitoring_system_v1.0/Software/Air_Quality_Node/Core/Src/stm32l0xx_it.c:88:6:HardFault_Handler	0	static
/home/shafeekpm/Videos/GITLAB_PROJECTS/C-1_dev_LoRaWAN_air_quality_monitoring_system_v1.0/Software/Air_Quality_Node/Core/Src/stm32l0xx_it.c:103:6:MemManage_Handler	0	static
/home/shafeekpm/Videos/GITLAB_PROJECTS/C-1_dev_LoRaWAN_air_quality_monitoring_system_v1.0/Software/Air_Quality_Node/Core/Src/stm32l0xx_it.c:118:6:BusFault_Handler	0	static
/home/shafeekpm/Videos/GITLAB_PROJECTS/C-1_dev_LoRaWAN_air_quality_monitoring_system_v1.0/Software/Air_Quality_Node/Core/Src/stm32l0xx_it.c:133:6:UsageFault_Handler	0	static
/home/shafeekpm/Videos/GITLAB_PROJECTS/C-1_dev_LoRaWAN_air_quality_monitoring_system_v1.0/Software/Air_Quality_Node/Core/Src/stm32l0xx_it.c:148:6:SVC_Handler	0	static
/home/shafeekpm/Videos/GITLAB_PROJECTS/C-1_dev_LoRaWAN_air_quality_monitoring_system_v1.0/Software/Air_Quality_Node/Core/Src/stm32l0xx_it.c:161:6:DebugMon_Handler	0	static
/home/shafeekpm/Videos/GITLAB_PROJECTS/C-1_dev_LoRaWAN_air_quality_monitoring_system_v1.0/Software/Air_Quality_Node/Core/Src/stm32l0xx_it.c:174:6:PendSV_Handler	0	static
/home/shafeekpm/Videos/GITLAB_PROJECTS/C-1_dev_LoRaWAN_air_quality_monitoring_system_v1.0/Software/Air_Quality_Node/Core/Src/stm32l0xx_it.c:187:6:SysTick_Handler	8	static
/home/shafeekpm/Videos/GITLAB_PROJECTS/C-1_dev_LoRaWAN_air_quality_monitoring_system_v1.0/Software/Air_Quality_Node/Core/Src/stm32l0xx_it.c:214:6:EXTI0_1_IRQHandler	8	static
/home/shafeekpm/Videos/GITLAB_PROJECTS/C-1_dev_LoRaWAN_air_quality_monitoring_system_v1.0/Software/Air_Quality_Node/Core/Src/stm32l0xx_it.c:222:6:EXTI2_3_IRQHandler	8	static
/home/shafeekpm/Videos/GITLAB_PROJECTS/C-1_dev_LoRaWAN_air_quality_monitoring_system_v1.0/Software/Air_Quality_Node/Core/Src/stm32l0xx_it.c:232:6:EXTI4_15_IRQHandler	8	static
/home/shafeekpm/Videos/GITLAB_PROJECTS/C-1_dev_LoRaWAN_air_quality_monitoring_system_v1.0/Software/Air_Quality_Node/Core/Src/stm32l0xx_it.c:251:6:DMA1_Channel4_5_6_7_IRQHandler	8	static
/home/shafeekpm/Videos/GITLAB_PROJECTS/C-1_dev_LoRaWAN_air_quality_monitoring_system_v1.0/Software/Air_Quality_Node/Core/Src/stm32l0xx_it.c:265:6:USART2_IRQHandler	8	static
/home/shafeekpm/Videos/GITLAB_PROJECTS/C-1_dev_LoRaWAN_air_quality_monitoring_system_v1.0/Software/Air_Quality_Node/Core/Src/stm32l0xx_it.c:276:6:RTC_IRQHandler	8	static
