/home/shafeekpm/Videos/GITLAB_PROJECTS/C-1_dev_LoRaWAN_air_quality_monitoring_system_v1.0/Software/Air_Quality_Node/Middlewares/Third_Party/LoRaWAN/LmHandler/NvmDataMgmt.c:52:6:NvmDataMgmtEvent	0	static
/home/shafeekpm/Videos/GITLAB_PROJECTS/C-1_dev_LoRaWAN_air_quality_monitoring_system_v1.0/Software/Air_Quality_Node/Middlewares/Third_Party/LoRaWAN/LmHandler/NvmDataMgmt.c:59:10:NvmDataMgmtStore	0	static
/home/shafeekpm/Videos/GITLAB_PROJECTS/C-1_dev_LoRaWAN_air_quality_monitoring_system_v1.0/Software/Air_Quality_Node/Middlewares/Third_Party/LoRaWAN/LmHandler/NvmDataMgmt.c:154:10:NvmDataMgmtRestore	0	static
/home/shafeekpm/Videos/GITLAB_PROJECTS/C-1_dev_LoRaWAN_air_quality_monitoring_system_v1.0/Software/Air_Quality_Node/Middlewares/Third_Party/LoRaWAN/LmHandler/NvmDataMgmt.c:221:6:NvmDataMgmtFactoryReset	0	static
