/home/shafeekpm/Videos/sep_1_Rainguage_with_UV_Try_1/LoRaWAN_End_Node/Middlewares/Third_Party/LoRaWAN/Crypto/lorawan_aes.c:349:13:xor_block	0	static
/home/shafeekpm/Videos/sep_1_Rainguage_with_UV_Try_1/LoRaWAN_End_Node/Middlewares/Third_Party/LoRaWAN/Crypto/lorawan_aes.c:376:13:copy_and_key	8	static
/home/shafeekpm/Videos/sep_1_Rainguage_with_UV_Try_1/LoRaWAN_End_Node/Middlewares/Third_Party/LoRaWAN/Crypto/lorawan_aes.c:513:13:lorawan_aes_set_key	48	static
/home/shafeekpm/Videos/sep_1_Rainguage_with_UV_Try_1/LoRaWAN_End_Node/Middlewares/Third_Party/LoRaWAN/Crypto/lorawan_aes.c:568:13:lorawan_aes_encrypt	120	static
/home/shafeekpm/Videos/sep_1_Rainguage_with_UV_Try_1/LoRaWAN_End_Node/Middlewares/Third_Party/LoRaWAN/Crypto/lorawan_aes.c:597:13:lorawan_aes_cbc_encrypt	24	static
