/home/shafeekpm/Videos/sep_1_Rainguage_with_UV_Try_1/LoRaWAN_End_Node/Middlewares/Third_Party/LoRaWAN/Utilities/utilities.c:53:6:srand1	0	static
/home/shafeekpm/Videos/sep_1_Rainguage_with_UV_Try_1/LoRaWAN_End_Node/Middlewares/Third_Party/LoRaWAN/Utilities/utilities.c:59:9:randr	16	static
/home/shafeekpm/Videos/sep_1_Rainguage_with_UV_Try_1/LoRaWAN_End_Node/Middlewares/Third_Party/LoRaWAN/Utilities/utilities.c:64:6:memcpy1	8	static
/home/shafeekpm/Videos/sep_1_Rainguage_with_UV_Try_1/LoRaWAN_End_Node/Middlewares/Third_Party/LoRaWAN/Utilities/utilities.c:72:6:memcpyr	12	static
/home/shafeekpm/Videos/sep_1_Rainguage_with_UV_Try_1/LoRaWAN_End_Node/Middlewares/Third_Party/LoRaWAN/Utilities/utilities.c:81:6:memset1	8	static
/home/shafeekpm/Videos/sep_1_Rainguage_with_UV_Try_1/LoRaWAN_End_Node/Middlewares/Third_Party/LoRaWAN/Utilities/utilities.c:89:8:Nibble2HexChar	0	static
/home/shafeekpm/Videos/sep_1_Rainguage_with_UV_Try_1/LoRaWAN_End_Node/Middlewares/Third_Party/LoRaWAN/Utilities/utilities.c:105:10:Crc32	20	static
/home/shafeekpm/Videos/sep_1_Rainguage_with_UV_Try_1/LoRaWAN_End_Node/Middlewares/Third_Party/LoRaWAN/Utilities/utilities.c:130:10:Crc32Init	0	static
/home/shafeekpm/Videos/sep_1_Rainguage_with_UV_Try_1/LoRaWAN_End_Node/Middlewares/Third_Party/LoRaWAN/Utilities/utilities.c:135:10:Crc32Update	20	static
/home/shafeekpm/Videos/sep_1_Rainguage_with_UV_Try_1/LoRaWAN_End_Node/Middlewares/Third_Party/LoRaWAN/Utilities/utilities.c:159:10:Crc32Finalize	0	static
