(export (version "E")
  (design
    (source "/home/icfoss/KICAD/Air quality New.kicad_sch")
    (date "Wed Mar 22 10:07:06 2023")
    (tool "Eeschema 6.0.11-2627ca5db0~126~ubuntu20.04.1")
    (sheet (number "1") (name "/") (tstamps "/")
      (title_block
        (title)
        (company)
        (rev)
        (date)
        (source "Air quality New.kicad_sch")
        (comment (number "1") (value ""))
        (comment (number "2") (value ""))
        (comment (number "3") (value ""))
        (comment (number "4") (value ""))
        (comment (number "5") (value ""))
        (comment (number "6") (value ""))
        (comment (number "7") (value ""))
        (comment (number "8") (value ""))
        (comment (number "9") (value "")))))
  (components
    (comp (ref "J1")
      (value "POWER")
      (footprint "Connector_PinHeader_2.54mm:PinHeader_1x08_P2.54mm_Vertical")
      (libsource (lib "Connector") (part "Conn_01x08_Male") (description "Generic connector, single row, 01x08, script generated (kicad-library-utils/schlib/autogen/connector/)"))
      (property (name "Sheetname") (value ""))
      (property (name "Sheetfile") (value "Air quality New.kicad_sch"))
      (sheetpath (names "/") (tstamps "/"))
      (tstamps "e25802d2-4034-426e-bf98-dd74160dde93"))
    (comp (ref "J2")
      (value "ANALOG IN")
      (footprint "Connector_PinHeader_2.54mm:PinHeader_1x08_P2.54mm_Vertical")
      (libsource (lib "Connector") (part "Conn_01x08_Male") (description "Generic connector, single row, 01x08, script generated (kicad-library-utils/schlib/autogen/connector/)"))
      (property (name "Sheetname") (value ""))
      (property (name "Sheetfile") (value "Air quality New.kicad_sch"))
      (sheetpath (names "/") (tstamps "/"))
      (tstamps "1ddd5d59-7a16-47a9-a4d4-be8daa179c0e"))
    (comp (ref "J3")
      (value "ANALG IN")
      (footprint "Connector_PinHeader_2.54mm:PinHeader_1x08_P2.54mm_Vertical")
      (libsource (lib "Connector") (part "Conn_01x08_Male") (description "Generic connector, single row, 01x08, script generated (kicad-library-utils/schlib/autogen/connector/)"))
      (property (name "Sheetname") (value ""))
      (property (name "Sheetfile") (value "Air quality New.kicad_sch"))
      (sheetpath (names "/") (tstamps "/"))
      (tstamps "90a34581-5e05-4def-8a10-32fb5cf4e3bd"))
    (comp (ref "J4")
      (value "Conn_01x10_Male")
      (footprint "Connector_PinHeader_2.54mm:PinHeader_1x10_P2.54mm_Vertical")
      (libsource (lib "Connector") (part "Conn_01x10_Male") (description "Generic connector, single row, 01x10, script generated (kicad-library-utils/schlib/autogen/connector/)"))
      (property (name "Sheetname") (value ""))
      (property (name "Sheetfile") (value "Air quality New.kicad_sch"))
      (sheetpath (names "/") (tstamps "/"))
      (tstamps "6610d4c9-2028-433a-8ff0-2477aa153136"))
    (comp (ref "J5")
      (value "PWM pins")
      (footprint "Connector_PinHeader_2.54mm:PinHeader_1x08_P2.54mm_Vertical")
      (libsource (lib "Connector") (part "Conn_01x08_Male") (description "Generic connector, single row, 01x08, script generated (kicad-library-utils/schlib/autogen/connector/)"))
      (property (name "Sheetname") (value ""))
      (property (name "Sheetfile") (value "Air quality New.kicad_sch"))
      (sheetpath (names "/") (tstamps "/"))
      (tstamps "7b83d9e6-b85f-4570-895a-a6de634e0be3"))
    (comp (ref "J6")
      (value "COMMUNICATION")
      (footprint "Connector_PinHeader_2.54mm:PinHeader_1x08_P2.54mm_Vertical")
      (libsource (lib "Connector") (part "Conn_01x08_Male") (description "Generic connector, single row, 01x08, script generated (kicad-library-utils/schlib/autogen/connector/)"))
      (property (name "Sheetname") (value ""))
      (property (name "Sheetfile") (value "Air quality New.kicad_sch"))
      (sheetpath (names "/") (tstamps "/"))
      (tstamps "160a0da0-30aa-4fec-bb0c-64e95b22e60a"))
    (comp (ref "J7")
      (value "DIGITAL")
      (footprint "Connector_PinHeader_2.54mm:PinHeader_2x18_P2.54mm_Vertical")
      (libsource (lib "Connector_Generic") (part "Conn_02x18_Top_Bottom") (description "Generic connector, double row, 02x18, top/bottom pin numbering scheme (row 1: 1...pins_per_row, row2: pins_per_row+1 ... num_pins), script generated (kicad-library-utils/schlib/autogen/connector/)"))
      (property (name "Sheetname") (value ""))
      (property (name "Sheetfile") (value "Air quality New.kicad_sch"))
      (sheetpath (names "/") (tstamps "/"))
      (tstamps "a3c5a8ce-c83a-49e8-962d-567abb1a894b"))
    (comp (ref "J8")
      (value "PMS 7003")
      (footprint "Connector_JST:JST_GH_BM08B-GHS-TBT_1x08-1MP_P1.25mm_Vertical")
      (libsource (lib "Connector") (part "Conn_01x08_Male") (description "Generic connector, single row, 01x08, script generated (kicad-library-utils/schlib/autogen/connector/)"))
      (property (name "Sheetname") (value ""))
      (property (name "Sheetfile") (value "Air quality New.kicad_sch"))
      (sheetpath (names "/") (tstamps "/"))
      (tstamps "d6b3cccb-6379-454d-acab-585be216fccd"))
    (comp (ref "J9")
      (value "BME 280")
      (footprint "Connector_PinSocket_2.54mm:PinSocket_1x06_P2.54mm_Vertical")
      (libsource (lib "Connector") (part "Conn_01x06_Male") (description "Generic connector, single row, 01x06, script generated (kicad-library-utils/schlib/autogen/connector/)"))
      (property (name "Sheetname") (value ""))
      (property (name "Sheetfile") (value "Air quality New.kicad_sch"))
      (sheetpath (names "/") (tstamps "/"))
      (tstamps "1a611c88-74c3-48b0-973f-5d4d4a57ce49"))
    (comp (ref "J10")
      (value "MQ 135")
      (footprint "Connector_PinHeader_2.00mm:PinHeader_1x04_P2.00mm_Vertical")
      (libsource (lib "Connector") (part "Conn_01x04_Male") (description "Generic connector, single row, 01x04, script generated (kicad-library-utils/schlib/autogen/connector/)"))
      (property (name "Sheetname") (value ""))
      (property (name "Sheetfile") (value "Air quality New.kicad_sch"))
      (sheetpath (names "/") (tstamps "/"))
      (tstamps "1c296b68-9ed3-4a95-8a1a-ae9b9f10a3b2"))
    (comp (ref "J11")
      (value "Conn_01x08_Male")
      (footprint "Connector_PinHeader_2.00mm:PinHeader_1x08_P2.00mm_Vertical")
      (libsource (lib "Connector") (part "Conn_01x08_Male") (description "Generic connector, single row, 01x08, script generated (kicad-library-utils/schlib/autogen/connector/)"))
      (property (name "Sheetname") (value ""))
      (property (name "Sheetfile") (value "Air quality New.kicad_sch"))
      (sheetpath (names "/") (tstamps "/"))
      (tstamps "9fe25d14-1856-4ab6-8f55-16b6a75efebf"))
    (comp (ref "J12")
      (value "Conn_01x08_Male")
      (footprint "Connector_PinHeader_2.00mm:PinHeader_1x08_P2.00mm_Vertical")
      (libsource (lib "Connector") (part "Conn_01x08_Male") (description "Generic connector, single row, 01x08, script generated (kicad-library-utils/schlib/autogen/connector/)"))
      (property (name "Sheetname") (value ""))
      (property (name "Sheetfile") (value "Air quality New.kicad_sch"))
      (sheetpath (names "/") (tstamps "/"))
      (tstamps "6b35c5b5-46ef-477b-b1d6-407739c28a38"))
    (comp (ref "R10K1")
      (value "R1")
      (footprint "Resistor_SMD:R_0805_2012Metric_Pad1.20x1.40mm_HandSolder")
      (libsource (lib "Device") (part "R") (description "Resistor"))
      (property (name "Sheetname") (value ""))
      (property (name "Sheetfile") (value "Air quality New.kicad_sch"))
      (sheetpath (names "/") (tstamps "/"))
      (tstamps "10841f84-a50b-4d48-946d-d737e2ab8e2f")))
  (libparts
    (libpart (lib "Connector") (part "Conn_01x04_Male")
      (description "Generic connector, single row, 01x04, script generated (kicad-library-utils/schlib/autogen/connector/)")
      (docs "~")
      (footprints
        (fp "Connector*:*_1x??_*"))
      (fields
        (field (name "Reference") "J")
        (field (name "Value") "Conn_01x04_Male")
        (field (name "Datasheet") "~"))
      (pins
        (pin (num "1") (name "Pin_1") (type "passive"))
        (pin (num "2") (name "Pin_2") (type "passive"))
        (pin (num "3") (name "Pin_3") (type "passive"))
        (pin (num "4") (name "Pin_4") (type "passive"))))
    (libpart (lib "Connector") (part "Conn_01x06_Male")
      (description "Generic connector, single row, 01x06, script generated (kicad-library-utils/schlib/autogen/connector/)")
      (docs "~")
      (footprints
        (fp "Connector*:*_1x??_*"))
      (fields
        (field (name "Reference") "J")
        (field (name "Value") "Conn_01x06_Male")
        (field (name "Datasheet") "~"))
      (pins
        (pin (num "1") (name "Pin_1") (type "passive"))
        (pin (num "2") (name "Pin_2") (type "passive"))
        (pin (num "3") (name "Pin_3") (type "passive"))
        (pin (num "4") (name "Pin_4") (type "passive"))
        (pin (num "5") (name "Pin_5") (type "passive"))
        (pin (num "6") (name "Pin_6") (type "passive"))))
    (libpart (lib "Connector") (part "Conn_01x08_Male")
      (description "Generic connector, single row, 01x08, script generated (kicad-library-utils/schlib/autogen/connector/)")
      (docs "~")
      (footprints
        (fp "Connector*:*_1x??_*"))
      (fields
        (field (name "Reference") "J")
        (field (name "Value") "Conn_01x08_Male")
        (field (name "Datasheet") "~"))
      (pins
        (pin (num "1") (name "Pin_1") (type "passive"))
        (pin (num "2") (name "Pin_2") (type "passive"))
        (pin (num "3") (name "Pin_3") (type "passive"))
        (pin (num "4") (name "Pin_4") (type "passive"))
        (pin (num "5") (name "Pin_5") (type "passive"))
        (pin (num "6") (name "Pin_6") (type "passive"))
        (pin (num "7") (name "Pin_7") (type "passive"))
        (pin (num "8") (name "Pin_8") (type "passive"))))
    (libpart (lib "Connector") (part "Conn_01x10_Male")
      (description "Generic connector, single row, 01x10, script generated (kicad-library-utils/schlib/autogen/connector/)")
      (docs "~")
      (footprints
        (fp "Connector*:*_1x??_*"))
      (fields
        (field (name "Reference") "J")
        (field (name "Value") "Conn_01x10_Male")
        (field (name "Datasheet") "~"))
      (pins
        (pin (num "1") (name "Pin_1") (type "passive"))
        (pin (num "2") (name "Pin_2") (type "passive"))
        (pin (num "3") (name "Pin_3") (type "passive"))
        (pin (num "4") (name "Pin_4") (type "passive"))
        (pin (num "5") (name "Pin_5") (type "passive"))
        (pin (num "6") (name "Pin_6") (type "passive"))
        (pin (num "7") (name "Pin_7") (type "passive"))
        (pin (num "8") (name "Pin_8") (type "passive"))
        (pin (num "9") (name "Pin_9") (type "passive"))
        (pin (num "10") (name "Pin_10") (type "passive"))))
    (libpart (lib "Connector_Generic") (part "Conn_02x18_Top_Bottom")
      (description "Generic connector, double row, 02x18, top/bottom pin numbering scheme (row 1: 1...pins_per_row, row2: pins_per_row+1 ... num_pins), script generated (kicad-library-utils/schlib/autogen/connector/)")
      (docs "~")
      (footprints
        (fp "Connector*:*_2x??_*"))
      (fields
        (field (name "Reference") "J7")
        (field (name "Value") "DIGITAL")
        (field (name "Footprint") "Connector_PinHeader_2.54mm:PinHeader_2x18_P2.54mm_Vertical")
        (field (name "Datasheet") "~"))
      (pins
        (pin (num "1") (name "Pin_1") (type "passive"))
        (pin (num "2") (name "Pin_19") (type "passive"))
        (pin (num "3") (name "Pin_2") (type "passive"))
        (pin (num "4") (name "Pin_20") (type "passive"))
        (pin (num "5") (name "Pin_3") (type "passive"))
        (pin (num "6") (name "Pin_21") (type "passive"))
        (pin (num "7") (name "Pin_4") (type "passive"))
        (pin (num "8") (name "Pin_22") (type "passive"))
        (pin (num "9") (name "Pin_5") (type "passive"))
        (pin (num "10") (name "Pin_23") (type "passive"))
        (pin (num "11") (name "Pin_6") (type "passive"))
        (pin (num "12") (name "Pin_24") (type "passive"))
        (pin (num "13") (name "Pin_7") (type "passive"))
        (pin (num "14") (name "Pin_25") (type "passive"))
        (pin (num "15") (name "Pin_8") (type "passive"))
        (pin (num "16") (name "Pin_26") (type "passive"))
        (pin (num "17") (name "Pin_9") (type "passive"))
        (pin (num "18") (name "Pin_27") (type "passive"))
        (pin (num "19") (name "Pin_10") (type "passive"))
        (pin (num "20") (name "Pin_28") (type "passive"))
        (pin (num "21") (name "Pin_11") (type "passive"))
        (pin (num "22") (name "Pin_29") (type "passive"))
        (pin (num "23") (name "Pin_12") (type "passive"))
        (pin (num "24") (name "Pin_30") (type "passive"))
        (pin (num "25") (name "Pin_13") (type "passive"))
        (pin (num "26") (name "Pin_31") (type "passive"))
        (pin (num "27") (name "Pin_14") (type "passive"))
        (pin (num "28") (name "Pin_32") (type "passive"))
        (pin (num "29") (name "Pin_15") (type "passive"))
        (pin (num "30") (name "Pin_33") (type "passive"))
        (pin (num "31") (name "Pin_16") (type "passive"))
        (pin (num "32") (name "Pin_34") (type "passive"))
        (pin (num "33") (name "Pin_17") (type "passive"))
        (pin (num "34") (name "Pin_35") (type "passive"))
        (pin (num "35") (name "Pin_18") (type "passive"))
        (pin (num "36") (name "Pin_36") (type "passive"))))
    (libpart (lib "Device") (part "R")
      (description "Resistor")
      (docs "~")
      (footprints
        (fp "R_*"))
      (fields
        (field (name "Reference") "R")
        (field (name "Value") "R")
        (field (name "Datasheet") "~"))
      (pins
        (pin (num "1") (name "") (type "passive"))
        (pin (num "2") (name "") (type "passive")))))
  (libraries
    (library (logical "Connector")
      (uri "/usr/share/kicad/symbols//Connector.kicad_sym"))
    (library (logical "Connector_Generic")
      (uri "/usr/share/kicad/symbols//Connector_Generic.kicad_sym"))
    (library (logical "Device")
      (uri "/usr/share/kicad/symbols//Device.kicad_sym")))
  (nets
    (net (code "1") (name "2")
      (node (ref "J11") (pin "3") (pinfunction "Pin_3") (pintype "passive"))
      (node (ref "J5") (pin "6") (pinfunction "Pin_6") (pintype "passive")))
    (net (code "2") (name "3")
      (node (ref "J11") (pin "2") (pinfunction "Pin_2") (pintype "passive"))
      (node (ref "J5") (pin "5") (pinfunction "Pin_5") (pintype "passive")))
    (net (code "3") (name "3.3V")
      (node (ref "J1") (pin "4") (pinfunction "Pin_4") (pintype "passive"))
      (node (ref "J11") (pin "4") (pinfunction "Pin_4") (pintype "passive")))
    (net (code "4") (name "4")
      (node (ref "J11") (pin "1") (pinfunction "Pin_1") (pintype "passive"))
      (node (ref "J5") (pin "4") (pinfunction "Pin_4") (pintype "passive")))
    (net (code "5") (name "5")
      (node (ref "J12") (pin "6") (pinfunction "Pin_6") (pintype "passive"))
      (node (ref "J5") (pin "3") (pinfunction "Pin_3") (pintype "passive")))
    (net (code "6") (name "5V")
      (node (ref "J1") (pin "2") (pinfunction "Pin_2") (pintype "passive"))
      (node (ref "J1") (pin "5") (pinfunction "Pin_5") (pintype "passive"))
      (node (ref "J10") (pin "3") (pinfunction "Pin_3") (pintype "passive"))
      (node (ref "J7") (pin "1") (pinfunction "Pin_1") (pintype "passive"))
      (node (ref "J7") (pin "2") (pinfunction "Pin_19") (pintype "passive"))
      (node (ref "J8") (pin "1") (pinfunction "Pin_1") (pintype "passive"))
      (node (ref "J9") (pin "1") (pinfunction "Pin_1") (pintype "passive")))
    (net (code "7") (name "6")
      (node (ref "J5") (pin "2") (pinfunction "Pin_2") (pintype "passive"))
      (node (ref "R10K1") (pin "2") (pintype "passive")))
    (net (code "8") (name "7")
      (node (ref "J5") (pin "1") (pinfunction "Pin_1") (pintype "passive")))
    (net (code "9") (name "8")
      (node (ref "J4") (pin "10") (pinfunction "Pin_10") (pintype "passive")))
    (net (code "10") (name "9")
      (node (ref "J4") (pin "9") (pinfunction "Pin_9") (pintype "passive")))
    (net (code "11") (name "10")
      (node (ref "J4") (pin "8") (pinfunction "Pin_8") (pintype "passive")))
    (net (code "12") (name "11")
      (node (ref "J4") (pin "7") (pinfunction "Pin_7") (pintype "passive")))
    (net (code "13") (name "12")
      (node (ref "J4") (pin "6") (pinfunction "Pin_6") (pintype "passive")))
    (net (code "14") (name "13")
      (node (ref "J4") (pin "5") (pinfunction "Pin_5") (pintype "passive")))
    (net (code "15") (name "22")
      (node (ref "J7") (pin "3") (pinfunction "Pin_2") (pintype "passive")))
    (net (code "16") (name "23")
      (node (ref "J7") (pin "4") (pinfunction "Pin_20") (pintype "passive")))
    (net (code "17") (name "24")
      (node (ref "J7") (pin "5") (pinfunction "Pin_3") (pintype "passive")))
    (net (code "18") (name "25")
      (node (ref "J7") (pin "6") (pinfunction "Pin_21") (pintype "passive")))
    (net (code "19") (name "26")
      (node (ref "J7") (pin "7") (pinfunction "Pin_4") (pintype "passive")))
    (net (code "20") (name "27")
      (node (ref "J7") (pin "8") (pinfunction "Pin_22") (pintype "passive")))
    (net (code "21") (name "28")
      (node (ref "J7") (pin "9") (pinfunction "Pin_5") (pintype "passive")))
    (net (code "22") (name "29")
      (node (ref "J7") (pin "10") (pinfunction "Pin_23") (pintype "passive")))
    (net (code "23") (name "30")
      (node (ref "J7") (pin "11") (pinfunction "Pin_6") (pintype "passive")))
    (net (code "24") (name "31")
      (node (ref "J7") (pin "12") (pinfunction "Pin_24") (pintype "passive")))
    (net (code "25") (name "32")
      (node (ref "J7") (pin "13") (pinfunction "Pin_7") (pintype "passive")))
    (net (code "26") (name "33")
      (node (ref "J7") (pin "14") (pinfunction "Pin_25") (pintype "passive")))
    (net (code "27") (name "34")
      (node (ref "J7") (pin "15") (pinfunction "Pin_8") (pintype "passive")))
    (net (code "28") (name "35")
      (node (ref "J7") (pin "16") (pinfunction "Pin_26") (pintype "passive")))
    (net (code "29") (name "36")
      (node (ref "J7") (pin "17") (pinfunction "Pin_9") (pintype "passive")))
    (net (code "30") (name "37")
      (node (ref "J7") (pin "18") (pinfunction "Pin_27") (pintype "passive")))
    (net (code "31") (name "38")
      (node (ref "J7") (pin "19") (pinfunction "Pin_10") (pintype "passive")))
    (net (code "32") (name "39")
      (node (ref "J7") (pin "20") (pinfunction "Pin_28") (pintype "passive")))
    (net (code "33") (name "40")
      (node (ref "J7") (pin "21") (pinfunction "Pin_11") (pintype "passive")))
    (net (code "34") (name "41")
      (node (ref "J7") (pin "22") (pinfunction "Pin_29") (pintype "passive")))
    (net (code "35") (name "42")
      (node (ref "J7") (pin "23") (pinfunction "Pin_12") (pintype "passive")))
    (net (code "36") (name "43")
      (node (ref "J7") (pin "24") (pinfunction "Pin_30") (pintype "passive")))
    (net (code "37") (name "44")
      (node (ref "J7") (pin "25") (pinfunction "Pin_13") (pintype "passive")))
    (net (code "38") (name "45")
      (node (ref "J7") (pin "26") (pinfunction "Pin_31") (pintype "passive")))
    (net (code "39") (name "46")
      (node (ref "J7") (pin "27") (pinfunction "Pin_14") (pintype "passive")))
    (net (code "40") (name "47")
      (node (ref "J7") (pin "28") (pinfunction "Pin_32") (pintype "passive")))
    (net (code "41") (name "48")
      (node (ref "J7") (pin "29") (pinfunction "Pin_15") (pintype "passive")))
    (net (code "42") (name "49")
      (node (ref "J7") (pin "30") (pinfunction "Pin_33") (pintype "passive")))
    (net (code "43") (name "50")
      (node (ref "J12") (pin "2") (pinfunction "Pin_2") (pintype "passive"))
      (node (ref "J7") (pin "31") (pinfunction "Pin_16") (pintype "passive")))
    (net (code "44") (name "51")
      (node (ref "J12") (pin "3") (pinfunction "Pin_3") (pintype "passive"))
      (node (ref "J7") (pin "32") (pinfunction "Pin_34") (pintype "passive")))
    (net (code "45") (name "52")
      (node (ref "J12") (pin "4") (pinfunction "Pin_4") (pintype "passive"))
      (node (ref "J7") (pin "33") (pinfunction "Pin_17") (pintype "passive")))
    (net (code "46") (name "53")
      (node (ref "J7") (pin "34") (pinfunction "Pin_35") (pintype "passive")))
    (net (code "47") (name "A0")
      (node (ref "J10") (pin "1") (pinfunction "Pin_1") (pintype "passive"))
      (node (ref "J2") (pin "1") (pinfunction "Pin_1") (pintype "passive")))
    (net (code "48") (name "A1")
      (node (ref "J2") (pin "2") (pinfunction "Pin_2") (pintype "passive")))
    (net (code "49") (name "A2")
      (node (ref "J2") (pin "3") (pinfunction "Pin_3") (pintype "passive")))
    (net (code "50") (name "A3")
      (node (ref "J2") (pin "4") (pinfunction "Pin_4") (pintype "passive")))
    (net (code "51") (name "A4")
      (node (ref "J2") (pin "5") (pinfunction "Pin_5") (pintype "passive")))
    (net (code "52") (name "A5")
      (node (ref "J2") (pin "6") (pinfunction "Pin_6") (pintype "passive")))
    (net (code "53") (name "A6")
      (node (ref "J2") (pin "7") (pinfunction "Pin_7") (pintype "passive")))
    (net (code "54") (name "A7")
      (node (ref "J2") (pin "8") (pinfunction "Pin_8") (pintype "passive")))
    (net (code "55") (name "A8")
      (node (ref "J3") (pin "1") (pinfunction "Pin_1") (pintype "passive")))
    (net (code "56") (name "A9")
      (node (ref "J3") (pin "2") (pinfunction "Pin_2") (pintype "passive")))
    (net (code "57") (name "A10")
      (node (ref "J3") (pin "3") (pinfunction "Pin_3") (pintype "passive")))
    (net (code "58") (name "A11")
      (node (ref "J3") (pin "4") (pinfunction "Pin_4") (pintype "passive")))
    (net (code "59") (name "A12")
      (node (ref "J3") (pin "5") (pinfunction "Pin_5") (pintype "passive")))
    (net (code "60") (name "A13")
      (node (ref "J3") (pin "6") (pinfunction "Pin_6") (pintype "passive")))
    (net (code "61") (name "A14")
      (node (ref "J3") (pin "7") (pinfunction "Pin_7") (pintype "passive")))
    (net (code "62") (name "A15")
      (node (ref "J3") (pin "8") (pinfunction "Pin_8") (pintype "passive")))
    (net (code "63") (name "ANA")
      (node (ref "J11") (pin "8") (pinfunction "Pin_8") (pintype "passive")))
    (net (code "64") (name "AREF")
      (node (ref "J4") (pin "3") (pinfunction "Pin_3") (pintype "passive")))
    (net (code "65") (name "E1")
      (node (ref "J1") (pin "1") (pinfunction "Pin_1") (pintype "passive")))
    (net (code "66") (name "GND")
      (node (ref "J1") (pin "6") (pinfunction "Pin_6") (pintype "passive"))
      (node (ref "J1") (pin "7") (pinfunction "Pin_7") (pintype "passive"))
      (node (ref "J10") (pin "4") (pinfunction "Pin_4") (pintype "passive"))
      (node (ref "J11") (pin "7") (pinfunction "Pin_7") (pintype "passive"))
      (node (ref "J12") (pin "1") (pinfunction "Pin_1") (pintype "passive"))
      (node (ref "J12") (pin "8") (pinfunction "Pin_8") (pintype "passive"))
      (node (ref "J4") (pin "4") (pinfunction "Pin_4") (pintype "passive"))
      (node (ref "J7") (pin "35") (pinfunction "Pin_18") (pintype "passive"))
      (node (ref "J7") (pin "36") (pinfunction "Pin_36") (pintype "passive"))
      (node (ref "J8") (pin "2") (pinfunction "Pin_2") (pintype "passive"))
      (node (ref "J9") (pin "2") (pinfunction "Pin_2") (pintype "passive")))
    (net (code "67") (name "Net-(J12-Pad5)")
      (node (ref "J12") (pin "5") (pinfunction "Pin_5") (pintype "passive"))
      (node (ref "R10K1") (pin "1") (pintype "passive")))
    (net (code "68") (name "RESET")
      (node (ref "J1") (pin "3") (pinfunction "Pin_3") (pintype "passive")))
    (net (code "69") (name "RX0")
      (node (ref "J5") (pin "8") (pinfunction "Pin_8") (pintype "passive")))
    (net (code "70") (name "RX1 19")
      (node (ref "J6") (pin "6") (pinfunction "Pin_6") (pintype "passive")))
    (net (code "71") (name "RX2 17")
      (node (ref "J6") (pin "4") (pinfunction "Pin_4") (pintype "passive"))
      (node (ref "J8") (pin "5") (pinfunction "Pin_5") (pintype "passive")))
    (net (code "72") (name "RX3 15")
      (node (ref "J6") (pin "2") (pinfunction "Pin_2") (pintype "passive")))
    (net (code "73") (name "SCL")
      (node (ref "J4") (pin "1") (pinfunction "Pin_1") (pintype "passive")))
    (net (code "74") (name "SCL 21")
      (node (ref "J6") (pin "8") (pinfunction "Pin_8") (pintype "passive"))
      (node (ref "J9") (pin "3") (pinfunction "Pin_3") (pintype "passive")))
    (net (code "75") (name "SDA")
      (node (ref "J4") (pin "2") (pinfunction "Pin_2") (pintype "passive")))
    (net (code "76") (name "SDA 20")
      (node (ref "J6") (pin "7") (pinfunction "Pin_7") (pintype "passive"))
      (node (ref "J9") (pin "4") (pinfunction "Pin_4") (pintype "passive")))
    (net (code "77") (name "TX0 ")
      (node (ref "J5") (pin "7") (pinfunction "Pin_7") (pintype "passive")))
    (net (code "78") (name "TX1 18")
      (node (ref "J6") (pin "5") (pinfunction "Pin_5") (pintype "passive")))
    (net (code "79") (name "TX2 16")
      (node (ref "J6") (pin "3") (pinfunction "Pin_3") (pintype "passive"))
      (node (ref "J8") (pin "4") (pinfunction "Pin_4") (pintype "passive")))
    (net (code "80") (name "TX3 14")
      (node (ref "J6") (pin "1") (pinfunction "Pin_1") (pintype "passive")))
    (net (code "81") (name "Vin")
      (node (ref "J1") (pin "8") (pinfunction "Pin_8") (pintype "passive")))
    (net (code "82") (name "unconnected-(J8-Pad3)")
      (node (ref "J8") (pin "3") (pinfunction "Pin_3") (pintype "passive+no_connect")))
    (net (code "83") (name "unconnected-(J8-Pad6)")
      (node (ref "J8") (pin "6") (pinfunction "Pin_6") (pintype "passive+no_connect")))
    (net (code "84") (name "unconnected-(J8-Pad7)")
      (node (ref "J8") (pin "7") (pinfunction "Pin_7") (pintype "passive+no_connect")))
    (net (code "85") (name "unconnected-(J8-Pad8)")
      (node (ref "J8") (pin "8") (pinfunction "Pin_8") (pintype "passive+no_connect")))
    (net (code "86") (name "unconnected-(J9-Pad5)")
      (node (ref "J9") (pin "5") (pinfunction "Pin_5") (pintype "passive+no_connect")))
    (net (code "87") (name "unconnected-(J9-Pad6)")
      (node (ref "J9") (pin "6") (pinfunction "Pin_6") (pintype "passive+no_connect")))
    (net (code "88") (name "unconnected-(J10-Pad2)")
      (node (ref "J10") (pin "2") (pinfunction "Pin_2") (pintype "passive+no_connect")))
    (net (code "89") (name "unconnected-(J11-Pad5)")
      (node (ref "J11") (pin "5") (pinfunction "Pin_5") (pintype "passive+no_connect")))
    (net (code "90") (name "unconnected-(J11-Pad6)")
      (node (ref "J11") (pin "6") (pinfunction "Pin_6") (pintype "passive+no_connect")))
    (net (code "91") (name "unconnected-(J12-Pad7)")
      (node (ref "J12") (pin "7") (pinfunction "Pin_7") (pintype "passive+no_connect")))))