തങ്കശ്ശേരി/N_NN കടപ്പുറത്തുനിന്ന്/N_NN ഒരു/QT_QTC കൂക്കി/JJ വിളി/N_NN ഉയര്‍ന്നു/V_VM_VF 
അതുകേട്ട്/V_VM_VNF അരയക്കുടിലുകളില്‍/N_NNP വിളക്കുകള്‍/N_NN തെളിഞ്ഞു/V_VM_VF 
കിഴക്ക്/N_NN വെള്ള/N_NN കീറിയിട്ടില്ല/RP_NEG 
ഉറക്കച്ചടവില്‍/N_NN ഇറങ്ങിവന്നവര്‍/N_NN കിഴക്കോട്ട്/N_NST നടന്നു/V_VM_VF 
നേര്‍ത്തനിലാവില്‍/JJ കറുത്ത/JJ നിഴലുകളുടെ/N_NNP ഘോഷയാത്ര/N_NN 
അഴിഞ്ഞുകിടക്കുന്ന/JJ മുടി/N_NN വാരിക്കെട്ടി/V_VM_VF മരയ്ക്കാത്തിമാര്‍/N_NNP കൂരയുടെ/N_NN വാതില്‍/N_NN ചാരി/V_VM_VF 
ഉറഞ്ഞുകിടക്കുന്ന/V_VM_VNF കടലില്‍/N_NN ജലയാനങ്ങള്‍/N_NN ഇളകിത്തുടങ്ങി/V_VM_VF 
കോഴിക്കോട്ടുനിന്ന്/N_NNP നാടുകാണിച്ചുരം/N_NNP കയറി/V_VM_VF ഊട്ടിയുടെ/N_NNP തണുപ്പിലേക്ക്/N_NN കൂപ്പുകുത്തുമ്പോള്‍/V_VM_VNF പഴയ/JJ മായികക്കാഴ്ചകളായിരുന്നു/V_VM_VF മനസ്സുനിറയെ/N_NN 
ആവശ്യമായ/JJ സാധനങ്ങൾ:/N_NN 1/QT_QTC പഴം/N_NN ഫ്രോസൺ/RD_RDF 3/QT_QTC 2./QT_QTC ആപ്പിൾ/N_NN 2/QT_QTC 3./QT_QTC ഈന്തപ്പഴം/N_NN 15/QT_QTC എണ്ണം/N_NN 4./QT_QTC ഓട്സ്/N_NN 3/QT_QTC ടേബിൾ/N_NN സ്പൂൺ/N_NN അരക്കപ്പ്/QT_QTC പാലിൽ/N_NN വേവിച്ചത്/V_VM_VINF 5./QT_QTC പാൽ/N_NN 2/QT_QTC കപ്പ്/N_NN ഉണ്ടാക്കുന്ന/V_VM_VNF വിധം/N_NN :/RD_SYM ഫ്രോസണ്‍/RD_RDF പഴവും/N_NN ,/RD_SYM ഈന്തപ്പഴവും/N_NN ,/RD_SYM തൊലിയും/N_NN കുരുവും/N_NN കളഞ്ഞ/V_VM_VNF ആപ്പിളും/N_NN ,/RD_SYM പാലില്‍/N_NN വേവിച്ച/JJ ഓട്ട്സും,/N_NN 
പാല്‍/N_NN ആവശ്യാനുസരണം/RB കൂട്ടുകയോ/QT കുറയ്ക്കുകയോ/QT ചെയ്യാവുന്നതാണ്/V_VM_VNF 
ആവശ്യമെങ്കില്‍/V_VM_VNF മാത്രം/RP_RPD മധുരം/N_NN ചേര്‍ത്ത്,/V_VM_VNF ഗ്ലാസ്സില്‍/N_NN ഒഴിച്ച്/V_VM_VNF സെര്‍വ്/RD_RDF ചെയ്യാം/V_VM_VF 
നെയ്പത്തിരി/N_NN ചേരുവകള്‍/N_NN 1./QT_QTC പുഴുങ്ങലരിഅരക്കിലോ/N_NN 2./QT_QTC തേങ്ങ/N_NN ഒന്ന്/QT_QTC 3./QT_QTC പെരുഞ്ചീരകം/N_NN ഒരു/QT_QTC ടേബിള്‍/RD_RDF സ്പൂണ്‍/N_NN 4./QT_QTC സവാള/N_NN ഒന്ന്/QT_QTC മുറിച്ചത്/V_VM_VNF 5./QT_QTC ഓയില്‍/N_NN പൊരിക്കാന്‍/V_VM_VNF ആവശ്യമായത്/V_VM_VNF 6./QT_QTC ഉപ്പ്/N_NN ആവശ്യത്തിന്/N_NN 
തയ്യാറാക്കുന്ന/V_VM_VNF വിധം/N_NN :/RD_PUNC ഇളംചൂട്/JJ വെള്ളത്തില്‍/N_NN അരി/N_NN നാല്അഞ്ച്/QT_QTC മണിക്കൂര്‍/QT_QTO കുതിര്‍ത്തുവെയ്ക്കുക/V_VM_VINF 
ബാക്കി/JJ എല്ലാ/QT_QTF ചേരുവകളും/N_NN ചേര്‍ത്ത്/V_VM_VNF നല്ല/JJ കട്ടിയായി/N_NN അരച്ചെടുക്കുക/V_VM_VINF 
അധികം/QT_QTF അരയരുത്/RP_NEG 
തുടര്‍ന്ന്/V_VM_VNF മാവ്/N_NN ഓരോ/QT_QTF ഉരുളകളാക്കി/N_NN വാഴയില/N_NN കഷണത്തില്‍/N_NN എണ്ണ/N_NN തടവിയശേഷം/V_VM_VNF_RP പൂരിയുടെ/JJ വലിപ്പത്തില്‍/N_NN പരത്തിയെടുക്കുക/V_VM_VINF 
ഇതിനുശേഷം/CC_CCD ചൂടായ/JJ എണ്ണയില്‍/N_NN പൊരിച്ച്/V_VM_VNF കോരിയെടുക്കുക/V_VM_VINF 
പൂരി/N_NN പൊങ്ങിവരുന്നതുപോലെ/RB പൊങ്ങിവരണം/V_VM_VF 
മലബാര്‍/N_NNP പെപ്പര്‍/N_NN ചിക്കന്‍/N_NN ചേരുവകള്‍/N_NN 1./QT_QTC കോഴിയിറച്ചി/N_NN ഒരു/QT_QTC കിലോ/QT_QTC 2./QT_QTC സവാള/N_NN മൂന്നെണ്ണം/QT_QTC 3./QT_QTC ചെറിയ/JJ ഉള്ളി/N_NN 250/QT_QTC ഗ്രാം/QT_QTC 4./QT_QTC ഇഞ്ചി/N_NN രണ്ട്/QT_QTC ടീസ്പൂണ്‍/QT_QTC 5./QT_QTC വെളുത്തുള്ളിഒരു/N_NN ടീസ്പൂണ്‍/QT_QTC 6./QT_QTC തക്കാളി/N_NNP രണ്ടെണ്ണം/QT_QTC 7./QT_QTC കുരുമുളക്/N_NN രണ്ട്/QT_QTC ടീസ്പൂണ്‍/N_NN തരുതരിപ്പായി/JJ പൊടിച്ചത്/V_VM_VNF 8./QT_QTC ഉപ്പ്/N_NN ആവശ്യത്തിന്/V_VM_VNF 9./QT_QTC മഞ്ഞള്‍പൊടി/N_NN 
തയ്യാറാക്കുന്ന/V_VM_VNF വിധം/N_NN :/RD_SYM ഒന്നുമുതല്‍/QT_QTC 10/QT_QTC വരെയുള്ള/PSP ചേരുവകള്‍/N_NN ഒന്നിച്ചുചേര്‍ത്ത്/N_NN കുഴച്ച്/V_VM_VNF കുക്കറില്‍/N_NN വേവിക്കുക/V_VM_VINF 
വെന്തുകഴിഞ്ഞാല്‍/V_VM_VNF വെളിച്ചെണ്ണയില്‍/N_NN കറിവേപ്പില/N_NN വറുത്തുചേര്‍ക്കുക/V_VM_VINF 
മല്ലിയില/N_NN ചേര്‍ത്ത്/V_VM_VNF വിളമ്പുക/V_VM_VINF 
കോഴിക്കോട്/N_NNP പുറക്കാട്ടിരി/N_NNP ഷാപ്പിലെ/N_NN ജനപ്രിയ/JJ ഇനങ്ങളില്‍/N_NN ഒന്നാണ്/QT_QTC മുരു/JJ പെപ്പര്‍/RD_RDF ഫ്രൈ/RD_RDF 
ഈ/DM_DMD തനി/RP_RPD നാടന്‍/JJ വിഭവം/N_NN ഉണ്ടാക്കുന്നതെങ്ങിനെയെന്ന്/V_VM_VNF ഷാപ്പുടമ/N_NN തന്നെ/RP_INTF വിവരിക്കുന്നു/V_VM_VF 
ചേരുവകൾ/N_NN :/RD_SYM 1./QT_QTC വറുത്ത/JJ അരിപ്പൊടി/N_NN രണ്ടുകപ്പ്/QT_QTC 2./QT_QTC തേങ്ങ/N_NN രണ്ടെണ്ണം/QT_QTC 3./QT_QTC വെള്ളം/N_NN മൂന്നരക്കപ്പ്/QT_QTC 4./QT_QTC ഏലയ്ക്കാപ്പൊടി/N_NN ഒരു/QT_QTC ടീസ്പൂണ്‍/QT_QTC 5./QT_QTC പഞ്ചസാര/N_NN 150/QT_QTC ഗ്രാം/QT_QTC 6./QT_QTF നേന്ത്രപ്പഴം/N_NN മൂന്നെണ്ണം/QT_QTC 7./QT_QTC നെയ്യ്/CC_CCS ഒരു/QT_QTC സ്പൂണ്‍/QT_QTC തയ്യാറാക്കുന്ന/V_VM_VNF വിധം/N_NN :/RD_SYM വെള്ളം/N_NN അടുപ്പില്‍വെച്ച്/V_VM_VNF തിളച്ചാല്‍/N_NN പൊടിചേര്‍ത്ത്/V_VM_VNF ഇളക്കി/V_VM_VNF 
ഈ/DM_DMD മാവ്/N_NN കുറേശ്ശെ/QT എടുത്ത്/V_VM_VNF മുല്ലമൊട്ട്/N_NN ആകൃതിയിലുണ്ടാക്കി/V_VM_VNF ആവിച്ചെമ്പില്‍/N_NN വേവിച്ചുവെക്കുക/V_VM_VINF 
തേങ്ങ/N_NN ചിരവി/V_VM_VF ഒന്നാം/QT_QTO പാലും/N_NN രണ്ടാം/QT_QTO പാലും/N_NN എടുക്കുക/V_VM_VINF 
ഉരുളി/N_NN അടുപ്പില്‍/N_NN വെച്ച്/PSP രണ്ടാംപാല്‍/N_NN ചൂടാകുമ്പോള്‍/V_VM_VNF നേന്ത്രപ്പഴം/N_NN തൊലി/N_NN കളഞ്ഞ്/V_VM_VNF അരയിഞ്ച്/V_VM_VNF കനത്തിലും/N_NN രണ്ടിഞ്ച്/V_VM_VNF നീളത്തിലും/N_NN മുറിച്ച്/V_VM_VNF വേവിക്കുക/V_VM_VINF 
ഇതിലേക്ക്/DM_DMD മാവ്/N_NN മുല്ലമൊട്ട്/N_NN ആകൃതിയില്‍/N_NN ഒരുക്കിയതും/N_NN പഞ്ചസാരയും/N_NN ഒന്നാം/QT_QTO പാലും/N_NN ചേര്‍ത്ത്/V_VM_VNF ചെറുതീയില്‍/N_NN ഇളക്കി/V_VM_VF വേവിക്കുക/V_VM_VINF 
മുഴുപ്പ്/N_NN കുറവാണെങ്കില്‍/CC_CCD രണ്ട്/QT_QTC സ്പൂണ്‍/N_NN അരിപ്പൊടി/N_NN കലക്കി/V_VM_VNF_RP ഒഴിക്കാം/V_VM_VF 
അരക്കിലോ/QT_QTF കൊഴുവയില്‍/N_NN ആവശ്യത്തിന്/N_NN മുളകുപൊടി/N_NN മഞ്ഞപ്പൊടി/N_NN ഉപ്പ്/N_NN എന്നിവ/RP_CL ചേര്‍ത്ത്/V_VM_VNF ആദ്യം/QT_QTO തന്നെ/RP_INTF ഫ്രൈ/RD_RDF ചെയ്തുവെക്കണം/V_VM_VF 
മറ്റു/JJ ചേരുവകള്‍/N_NN മുളകുപൊടി/N_NN ‍/N_NN 2./QT_QTC ടീസ്പൂണ്‍/N_NN മഞ്ഞപ്പൊടി/N_NN 1/QT_QTC ടീസ്പൂണ്‍/N_NN മസാലപ്പൊടി‍/N_NNP 1/QT_QTC ടീസ്പൂണ്‍/QT_QTC മല്ലിപ്പൊടി/N_NN 1/QT_QTC ടീസ്പൂണ്‍/N_NN പച്ചമുളക്/N_NNP 1൨/QT_QTC തക്കാളി/N_NN ഒന്ന്/QT_QTC നാളികേരക്കൊത്ത്/N_NN അരമുറി/N_NN ചെറിയ/JJ ഉള്ളി/N_NN അരകപ്പ്/QT_QTC ഉള്ളികൂടും/N_NN തോറും/PSP സ്വാദ്/N_NN കൂടും/N_NN വെളുത്തുള്ളി/N_NN 20/QT_QTC അല്ലി/JJ കടുക്/N_NN ഇഞ്ചി/N_NN ഉപ്പ്/N_NN വെളിച്ചെണ്ണ/N_NN വേപ്പില/N_NN ആവശ്യത്തിന്/N_NN പാന്‍/N_NN 
എണ്ണ/N_NN ചൂടായി/V_VM_VNF_RP വരുമ്പോള്‍/V_VM_VNF കടുക്/N_NN ഇടാം/V_VM_VF 
കടുക്/N_NN മുഴുവന്‍/QT_QTF പൊട്ടിക്കഴിയുമ്പോള്‍/N_NN അതിലേക്ക്/N_NN ഇഞ്ചി/N_NN എന്നിവ/RP_CL അരിഞ്ഞത്/V_VM_VNF ചേര്‍ത്ത്/V_VM_VNF വഴറ്റുക/V_VM_VINF 
പച്ചമണം/N_NN മാറുമ്പോള്‍/V_VM_VNF ഇതിലേക്ക്/DM_DMD ചെറിയ/JJ ഉള്ളിയും/N_NN പച്ചമുളകും/N_NN ചേര്‍ത്ത്/V_VM_VNF നന്നായി/RB ഇളക്കുക/V_VM_VINF 
നന്നായി/RB വഴന്നുവരുമ്പോള്‍/V_VM_VNF ഇതിലേക്ക്/DM_DMD മുളകുപൊടി/N_NNP ,/RD_SYM മല്ലിപ്പൊടി/N_NN ,/RD_SYM മഞ്ഞപ്പൊടി/N_NN ,/RD_SYM ഗരം/N_NN മസാലഎന്നിവ/N_NN ചേര്‍ക്കുക/V_VM_VINF 
നന്നായി/RB പാകമാകുമ്പോള്‍/V_VM_VNF ഇതിലേക്ക്/DM_DMD തക്കാളിയും/N_NNP തേങ്ങാക്കൊത്തും/N_NN ചേര്‍ക്കാം/V_VM_VF 
തേങ്ങാക്കൊത്ത്/N_NN നന്നായി/RB മൂത്ത്/N_NN വരുമ്പോള്‍/V_VM_VNF അതിലേക്ക്/DM_DMD ഫ്രൈ/RD_RDF ചെയ്തുവെച്ച/V_VM_VNF കൊഴുവ/N_NN ചേര്‍ക്കാം/V_VM_VF 
ചേരുവകൾ/N_NN :/RD_SYM 1./QT_QTC ബിരിയാണി/N_NN അരി/N_NN ഒരു/QT_QTC കിലോ/QT_QTC 2./QT_QTC സവാള/N_NN കാല്‍കിലോ/QT_QTC 3./QT_QTC ചിക്കന്‍/N_NN ഒരുകിലോ/QT_QTC 4./QT_QTC ഇഞ്ചി/N_NN 50/QT_QTC ഗ്രാം/N_NN 5./QT_QTC വെളുത്തുള്ളി/N_NNP 50ഗ്രാം/N_NN 6./QT_QTC പച്ചമുളക്/N_NN 15/QT_QTC എണ്ണം/QT_QTC 7./QT_QTC തൈര്/N_NN ഒരുകപ്പ്/N_NN 8./QT_QTC തക്കാളി/N_NNP അഞ്ചെണ്ണം/QT_QTC 9./QT_QTC ചെറുനാരങ്ങ/N_NN രണ്ടെണ്ണം/N_NN 10./QT_QTC കസ്/N_NN കസ്/N_NN ഒരു/QT_QTC ടേബിള്‍/N_NN സ്പൂണ്‍/N_NN അരച്ചത്/V_VM_VNF 
ഇറച്ചി,/N_NNP തക്കാളി/N_NN അരിഞ്ഞത്,/V_VM_VNF തൈര്,/N_NN കസ്കസ്,/N_NNP ഉപ്പ്,/N_NN മല്ലിപ്പൊടി,/N_NN ചതച്ച/V_VM_VNF_RP ചേരുവകള്‍,/N_NNP മഞ്ഞള്‍പ്പൊടി/N_NN എന്നിവ/N_NN ചേര്‍ത്ത്/V_VM_VNF ഒരു/QT_QTC മണിക്കൂര്‍/DM_DMD വെയ്ക്കുക/V_VM_VINF 
ഒരു/QT_QTC പാത്രത്തില്‍/N_NN വെള്ളം/N_NN ,/RD_SYM ഉപ്പ്/N_NN ,/RD_SYM ഗ്രാമ്പു/V_VM_VF ,/RD_SYM പട്ട/N_NN ,/RD_SYM ഏലയ്ക്ക/N_NN എന്നിവ/N_NN ചേര്‍ത്ത്/V_VM_VNF തിളപ്പിക്കുക/V_VM_VINF 
അരി/N_NN അതിലിടുക/V_VM_VINF 
അല്പം/QT വേവായാല്‍/N_NN അരി/N_NN ഊറ്റിയെടുക്കുക/V_VM_VINF 
ഒരു/QT_QTC പാത്രത്തില്‍/N_NN മൂന്ന്/QT_QTC ടേബിള്‍/N_NN സ്പൂണ്‍/N_NN വനസ്പതി/N_NN ചൂടാക്കി/V_VM_VNF കാല്‍കിലോ/N_NN സവാള/N_NN അരിഞ്ഞത്/V_VM_VNF ചേര്‍ത്ത്/V_VM_VNF നന്നായി/RB വഴറ്റി/N_NN ചിക്കന്‍കൂട്ടില്‍/N_NN ചേര്‍ക്കുക/V_VM_VINF 
നെയ്യ്/N_NN ചൂടാക്കി/V_VM_VNF രണ്ട്/QT_QTC സവാള/N_NN നീളത്തിലരിഞ്ഞതും/N_NN കശുവണ്ടി,/N_NN കിസ്മിസ്/N_NN എന്നിവ/N_NN മൂപ്പിച്ച്/V_VM_VNF കോരിയെടുക്കുക/V_VM_VINF 
നെയ്/N_NN മാറ്റി/RB വെയ്ക്കുക/V_VM_VINF 
ഒരു/QT_QTC പാത്രത്തില്‍/N_NN ചിക്കന്‍/N_NN കൂട്ടും/N_NN ബിരിയാണി/N_NN മസാല/N_NN പ്പാടിയും/N_NN പകുതി/QT_QTF മല്ലിയിലയും/N_NN ചേര്‍ത്ത്/V_VM_VNF ഇതിനു/DM_DMD മുകളിലേക്ക്/N_NST വെന്ത/V_VM_VNF_RP ചോറിടുക/V_VM_VINF 
വറുത്ത/V_VM_VNF_RP സവാള/N_NN ,/RD_SYM കിസ്മിസ്/N_NN ,/RD_SYM അണ്ടിപ്പരിപ്പ്/N_NN എന്നിവ/RP_CL വിതറുക/V_VM_VF 
മാറ്റി/V_VM_VNF വെച്ച/V_VM_VNF നെയ്യ്/N_NN ഇതിനു/DM_DMD മുകളിലേക്ക്/N_NST ഒഴിക്കുക/V_VM_VNF 
മല്ലിയില/N_NN അരിഞ്ഞതും/V_VM_VNF ചെറുനാരങ്ങാനീരും/N_NN അര/QT_QTC ടീസ്പൂണ്‍/N_NN റോസ്/RD_RDF വാട്ടറും/RD_RDF ചേര്‍ത്ത്/V_VM_VNF പാത്രം/N_NN കട്ടിയുള്ള/JJ തളിക/N_NN കൊണ്ട്/PSP മൂടുക/V_VM_VINF 
ആവി/N_NN പോകാതിരിക്കാനായി/V_VM_VNF മൈദ/N_NN മാവ്/N_NN തളികയുടെ/N_NN ചുറ്റിലും/N_NN ഒട്ടിച്ച്/V_VM_VNF വെയ്ക്കുക/V_VM_VINF 
അടിയില്‍/N_NST 1015/QT_QTC മിനിറ്റുനേരം/DM_DMR നന്നായി/JJ തീ/N_NN കത്തിക്കുക/V_VM_VINF 
ഒരുമണിക്കൂര്‍/QT_QTC കഴിഞ്ഞ്/V_VM_VNF തുറക്കുക/V_VM_VINF 
ബിരിയാണി/N_NN വിളമ്പുമ്പോള്‍/V_VM_VNF ചോറ്/N_NN മുകളില്‍നിന്ന്/V_VM_VNF കോരിയെടുത്ത്/N_NN ഒരു/QT_QTC പാത്രത്തില്‍/N_NN വിളമ്പിയശേഷം/V_VM_VNF മസാല/N_NN മറ്റൊരു/JJ പാത്രത്തില്‍/N_NN വിളമ്പുക/V_VM_VINF 
ഉള്ളി/ പൊരിച്ചതും/ മല്ലിയിലയും/ കൊണ്ട്/ അലങ്കരിക്കുക/ 
ചേരുവകള്‍/N_NN ആവോലി/N_NN ,/RD_SYM അയക്കൂറ/N_NN (/RD_SYM ഇഷ്ടമുള്ളത്/N_NN )/RD_PUNC 500/QT_QTC ഗ്രാം/QT_QTO പച്ചമുളക്/N_NN 5/QT_QTC എണ്ണം/N_NN ഇഞ്ചി/N_NN ചെറിയകഷണം/N_NN തക്കാളി/N_NN 2/QT_QTO എണ്ണം/N_NN ചെറിയ/JJ ഉള്ളി/N_NN 10/QT_QTO എണ്ണം/N_NN മുളക്/N_NN പൊടി/N_NN 2/QT_QTC ടീസ്പൂണ്‍/QT_QTC മഞ്ഞള്‍പൊടി/N_NN അരടീസ്പൂണ്‍/QT_QTC മല്ലിപ്പൊടി/N_NN അരടീസ്പൂണ്‍/QT_QTC തേങ്ങ/N_NN അരമുറി/QT_QTF ചിരകിയത്/N_NN പുളി/N_NN കുതിര്‍ത്തത്/V_VM_VNF ഒരു/QT_QTC നെല്ലിക്ക/N_NN വലുപ്പം/N_NN ഉപ്പ്,/N_NN 
തേങ്ങ/N_NN തവിട്ടു/DM_DMQ നിറമായി/N_NNP കഴിഞ്ഞാല്‍/V_VM_VNF മുളകുപൊടി/N_NN ,/RD_SYM മല്ലിപ്പൊടി/N_NN എന്നിവ/RP_CL ചേര്‍ത്ത്/V_VM_VNF ഇളക്കി/V_VM_VNF തീയണക്കണം/V_VM_VF 
ഇത്/PSP നല്ലപോലെ/RB അരച്ചെടുക്കണം/V_VM_VF 
പാകം/N_NN ചെയ്യുന്നവിധം/V_VM_VNF ആവോലി/N_NN കഴുകി/V_VM_VNF വൃത്തിയാക്കി/V_VM_VNF അതിലേക്ക്/DM_DMD പച്ചമുളക്,/V_VM_VNF ഇഞ്ചി,/N_NNP തക്കാളി,/N_NNP ചെറിയ/JJ ഉള്ളി/N_NN എന്നിവ/N_NN അരിഞ്ഞത്/V_VM_VNF ,/RD_SYM മഞ്ഞള്‍പൊടി/V_VM_VNF ,/RD_SYM പുളി/N_NN പിഴിഞ്ഞത്,/V_VM_VNF ഉപ്പ്/V_VM_VNF ,/RD_SYM അരപ്പ്/N_NN എന്നിവ/N_NN ചേര്‍ത്തിളക്കി/V_VM_VNF അഞ്ച്/QT_QTC മിനിറ്റ്/N_NN വെച്ചതിനുശേഷം/N_NN തീയില്‍/N_NN വെക്കുക/V_VM_VINF 
തിളച്ച്/V_VM_VNF കുറുകി/V_VM_VF പാകമായാല്‍/N_NN കറിവേപ്പില/N_NNP ചേര്‍ത്ത്/V_VM_VNF വെളിച്ചെണ്ണയില്‍/N_NN കടുക്/V_VM_VNF ,/RD_SYM വറ്റല്‍/N_NN മുളക്,/V_VM_VNF ചെറിയ/JJ ഉള്ളി/N_NN എന്നിവ/N_NN മൂപ്പിച്ച്/V_VM_VNF വറവിടണം/V_VM_VF 
(/RD_PUNC മത്സ്യം/N_NN ഏതായാലും/DM_DMD ഇത്തരത്തില്‍/DM_DMD പാകം/N_NN ചെയ്തെടുക്കാം/V_VM_VNF 
ലക്ഷ്യം/N_NN മറ്റൊന്നായിരുന്നുവെങ്കിലും/N_NN തലശ്ശേരി/N_NNP അഫാമിയയിലെ'ഇന്നത്തെ/N_NN സ്പെഷ്യല്‍'/RD_PUNC ബോര്‍ഡില്‍/N_NN 'ക്രാബ്/N_NNP ലോലിപോപ്പ്/RD_PUNC എന്നു/CC_CCS കണ്ടപ്പോള്‍/V_VM_VNF ഉണ്ടായ/V_VM_VNF കൗതുകം/N_NN വൈവിധ്യങ്ങളുടെ/N_NN ഒരു/QT_QTC കലവറയിലേക്കാണ്/V_VAUX വിളിച്ചു/V_VM_VF കയറ്റിയത്/V_VM_VNF 
തലശ്ശേരിയില്‍/N_NNP ബി.ഇ.എം.പി/RD_RDF എതിര്‍/JJ വശത്താണ്/V_VM_VNF അഫാമിയ/N_NNP സ്ഥിതി/N_NN ചെയ്യുന്നത്/V_VM_VNF 
സാദിഖ്/N_NNP ഉമ്മര്‍/N_NNP എന്ന/CC_CCS പ്രവാസിയുടെ/N_NN ഏറെ/QT_QTF നാളത്തെ/N_NN സ്വപ്നത്തിന്റെ/N_NN സാക്ഷാത്കാരമാണ്/V_VAUX അഫാമിയ/N_NNP 
ഏതൊരു/JJ പ്രവാസിയേയും/N_NN പോലെ/PSP നാട്ടിലെത്തി/N_NN സെറ്റില്‍/RD_RDF ചെയ്യണം/V_VM_VF എന്ന/CC_CCS ആഗ്രഹം/N_NN മാത്രമല്ല/CC_CCD മുന്നോട്ടുള്ള/JJ ജീവിതത്തിന്/N_NN എന്തു/DM_DMQ ചെയ്യണം/V_VM_VF എന്ന/CC_CCS വ്യക്തമായ/JJ രൂപരേഖയും/N_NN ഉണ്ടായിരുന്നു/V_VM_VF സാദിഖിന്/N_NNP 
ആറു/QT_QTC മാസമേ/N_NN ആയുള്ളൂ/V_VM_VNF രുചിയുടെ/N_NN ഈ/DM_DMD കലവറ/JJ പ്രവര്‍ത്തനം/N_NN ആരംഭിച്ചിട്ട്/V_VAUX 
പഴയ/JJ പീകോക്ക്/N_NN റസ്റ്റോറന്റ്/RD_RDF ഇരുന്ന/V_VM_VNF സ്ഥലത്ത്/N_NN എന്നു/CC_CCS പറഞ്ഞാല്‍/V_VM_VNF അന്വേഷിക്കുന്നവര്‍ക്ക്/N_NN കട/N_NN കണ്ടെത്താന്‍/V_VM_VNF കുറച്ചുകൂടി/QT_QTF എളുപ്പമാണ്/V_VAUX എന്നു/CC_CCS പറഞ്ഞു/V_VM_VF തന്നു/V_VM_VF സാദിഖ്/N_NNP ഇക്ക/N_NNP 
ക്രാബ്/RD_RDF ലോലിപോപ്പ്/N_NN അഫാമിയ/RD_RDF സ്പെഷ്യല്‍/RD_RDF ക്രിസ്പി/RD_RDF കയറിയത്/V_VM_VNF ക്രാബ്/RD_RDF ലോലിപോപ്പിന്റെ/N_NN റസിപ്പി/RD_RDF കിട്ടിയാലോ/V_VM_VNF എന്നു/CC_CCS_UT പ്രതീക്ഷിച്ചാണ്/V_VM_VNF 
എന്നാല്‍/CC_CCD അത്/QT_QTC കഴിക്കാന്‍/V_VM_VNF അഫാമിയയില്‍/RD_RDF തന്നെ/RP_INTF എത്തേണ്ടി/V_VM_VNF വരുമെന്നു/V_VM_VF മനസിലായതോടെ/N_NN നിരാശയായി/JJ 
എങ്കിലും/CC_CCD മറ്റൊരു/JJ പുതിയ/JJ ഐറ്റം/RD_RDF പരിചയപ്പെടുത്തിത്തരാം/V_VM_VNF എന്നു/CC_CCS പറഞ്ഞതോടെ/V_VM_VNF സമാധാനമായി/RB 
അങ്ങനെയാണ്/DM_DMD ബോംബെ/RP_RPD സ്വദേശിയായ/JJ സ്പെഷ്യല്‍/RD_RDF ക്രിസ്പി/RD_RDF കണ്‍മുന്നിലെത്തുന്നത്/V_VM_VNF 
ബീഹാറുകാരനായ/JJ മൃത്യുഞ്ജയനും/N_NN സഹായി/N_NN സഞ്ജയുമാണ്/N_NN അഫാമിയയിലെ/RD_RDF മറുനാടന്‍/N_NN രുചികള്‍ക്ക്/N_NN പിന്നില്‍/N_NST 
തയ്യാറാക്കുന്ന/V_VM_VNF വിധം/N_NN കോഴിയുടെ/N_NNP തുടയിലെ/N_NN എല്ലില്ലാത്ത/JJ മാംസം/N_NN മൈദ/N_NN അര/QT_QTC കപ്പ്/N_NN മൈദാ/N_NN മാവ്/N_NN വെള്ളം/N_NN ചേര്‍ത്ത്/V_VM_VNF കുഴമ്പുരൂപത്തില്‍/N_NN ആക്കുക/V_VM_VINF 
ഇതില്‍/DM_DMD അല്‍പം/QT_QTF മഞ്ഞപ്പൊടിയും/N_NN ആവശ്യത്തിന്/N_NN ഉപ്പും/N_NN ചേര്‍ത്ത്/V_VM_VNF മാറ്റിവെക്കുക/V_VM_VINF 
കോഴിയുടെ/N_NN തുടയിലെ/N_NN എല്ലില്ലാത്ത/JJ മാംസം/N_NN കനം/N_NN കുറച്ച്/QT_QTF ചെത്തിയെടുക്കുക/V_VM_VINF 
ഇത്/PSP നീളത്തില്‍/N_NN കനം/N_NN കുറഞ്ഞ/JJ കഷ്ണങ്ങളായി/RB മുറിച്ചെടുക്കുക/V_VM_VINF 
ഈ/DM_DMD കഷ്ണങ്ങള്‍/N_NN കുഴമ്പു/N_NN രൂപത്തിലാക്കിയ/V_VM_VNF മൈദാ/N_NNP മാവില്‍/N_NN മുക്കിയെടുത്ത്/N_NN എണ്ണയില്‍/N_NN മുങ്ങിക്കിടക്കത്തക്ക/JJ രീതിയില്‍/N_NN വറുത്ത്/V_VM_VF തവിട്ടുനിറമാവുമ്പോള്‍/V_VM_VNF കോരുക/V_VM_VINF 
സ്പെഷ്യല്‍/RD_RDF ക്രിസ്പി/RD_RDF തയ്യാര്‍/N_NN 
നോമ്പ്/N_NN സമയത്ത്/N_NN വളരെ/RP_INTF എളുപ്പത്തില്‍/RB തയ്യാറാക്കാവുന്ന/V_VM_VNF ഒരു/QT_QTC വിഭവമാണിത്/N_NN 
അഫാമിയയിലെ/N_NN സ്പെഷ്യല്‍/RD_RDF ചായ/N_NN അബ്ദു/N_NNP റഹ്മാനിക്കാടെ/N_NN സ്പെഷ്യല്‍/RD_RDF ചായ/N_NN കുടിക്കാന്‍/V_VM_VNF മാത്രമല്ല/CC_CCD ഇക്ക/N_NN ചായ/N_NN അടിക്കുന്നത്/V_VM_VNF കാണാന്‍/V_VM_VNF അഫാമിയയില്‍/N_NN എണ്ണവും/N_NN ഇവിടെ/DM കൂടുതലാണ്/QT_QTF 
ആ/DM_DMD ചായയടി/N_NN ഒന്നു/QT_QTC കാണേണ്ടതു/V_VM_VNF തന്നെയാണ്/V_VAUX 
ഗ്ലാസ്സില്‍/N_NN മൂന്നു/QT_QTC തട്ടിലായി/N_NN വെള്ളം/N_NN വേറെ,/N_NN തേയില/N_NN വേറെ,/N_NN പാലു/N_NN വേറെയായി/N_NN നില്‍ക്കുന്ന/V_VM_VNF ചായ/N_NN 
അവസാനം/N_NN ഗ്ലാസ്/RD_RDF കറക്കിയൊരു/JJ വെപ്പും/V_VM_VINF 
ഗ്ലാസിനുള്ളില്‍/RD_RDF മൂന്നുതട്ടിലായി/QT_QTC കിട്ടുന്ന/V_VM_VNF ഈ/DM_DMD ചായയുടെ/N_NN രുചിയും/N_NN അഫാമിയയില്‍/RD_RDF നിന്നു/PSP മാത്രമേ/RP_INTF കിട്ടൂ/V_VM_VNF 
അങ്ങനെ/RB അടിയും/N_NN പിച്ചും/V_VM_VNF തല്ലും/N_NN കൊണ്ട്/PSP എങ്ങനെയൊക്കെയോ/V_VM_VNF ഞാന്‍/PR_PRP എട്ടാം/QT_QTO ക്ലാസ്സില്‍/N_NN എത്തി/V_VM_VF 
എട്ടാം/QT_QTO ക്ലാസ്സില്‍/N_NN ലൂക്ക്/RD_RDF സാര്‍/N_NNP ആണ്/V_VM ഞങ്ങളുടെ/PR_PRP ക്ലാസ്/N_NN ടീച്ചര്‍/N_NN 
രസികനായ/JJ ഒരു/QT_QTC അധ്യാപകനാണ്/V_VAUX അദ്ദേഹം/PR_PRP 
പക്ഷെ/CC_CCD അതുപോലെ/DM_DMD തന്നെ/RP_INTF കര്‍ക്കശക്കാരനും/N_NN ആണ്/V_VM 
ചിലപ്പോള്‍/RB ക്ലാസ്/N_NN റൂമില്‍/N_NN സാര്‍/N_NNP ഉച്ചത്തില്‍/N_NN പാട്ട്/N_NN പാടും/N_NN ,/RD_SYM ഞങ്ങളെ/PR_PRP കൊണ്ട്/PSP കൂടെ/PSP പാടിക്കും/V_VM_VF 
മറ്റു/JJ ടീച്ചര്‍മാരെ/N_NN പോലെ/PSP എക്സ്ട്രാ/RD_RDF ക്ലാസ്/N_NN എടുത്ത്/N_NN വെറുപ്പിക്കില്ല/RP_NEG 
എപ്പോഴും/RB ചിരിക്കും/V_VM_VF 
പലപ്പോഴും/RB ചിരിപ്പിക്കും/V_VM_VNF 
ഞാന്‍/PR_PRP ക്ലാസ്സില്‍/N_NN രണ്ടാമത്തെ/QT_QTO ബെഞ്ചില്‍/N_NN എന്റെ/PR_PRP കൂട്ടുകാരുമൊത്താണ്/V_VAUX ഇരിക്കുന്നത്/V_VM_VNF 
എന്റെ/PR_PRP ബെഞ്ചില്‍/N_NN വിവേക്/N_NNP കൃഷ്ണരാജ്/N_NNP ,/RP_INJ ടോണി/N_NNP ദാസ്/N_NNP ,/RD_PUNC രമേശ്/N_NNP എസ്/RD_RDF സുഗുണൻ/N_NNP ,/RD_SYM മാര്‍കോസ്/N_NNP ലൂക്കോസ്/N_NNP 
ഇതില്‍/DM_DMD വിവേക്/N_NNP കൃഷ്ണരാജ്/N_NNP അപാര/JJ പഠിത്തക്കാരനാണ്/V_VAUX 
വര്‍ഷങ്ങളായി/N_NN ഒന്നാം/QT_QTO റാങ്ക്/RD_RDF കയ്യാള്ളുന്നവനുമാണ്/V_VM_VNF_VBN 
അതിന്റെയൊരു/JJ സ്ഥാനവും/N_NN ഗമയും/N_NN ക്ലാസ്സില്‍/N_NN അവനുണ്ട്/V_VM_VF 
എന്നാല്‍/CC_CCS ഇപ്പോള്‍/DM_DMD ക്ലാസ്സിലെ/N_NN സ്റ്റാര്‍/RD_RDF അഹമ്മദ്/N_NNP ആസാദ്/N_NNP ആണ്/V_VM_VF 
ഇച്ചിരി/QT_QTF തല്ലിപൊളിത്തരം/N_NN കൈമുതലായുണ്ട്/V_VM_VF അഹമ്മദിന്/N_NN 
പണ്ട്/PR_PRP തൊട്ടേ/PSP വികൃതിയാണ്/V_VAUX 
എന്‍സിസിയില്‍/RD_RDF അംഗമാണ്/V_VM_VF 
പഠിത്തത്തില്‍/N_NNV ഇച്ചിരി/QT_QTF പുറകോട്ടാണ്/V_VAUX എങ്കിലും/CC_CCS ബാക്കി/N_NN കാര്യങ്ങളിലൊക്കെ/RB വളരെ/QT മുമ്പിലാണ്/V_VM_VF 
അവന്‍/PR_PRP എങ്ങനെ/DM_DMQ സ്റ്റാര്‍/RD_RDF ആയി/V_VM_VF 
അങ്ങനെ/RB അത്/DM_DMD സംഭവിച്ചു/V_VM_VF 
എന്റെ/PR_PRP പ്രാര്‍ത്ഥന/N_NN ഒന്നും/RB കേള്‍ക്കാതെ/V_VM_VNF ദൈവം/N_NN ഭീകരമായി/RB കാലുമാറി/V_VM_VF 
അതെ/CC_CCD 
ഞാന്‍/PR_PRP രണ്ടാം/QT_QTO ക്ലാസ്സില്‍/N_NN തോറ്റു/V_VM_VF 
അതറിഞ്ഞ/V_VM_VNF_RP ദിവസം/N_NN സ്കൈലാബ്/RD_RDF വീണു/V_VM_VF ലോകം/N_NN അവസാനിച്ചെങ്കില്‍/N_NN എത്ര/QT_QTC നന്നായേനെ/V_VM_VNF 
ഡല്‍ഹി/N_NNP ഭീകരവാദികള്‍/N_NN സ്കൂള്‍/N_NN തകര്‍ത്തെങ്കില്‍/N_NN അന്ന്/N_NST ഞാന്‍/PR_PRP വളരെയേറെ/RB സന്തോഷിച്ചേനെ/V_VM_VNF 
അതൊന്നും/QT_QTC സംഭവിച്ചില്ലെന്നു/V_VM_VNF മാത്രമല്ല/CC_CCD നാണംകെട്ടത്/V_VM_VNF മിച്ചം/N_NN 
അന്നു/N_NST സംഭവിച്ചത്/V_VM_VNF മറ്റു/JJ പലതുമാണ്/V_VAUX 
വേനല്‍/N_NN അവധി/N_NN കഴിഞ്ഞു/V_VM_VF സ്കൂള്‍/N_NN തുറന്ന/JJ ദിവസം/N_NN സദാശിവന്‍/N_NNP ചേട്ടന്‍/N_NN ഒന്നുമറിയാത്ത/V_VM_VNF പോലെ/PSP എന്നെ/PR_PRP സ്കൂളില്‍/N_NN കൊണ്ട്/PSP വിട്ടു/V_VM_VF 
വഴിയില്‍/N_NN സൈക്കിള്‍/N_NN റിക്ഷയില്‍/N_NN ഇരുന്നു/V_VM_VNF ചേട്ടനും/N_NN ചേച്ചിയും/N_NN ഞാന്‍/PR_PRP കേള്‍ക്കാതെ/V_VM_VNF എന്തോ/DM_DMQ കുശുകുശുക്കുന്നുണ്ടായിരുന്നു/RD_ECH 
എന്നെപ്പറ്റി/N_NN എന്തോ/RB ആണ്/V_VM 
ചേട്ടന്റെ/N_NN മുഖം/N_NN കാണുമ്പോള്‍/V_VM_VNF അറിയാം/V_VM_VNF 
എന്തായാലും/CC_CCD റിക്ഷയില്‍/N_NN നിന്നും/PSP ഇറങ്ങി/V_VM_VF ഞാന്‍/PR_PRP നേരെ/RB എന്റെ/PR_PRF പഴയ/JJ ക്ലാസ്സില്‍/N_NN ‍/V_VM_VNF രണ്ടാം/QT_QTO ക്ലാസ്സില്‍/N_NN പോയി/V_VM_VF ഇരുന്നു/V_VM_VF 
ചെല്ലുമ്പോള്‍/V_VM_VNF ക്ലാസ്സില്‍/N_NN മൊത്തം/QT_QTF വേറെ/JJ ഏതോ/DM_DMR പിള്ളേര്‍/N_NN പേടിച്ചു/V_VM_VF കൂട്ടം/N_NN കൂട്ടമായി/RB ഇരിക്കുന്നു/V_VM_VF 
അറിയാവുന്ന/V_VM_VNF ആരും/N_NN ഇല്ല/RP_NEG 
ആയിക്കോട്ടെ/PR_PRP ,/RD_SYM ഞാന്‍/PR_PRP കരുതി/V_VM_VF 
ചിലപ്പോള്‍/CC_CCD മൂന്നാം/QT_QTO ക്ലാസ്സില്‍/N_NN ഇങ്ങനെയൊക്കെ/RB ആയിരിക്കും/V_VM_VNF കാര്യങ്ങള്‍/N_NN 
ലോകത്ത്/N_NN നമ്മുക്കറിയാത്ത/JJ ഒരുപാടു/N_NN കാര്യങ്ങള്‍/N_NN ഉണ്ടല്ലോ/V_VM_VNF 
ക്ലാസ്സില്‍/N_NN രെജിസ്റ്ററില്‍/RD_RDF നിന്നും/PSP പേര്/N_NN വിളിച്ചപ്പോള്‍/V_VM_VNF എന്റെ/PR_PRP പേര്‍/RP_RPD വിളിച്ചില്ല/RP_NEG 
സാധാരണ/JJ എന്റെ/PR_PRF പേര്‍/N_NN ആദ്യം/QT_QTF വരുന്നതാണ്/V_VAUX 
ഞാന്‍/PR_PRP ചെറുതായൊന്നു/V_VM_VF കൈ/N_NN പൊക്കി/V_VM_VNF ഒച്ച/N_NN പൊങ്ങാതെ/V_VM_VNF പറഞ്ഞു,/V_VM_VF 'ടീച്ചര്‍/N_NNP എന്റെ/PR_PRF പേരു/N_NN വിളിച്ചില്ല/V_VM_VF '/RD_PUNC ടീച്ചര്‍/N_NNP കണ്ണുയര്‍ത്തി/N_NN എന്നെ/RB നോക്കി/V_VM_VF 
പിന്നെ/CC_CCD ഒന്നും/RB മിണ്ടാതെ/V_VM_VNF താഴോട്ടു/V_VM_VF നോക്കി/V_VM_VNF എഴുത്ത്/N_NN തുടര്‍ന്നു/V_VM_VF 
ഞാന്‍/PR_PRP പതുക്കെ/RB തല/N_NN ചരിച്ചു/V_VM_VNF അങ്ങോട്ടും/DM_DMD ഇങ്ങോട്ടും/DM_DMD നോക്കി/V_VM_VF 
എന്റെ/PR_PRP വലതു/N_NST വശത്ത്/N_NN കരിക്കട്ട/N_NN പോലെ/PSP കറുത്ത/JJ ഒരു/QT_QTC കുട്ടി/N_NN ഇരുന്നു/V_VM_VNF നടരാജ്/N_NNP പെന്‍സിലിന്റെ/N_NN മൂട്/N_NN കടിച്ചു/V_VM_VNF തിന്നുന്നു/V_VM_VF 
ഇടതു/N_NST വശത്ത്/N_NN ഒരു/QT_QTC മൈ/N_NNP ഡിയര്‍/RD_RDF കുട്ടിച്ചാത്തന്‍/N_NNP സ്റ്റൈല്‍/RD_RDF മുടി/N_NN ചീകിയ/V_VM_VNF തടിയന്‍/N_NN ഷര്‍ട്ട്/V_VM_VNF ഒരു/QT_QTC കൈ/N_NN കൊണ്ടു/PSP പൊക്കി/V_VM_VNF മറ്റേ/JJ കൈ/N_NN കൊണ്ട്/PSP വയര്‍/N_NN ചൊറിയുന്നു/V_VM_VF 
'യൂ/N_NNP സ്റ്റാന്‍ഡ്/N_NN അപ്പ്/N_NN 
ടേക്ക്/N_NNP യുവര്‍/N_NNP ബാഗ്/N_NNP ആന്‍ഡ്/N_NNP വാട്ടര്‍/N_NN ബോട്ടില്‍/N_NN ആന്‍ഡ്/N_NNP കം/N_NN വിത്ത്/N_NN മി'/N_NN ടീച്ചര്‍/N_NN എന്റെ/PR_PRP അടുത്ത്/N_NST വന്നു/V_VM_VF പറഞ്ഞു/V_VM_VF 
എനിക്ക്/PR_PRP ഒന്നും/RB മനസിലായില്ല/V_VM_VF 
എന്തോ/RB പ്രശ്നമുണ്ട്/V_VAUX 
പ്രൈമറി/N_NN ടീച്ചര്‍മാര്‍/N_NNP വഴക്ക്/N_NN പറയുമ്പോഴാണ്/V_VAUX സാധാരണ/JJ ഇംഗ്ലീഷ്/N_NN പറയുക/V_VM_VINF 
മിഴിച്ചു/V_VM_VF നോക്കി/V_VM_VNF നില്‍ക്കുന്ന/V_VM_VNF എന്നോടായി/RB ടീച്ചര്‍/N_NN വീണ്ടും/RB പറഞ്ഞു/V_VM_VF 'കൊച്ചെ,/RD_PUNC ബാഗും/N_NN പാത്രങ്ങളുമെടുത്തു/N_NN എന്റെ/PR_PRP കൂടെ/PSP വാ/V_VM_VNF 
എന്ത്/DM_DMQ പറഞ്ഞാലും/V_VM_VNF ചുമ്മാ/CC_CCD മിഴിച്ചു/V_VM_VF നോക്കും/V_VM_VF '/RD_PUNC 
അങ്ങനെ/DM_DMD ആദ്യ/JJ ദിവസം/N_NN തന്നെ/RP_INTF ടീച്ചര്‍/N_NN എന്നെ/PR_PRP പിടിച്ചു/RB പുറകിലെ/V_VAUX ബെഞ്ചില്‍/N_NN കൊണ്ട്/PSP ചെന്നിരുത്തി/V_VM_VF 
ആ/DM_DMD ,/RD_SYM കൊള്ളാമല്ലോ/V_VM_VNF 
എനിക്കറിയാവുന്ന/PR_PRP പഴയ/JJ ക്ലാസ്സിലെ/N_NN മൂന്ന്/QT_QTC പേര്‍/N_NN ആ/DM_DMD ബെഞ്ചില്‍/N_NN ഉണ്ട്/V_VAUX 
എന്നാല്‍/CC_CCD എല്ലാരും/QT_QTF വിഷണ്ണരായി/RB ഇരിക്കുവാണ്/V_VAUX 
ആരും/PR_PRF ഒന്നും/RB മിണ്ടുന്നില്ല/RP_NEG 
ഞാന്‍/PR_PRP എല്ലാവരെയും/PR_PRP നോക്കി/V_VM_VNF ചിരിച്ചു/V_VM_VF 
എന്നാല്‍/CC_CCD ആരും/PR_PRP എന്നെ/PR_PRP നോക്കി/V_VM_VNF ചിരിച്ചില്ല/V_VM_VNF 
ഇങ്ങനെ/DM_DMD ഒന്നോ/QT_QTO രണ്ടോ/QT_QTO ആഴ്ച/N_NN പോയിക്കാണും/V_VM_VF 
ചിലപ്പോള്‍/RB മാതാപിതാക്കള്‍/N_NN പറഞ്ഞത്/V_VM_VNF കൊണ്ടാവണം/N_NN ,/RD_SYM എന്റെ/PR_PRP ചേച്ചിയും/N_NN ചേട്ടനും/N_NN ഇതേപ്പറ്റി/N_NN എന്നോട്/PR_PRP ഒന്നും/RB മിണ്ടിയില്ല/RP_NEG 
പക്ഷെ/CC_CCD എനിക്ക്/PR_PRP എവിടെയോ/DM_DMD എന്തോ/RB ഒരിത്/RB 
ക്ലാസ്സില്‍/N_NN ചോദ്യം/N_NN ചോദിക്കുന്ന/V_VM_VNF ടീച്ചര്‍മാര്‍/N_NN ഞങ്ങളുടെ/PR_PRP ബഞ്ചിനെ/N_NN മാത്രം/RP_RPD ഒഴിവാക്കും/V_VM_VNF 
ഞങ്ങളോട്/PR_PRP ചോദിക്കില്ല/RP_NEG 
സുഖമുള്ള/JJ ഏര്‍പ്പാട്/V_VM_VINF ആണെങ്കിലും/V_VM_VNF ഒരു/QT_QTC രണ്ടാനമ്മനയം/N_NN പോലെ/PSP 
പഴയ/JJ രണ്ടാം/QT_QTO ക്ലാസിലെ/N_NN കൂട്ടുകാരെ/N_NN ഒന്നും/RB കാണാനുമില്ല/RP_NEG 
അവരെല്ലാം/DM_DMD എവിടെ/DM_DMQ പോയി/V_VM_VF 
എന്തോ/DM_DMR ഒരു/QT_QTC പ്രശ്നമുണ്ട്/V_VAUX 
ടെക്സ്റ്റ്/RD_RDF ബുക്ക്/N_NN ഒക്കെ/PSP പഠിക്കുമ്പോള്‍/V_VM_VNF ഒരു/QT_QTC എളുപ്പം/V_VM_VNF 
പഴങ്ങളും/N_NN പച്ചക്കറികളും/N_NN ധാന്യങ്ങളും/N_NN മസാലയുമെല്ലാം/N_NN കേടാകാതെ/V_VM_VNF സൂക്ഷിക്കുന്നതിന്/V_VM_VNF സവിശേഷമായ/JJ രീതികളുണ്ട്/V_VAUX വീട്ടിലെ/N_NN ഭക്ഷണസാധനങ്ങള്‍/N_NN പലപ്പോഴും/RB കേടായിപ്പോകാറുണ്ട്/V_VAUX 
ഭക്ഷ്യവസ്തുക്കള്‍/N_NN സൂക്ഷിച്ചുവെക്കുന്നതിലെ/N_NN പോരായ്മകളാണ്/V_VAUX ഇതിന്/DM_DMD ഇടയാക്കുന്നത്/V_VM_VNF 
മഴക്കാലം/N_NN വന്നെത്തുന്നതോടെ/V_VM_VNF ഭക്ഷ്യവസ്തുക്കള്‍/N_NN കേടാകാന്‍/V_VM_VNF സാധ്യത/N_NN കൂടുതലുമാണ്/V_VAUX 
ഇവ/DM_DMD സൂക്ഷിക്കുന്നതില്‍/V_VM_VNF ശ്രദ്ധിച്ചാല്‍/V_VM_VNF ഈ/DM_DMD പ്രശ്നം/N_NN വലിയൊരു/JJ പരിധിവരെ/N_NN മറികടക്കാനാവും/V_VM_VF 
എളുപ്പത്തില്‍/RB കേടാകുന്ന/V_VM_VNF (/RD_SYM പെരിഷബ്ലെ/RD_RDF )/RD_SYM പഴങ്ങൾ/V_VM_VNF ,/DM_DMQ പച്ചക്കറികള്‍/N_NN പോലുള്ളവയ്ക്കും/V_VAUX കുറച്ചുനാള്‍/QT_QTF കേടുകൂടാതിരിക്കുന്ന/V_VM_VNF (/RD_SYM സെമി/N_NN പെരിഷബ്ലെ/N_NN )/RD_SYM ഭക്ഷണസാധനങ്ങള്‍ക്കും/N_NN കൂടുതല്‍/QT_QTF നാള്‍/N_NN കേടു/N_NN കൂടാതിരിക്കുന്ന/V_VM_VNF (/RD_SYM ണൊന്/N_NN പെരിഷബ്ലെ/RD_RDF )/RD_SYM ഭക്ഷ്യവസ്തുക്കള്‍ക്കും/N_NN സൂക്ഷിച്ചുവെക്കാന്‍/V_VM_VNF പ്രത്യേക/JJ രീതികള്‍/N_NN അവലംബിക്കേണ്ടതുണ്ട്/V_VAUX 
ഭക്ഷണസാധനങ്ങള്‍/N_NN കേടുകൂടാതെ/V_VM_VNF സൂക്ഷിച്ചുവെക്കാനുള്ള/V_VM_VNF ചില/JJ മാര്‍ഗങ്ങള്‍/N_NN 
പച്ചക്കറികൾ/N_NN :/RD_SYM കഴുകിത്തുടച്ച/JJ പച്ചക്കറികള്‍/N_NN ന്യൂസ്പേപ്പറില്‍/N_NN പൊതിഞ്ഞ്/V_VM_VNF വായുകടക്കാത്ത/JJ ബാഗിലാക്കി/N_NN ഫ്രിഡ്ജില്‍/N_NN സൂക്ഷിക്കുക/V_VM_VINF 
പഴവര്‍ഗങ്ങൾ/N_NN :/RD_SYM പഴവര്‍ഗങ്ങള്‍/N_NN ഒരിക്കലും/RB കൂടുതല്‍/QT_QTF അളവില്‍/N_NN വാങ്ങി/V_VM_VNF സൂക്ഷിക്കരുത്/RP_NEG 
കഴുകിത്തുടച്ച്/V_VM_VNF ജലാംശം/N_NN കളഞ്ഞ്/V_VM_VNF സൂക്ഷിക്കണം/V_VM_VF 
ധാന്യങ്ങൾ/N_NN :/RD_SYM മഴക്കാലത്ത്/N_NN അന്തരീക്ഷത്തിലെ/JJ ജലാംശം/N_NN കൂടുതലായതിനാല്‍/QT ധാന്യങ്ങളില്‍/N_NN കീടശല്യം/N_NN കൂടുതലായിരിക്കും/QT 
സൂക്ഷിച്ചുവെച്ച/JJ ധാന്യങ്ങള്‍/N_NN ആഴ്ചയില്‍/N_NN ഒരിക്കലെങ്കിലും/RB വെയില്‍/N_NN കൊള്ളിക്കാന്‍/V_VM_VNF ശ്രമിക്കുക/V_VM_VINF 
വായുകടക്കാത്ത/JJ പാത്രങ്ങളില്‍വേണം/N_NN ഇവ/DM_DMD സൂക്ഷിക്കാന്‍/V_VM_VNF 
ഒരു/QT_QTC ചെറിയ/JJ കഷണം/N_NN കര്‍പ്പൂരം/N_NN ഇട്ടുവെക്കുന്നത്/V_VM_VNF കീടങ്ങളെ/N_NN അകറ്റും/N_NN 
മസാല/N_NN :/RD_SYM ധാന്യങ്ങളെപ്പോലെത്തന്നെ/N_NN ഇവയിലും/DM_DMD കീടാക്രമണം/N_NN കൂടും/V_VM_VF 
വായുകടക്കാത്ത/JJ കുപ്പിയിലാക്കുന്നതിനുമുന്‍പ്/N_NN പാനില്‍/N_NN ഇട്ട്/V_VM_VNF ചെറുതായി/RB ചൂടാക്കിയശേഷം/V_VM_VNF സൂക്ഷിക്കുക/V_VM_VINF 
മസാലപ്പൊടി/N_NN ഒരിക്കലും/N_NN നനഞ്ഞ/JJ സ്പൂണ്‍/N_NN ഉപയോഗിച്ച്/V_VM_VNF എടുക്കരുത്/V_VM_VF 
ഉപ്പ്/N_NN ,/RD_PUNC പഞ്ചസാര/N_NN :/RD_PUNC ഇവ/DM_DMD മഴക്കാലത്ത്/N_NN അലിഞ്ഞുപോകാനുള്ള/JJ സാധ്യത/N_NN കൂടുതലാണ്/V_VAUX 
അലുമിനിയം/N_NN ,/RD_PUNC പ്ലാസ്റ്റിക്/JJ പാത്രങ്ങള്‍ക്ക്/N_NN പകരം/PSP വായുകടക്കാത്ത/JJ ഗ്ലാസ്/N_NN ജാറുകള്‍/N_NN ഉപയോഗിക്കുക/V_VM_VINF 
കുറച്ച്/QT_QTF പച്ചരിമണികള്‍/N_NN ഇട്ടുവെക്കുന്നത്/V_VM_VNF ജലാംശം/N_NN വലിച്ചെടുക്കും/V_VM_VF 
ആരോഗ്യമാസികയില്‍/N_NN പ്രസിദ്ധീകരിച്ചത്/V_VM_VNF 
