തിനുള്ള ശക്തിയുണ്ടാകുമെന്നും, എന്നാൽ ആ ഭൂമിക്കു മുകളിലോ താഴേയോ ഉള്ളവരെ അവർ
കിഴവൻ:എന്റെ അങ്ങുന്നേ! അഞ്ചുമൈൽ ദൂരെയാണു് ചക്ര:കൊള്ളാം. നമുക്കു് അങ്ങോട്ടു പോയി
പ്രകൃതനാടകത്തിൽ നായികാനായകന്മാരുടെ പരസ്പരരതി പരിപോഷത്തെ ക്രമേണ വർണ്ണിച്ച് ഈ
 കള്ള കക്കുന്നതും, ഇൻസ്പെക്ടർ അന്വേഷണം നടത്തുന്നതും,പോലീസുകാരൻ അറസ്റ്റു
പൊണ്ണച്ചാരാണെന്നു മുമ്പെ പറഞ്ഞിട്ടുണ്ടല്ലൊ. എന്നാൽ വൈത്തിപ്പട്ടരു പറഞ്ഞതുപോലെ
പുൽമേടുകൾ നിർവചനം: ഗ്രാമിനോയിഡുകൾ, ഫോർബുകൾ എന്നിങ്ങനെയുള്ള പുൽച്ചെടി
ചിന്തിക്കാതെ, മാറ്റാനെക്കണ്ടപ്പോഴെ മണ്ടിയങ്ങൊളിച്ചഹോ മറ്റൊരു ദിക്കിൽപ്പോകും
ബൗദ്ധവിഹാരങ്ങളുടെ ഒരു പ്രത്യേകഛിഹ്നമായി കാണുന്ന 'സ്തൂപം' ബൗദ്ധന്മാരുടെ
കണ്ണൻകട്ടി-ശ്ലോ 152 നല്ലാരിൽമുത്തിനുടെ മാറ്റലരെപ്പുകഴ്ത്തും ചൊല്ലാലെ നെയ്യു
തിരുമേനി(സ)ക്ക് ഒരു പായയുണ്ടായിരുന്നു. പകലിൽ അത് താഴെ വിരിക്കും. രാത്രി അത്
ആത്മനേത്രങ്ങൾ ദർശിച്ച വിശ്വാവസാനമൂർത്തിയെ മനസാ പ്രണാമം ചെയ്യുന്ന നാട്യത്തിൽ ഭട്ടൻ
സൃഷ്ടിച്ചിരിക്കുന്നു 2 ഫലകം: താൾ സൃഷ്ടിച്ചിരിക്കുന്നു ഫലകം: താൾ
(ബുഖാരി. 3. 32. 237) 5) ഇബ്നുഅബ്ബാസ്(റ) നിവേദനം: നബി(സ) അരുളി: ലൈലത്തുൽ ഖദ്റിനെ
മക്കൾക്കും അവകാശപ്പെട്ടതാക്കി; സംബന്ധം നിയമപരമായ വിവാഹമായി അംഗീകരിച്ചു; 1918ലെ
അവിദ്യയും മായയും ഒന്നാണെന്നു വേദാന്തി കളിൽ തന്നെ ചില ആചാര്യന്മാർ
ചെറുപ്പമായിരുന്നെങ്കിലും ദീനവും പട്ടിണിയുംകൊണ്ടു് അവളുടെ മുഖം വളരെ വിളറിയും,
ഭോജരാജാവെഴുന്നേറ്റ് കാളി ദാസനെ ആലിംഗനം ചെയ്തു. പിന്നെ അവർ രണ്ടുപേരും സസന്തോഷം
നീക്കുവാൻ ദണ്ഡകാരണ്യകം തന്നിൽ വസിച്ചിത- ച്ചണ്ഡകോദണ്ഡം ധരിച്ചങ്ങതിലതിൽ പത്തുമാസം
സനാതനമ ഇതിഹാസമ ഇമം ചക്രേ പുണ്യം സത്യവതീ സുതഃ 53 പരാശരാത്മജൊ വിദ്വാന ബരഹ്മർഷിഃ
പാർത്ഥാത്മജനിത്ഥമരുൾചെയ്തപ്പോൾ പാർത്ഥി താൾ 16057 താൾ: 1917. 67 തെറ്റുതിരുത്തൽ
നേര ത്തിങ്കലപ്പോൾ. ഇടുപടിതോരണം ഓടിക്കടന്നു അച്ചാലും അവ്വര ങ്കം കടന്നു
പി നാടകേ ഏഷ ഗീതവിധാനേ തു സുകുമാരേ വിധിർഭവേത് 320 ശൃംഗാരരസസംഭൂതോ രതിസംഭോഗഖേദനഃ
കഴിഞ്ഞവ */ 2014 താൾ: 1914. 67 2014 താൾ: 1877. 55 43 അകാരാന്തം സ്ത്രീലിംഗം ദർല്ലഭം
പ്രകടിപ്പിക്കുന്ന ആശയങ്ങൾ കാലാന്തരത്തിൽ ശരിപ്പെട്ടുവരുന്നതിന്നു് ദൃഷ്ടാന്തങ്ങൾ
നടന്നിട്ടില്ലാത്തവ */ '520 അശ്വമേധം എന്നെയുംകൊണ്ടെഴുന്നള്ളിയെത്ത താൾ താൾ: 2 11
എന്ന താൾ വിക്കിഗ്രന്ഥശാല: 2014 1913 വർഗ്ഗം: 2014 036 സൂചിക: 1913. ഇൻഡ്യയിലെ
വായിച്ചിട്ട്) എന്ത്? സമുദ്രവ്യാപാരികളുടെ നായകനായ ധനമിത്രൻ കപ്പൽച്ചേതത്തിൽ
ഹസിതാംശുലസന്മുഖീം 79.11 വിവിധനർമഭിരേവമഹർനിശം പ്രമദമാകലയൻപുനരേകദാ ഋജുമതേഃ കില
പ്രശ്നംവെപ്പിച്ചു നോക്കി. സ്ത്രീയുടെ മരണത്തിനുള്ള കാരണം ഭഗവതിയുടെ കോപമാണെന്നു
പരിസ്ഥിതി അതോറിട്ടിയുടെ അതിർത്തി വ്യക്തമായി കാണിച്ചിരിക്കണം. തന്മൂലം
പാദേ സ്രഗ്ധരാ നാമ സാ യഥാ 129 മ്രൗ മ്നൗ യൗ യശ്ച സമ്യഗ്യദി ഹി വിരചിതാഃ
ദുരഹങ്കൃത്യാ ഭാവാത്സന്ത്യക്തയാ ചിരം. ശിഷ്ടാഹങ്കാരവാഞ്ജന്തുഃ ശമവാന്യാതി മുക്തതാം
നടത്തിയിരുന്നത്. (ബുഖാരി. 3. 34. 353) 51) അബൂസഈദ്(റ) പറയുന്നു: നബി(സ) മുനാബദത്തു
സബലോ ക്രൂരരഥേന നിർഗതോ ഭൂഃ 73.6 അനസാ ബഹുലേന വല്ലവാനാം മനസാ ചനുഗതോ ഥ വല്ലഭാനാം
യോഗ്യമായിത്തീർന്നു മഞ്ജീരേ പദയോർന്നിധായ, രുചിരാം വിന്യസ്യ കാഞ്ചീം കട,
ചന്ദ്രസൂര്യവിരാജിതം ജാജ്വല്യമാനം തേജോഭിഃ പാവകാർക സമപ്രഭൈഃ പശ്യാമി ച മഹീം രാജൻ
മേലെഴുത്ത് അടിക്കുറിപ്പ് കുലസ്ത്രീയും' 'ചന്തപ്പെണ്ണും' ഉണ്ടായതെങ്ങനെ?/ആമുഖം ജെ.
കഴുകിത്തുടച്ചു കൊണ്ടുവന്നു. ശേഷമുള്ള ആലിലകളോടു കൂട്ടിച്ചേർത്തു നോക്കിയപ്പോൾ
മാമേതി ന സംശയഃ 36 അഹിരിവ ജനയോഗം സർവദാ വർജയേദ്യഃ കുണപമിവ സുനാരീം ത്യക്തുകാമോ
ബലിപെരുന്നാൾ ദിവസവും ബാങ്കു വിളിക്കാറുണ്ടായിരുന്നില്ല. ജാബിർ(റ) നിവേദനം: നബി(സ)
ഊട്ടാനുള്ള പാചകകർമ്മത്തെ ലക്ഷീകരിക്കുന്നു എന്ന് ആശാനു ബോദ്ധ്യമായി.
പുഷ്പം(100) കുംഭം 25 പൂരുരുട്ടാതി പൂർവഭാദ്രപദം 2) മർക്കാബ് കുംഭം-മീനം 26
മറ്റൊന്നിലേക്ക് എന്നിങ്ങനെ അനുക്രമം ചാടി ദൂരത്തു വാങ്ങിക്കളയുന്നു. സരസ്സിൽ വീണു
 കോശത്തിനും ഒരു പരിധിവരെ മാത്രമേ വളരാൻ കഴിയുകയുള്ളു. അതു കഴിഞ്ഞാൽ പിന്നെ
1877. 24 1877. 25 1877. 26 1877. 27 1877. 28 1877. 29 1877. 30 1877. 31 1877. 32
അവരെക്കൊണ്ട് ചെയ്യിച്ചത് എന്തിനായിട്ട്? ഈ പവിത്രാത്മാവ് ക്രിസ്തുവിനെ ദോഷരഹിത
2014 താൾ: 1896. 149 2014 പ്രമാണം: 1947. 2014 വർഗ്ഗം: 2014 താൾ: 1907.
വിജയത്തിന്റെ പിൻപേ നിർവ്വാണമണ്ഡലം/മുന്നോട്ടു പോവുക മുന്നോട്ടു പോവുക
അശ്വത്തിൽനിന്ന് ത്രിവിക്രമൻ താഴത്തിറങ്ങുന്നതു കണ്ടപ്പോൾ, പാണ്ട ത്രൈലോക്യനാഥത്വം
അവകാശം എന്താണെന്ന് അവർ ചോദിച്ചു. നബി(സ) പ്രത്യുത്തരം നൽകി. കണ്ണിനെ
തന്നെ, ശബ്ബത്തിൻ തലനാൾ ആകുന്ന വെള്ളിയാഴ്ചയാക കൊണ്ടു, തനിക്കുതാൻപോരുന്ന മന്ത്രിയും
ങ്ങിരിക്കുന്ന കൈവർത്തകന്മാരാദിയായ് ഒരുമിച്ചുകൂടിപ്പുറപ്പെട്ടുവേഗം ഭരതന്റെ
ഇരുപത്തിമൂന്ന് അദ്ധ്യായം ഇരുപത്തിമൂന്ന് അദ്ധ്യായം ഇരുപത്തിരണ്ട് അദ്ധ്യായം
 കാണുക. മൊത്തം സർവ്വെ ചെയ്‌ത വീട്ടുകാരിൽ 50ശതമാനം ഖനനംകൊണ്ട്‌ ഗ്രാമത്തിന്‌ യാ ൊരു
(ചട്ടമ്പിസ്വാമികൾ യെന്നും പറയും. ഈ വൈഖരി തന്നെ വേദവേദാംഗാദി സകലശാസ്ത്രങ്ങളായും
ഗോളാകൃതി പോയി, നീണ്ട് അണ്ഡാകാരത്തിലായിത്തീർന്നു. പിന്നീട് അതു കൂടുതൽ
തിരഞ്ഞെടുത്ത ഹദീസുകൾ ആയിശ:(റ) നിവേദനം: ഒരു പെരുന്നാൾ ദിവസം നബി(സ) എന്റെയടുക്കൽ
ചേതനാ യുക്തഃ കാമാത് കോലാഹലഃ കില 33 ഗിരിം കോലാഹലം തം തു പദാ വസുർ അതാഡയത്
ലക്ഷ്യപ്പെടുത്താകുന്നതല്ല ആകയാൽ വാക്കുകൾ വസ്തുക്കളുടെ
*/ താൾ: 54 ബിപിൻ താൾ: 65 ബിപിൻ തെറ്റുതിരുത്തൽ വായന കഴിഞ്ഞവ */ താൾ: 55 ബിപിൻ
അഗർവാളിന്റെ 1994) എന്നീ പുസ്തകങ്ങൾ പ്രധാനപ്പെട്ടവയാണ്. 19-ാം നൂറ്റാണ്ടിൽ
ഉമ്മുസലമ(റ) നിവേദനം: ഒരു സ്ത്രീയുടെ ഭർത്താവ് മരണപ്പെട്ടു. അപ്പോൾ ആ സ്ത്രീയുടെ
കെട്ടുവള്ളങ്ങളിലാക്കിക്കൊണ്ട് ആഘോഷസമേതം കാട്ടുരു നിന്നു പുറപ്പെടു. ഏതാനും വഴി
അന്യോന്യം അഭിജഘ്നതുഃ 42 തൗ വ്യവാഹരതാം ശൂരൗ സംരബ്ധൗ രണശോഭിനൗ ഉദീരയന്തൗ സമരേ