താല്പര്യം സൂചിപ്പിക്കുന്ന ഫലകങ്ങൾ പുസ്തകപ്രേമി ഫലകം: 000000 1 14 40 1.25
ഊഹിപ്പാൻ തക്ക ലോകപരിചയം സിദ്ധിച്ചിട്ടുള്ളവർ, സാഹസികസ്വഭാവം പ്രദർശിപ്പിക്കുമ്പോൾ,
ബ്രഹ്മലോകേ ഗമിയ്ക്കുന്നതുകാൺക നീ എന്നു മുനീശ്വരൻ ചൊല്ലി വിശുദ്ധനായ് മന്നവൻ കാൺകവേ
തു പ്രവക്ഷ്യാമി പ്രയോഗം കരണാശ്രയം ഹസ്തപാദപ്രചാരശ്ച യഥാ യോജ്യഃ പ്രയോക്തൃഭിഃ 28
താൾ:വൃത്താന്തപത്രപ്രവർത്തനം. 17 തെറ്റുതിരുത്തൽ വായന കഴിഞ്ഞവ */
ഇതുപോലുള്ളൊരു മാറ്റം സംഭവിച്ചു എന്ന് പറക വയ്യ. ബ്രിട്ടീഷുകാരുടെ കോളനി വാഴ്ചയും
മുണ് താൾ 41016 താൾ: 1921. 361 തെറ്റുതിരുത്തൽ വായന നടന്നിട്ടില്ലാത്തവ */
ആവർത്തിയേയും വർദ്ധിപ്പിക്കാം. അപ്പോൾ നിങ്ങൾക്ക് അങ്ങനെ ചെയ്യുവാൻ
അവിടെ അപ്പോൾ അന്തർജ്ജനത്തിനു ഗർഭമുണ്ടോ ഇല്ലയോ എന്നു സംശയിച്ചിരിക്കുകയായിരുന്നു.
ത്യ്രകത്വത്തെക്കുറിച്ചു വിചാരിച്ചതിലും ദൈവലക്ഷണമില്ലെന്നു
467 ഉടയൊനുടച്ചാൽ ഓട്ടിനും കൊള്ളാം- 468 ഉടയോനെപിടിച്ചു കെട്ടുന്നകാലം- 469
റേച്ചൽ കാർസന്റെ ശാസ്‌ത്രീയ പ്രവചനങ്ങൾ സത്യമായി ഭവിക്കുകയും ലോകമെമ്പാടുമുള്ള ജന
പ്രയോഗേ ച സുഖാശ്രയം കലാഭ്യാസാശ്രയം ചൈവ പാഠ്യം വേശ്യാസു സംസ്കൃതം 42
യദാശ്രൗഷം തരിദിവസ്ഥം ധനഞ്ജയം; ശക്രാത സാക്ഷാദ ദിവ്യമ അസ്ത്രം യഥാവത അധീയാനം ശംസിതം
വ്യരാജതാമലം ചൈവ നഭോ വൈഡൂര്യ സംനിഭം 54 അത്യദ്ഭുതാനി തേ ദൃഷ്ട്വാ വാസുദേവ പുരോഗമാഃ
 അതുകളിലെ പാചകകർ ്മങ്ങൾക്കിടയിൽ പൊങ്ങുന്ന ധൂമശിഖകൾ ആ നദീതലം അന്നത്തേക്കു
കല്പിക്കേണമേ! കരൾ കത്തുന്നു കൃപാനിധേ! മൽപ്രാണത്തിടമ്പുണ്ണി മരിച്ചുപോയില്ലല്ലീ?
ക്ഷേത്രത്തിലേക്ക് എൺപതു നാഴിക ദൂരമുണ്ട്. ഇത്രയും ദൂരം പത്തുനാഴിക കൊണ്ട് ഈ ആന
*/ '672 രസികരഞ്ജിനി [പുസ്തകം ൩ തരുണഭാസ്കരബിംബമൊര താൾ 28022 താൾ: 1925. 241
നിങ്ങൾ റമളാനിലെ ഒടുവിലെ പത്തിൽ അന്വേഷിക്കുക. അതായത് ഒമ്പതു അവശേഷിക്കുമ്പോൾ, ഏഴ്
61 തെറ്റുതിരുത്തൽ വായന നടന്നിട്ടില്ലാത്തവ */ ' ആരണ്യകാണ്ഡം ൪൭ യാകുകയും ചെയ്തു.
ഏഷ വഃ പുണ്യഃ സുകൃതോ ബ്രഹ്മലോകഃ പ്ലവാ ഹ്യേതേ അദൃഢാ യജ്ഞരൂപാ അഷ്ടാദശോക്തമവരം യേഷു
മാത്രമായിരുന്നു. ഇബ്നുഅബ്ബാസ്, ജാബിർ(റ) എന്നിവർ പറയുന്നു: ചെറിയപെരുന്നാൾ ദിവസവും
സാമം, അൗർെവ്വം ഈ നാലു വേദങ്ങളുടെയും സാരസർവസ്വങ്ങളത്രേ. അവ 'പ്രജ്ഞാനം ബ്രഹ്മ' 'അഹം
തമ്മിൽ ഉള്ള ഭേദത്തെ എളുപ്പത്തിൽ അറിവാൻ തക്ക കണക്കുകൾ ശേഖരിക്കണം. ആയതു
നിർമ്മിക്കപ്പെട്ടതെന്നും, മറ്റും പറയുമെന്നും അന്യഭാഷകളെല്ലാം 30 മ്ലേഛ (മ്ലേഛ
കൊടുത്തിട്ടും അർജ്ജുനൻ പ്രശ്നം നേരിട്ടപ്പോൾ സ്വയം യമലോകത്തും ബ്രഹ്മലോകത്തും
ഭൂത്വാ പ്രവ്രജേദ്യദിവേതരതഥാ ബ്രഹ്മചര്യാദേവ പ്രവ്രജേദ്ഗൃഹാദ്വാ വനാദ്വാഥ പുനരവ്രതീ
മമസംസ്കാരമിന്നു നീ ചെയ്കിലോവാക്കിനാൽ ചെയ്‌വനുപകാരം എന്നതുകേട്ടപോതോതിനാൻ രാഘവൻ
തന്നെയോ ഇല്ലെന്നുവരികിലും അവിടെയുള്ള ജനങ്ങൾക്കു് ഒരുമാതിരിയിൽ കഴിഞ്ഞുകൂടാമെന്നു
മഹമ്മദീയസൈന്യത്തിന്റെ നിഷ്ഠുരതകൾ സഹിക്കാൻപാടില്ലാഞ്ഞ് തിരുവിതാകൂറിലേക്കുണ്ടായ
തദ്വദ്ബ്രഹ്മണി ജീവത്വം വീക്ഷമാണേ വിനശ്യതി 13 യഥാ മൃദി ഘടോ നാമ കനകേ കുണ്ഡലാഭിധാ.
യുദ്ധകാണ്ഡം ൨൬൧ പോലെ ഇരിക്കണം.താനും താൾ 28022 താൾ: 1907. 48 ൪൪ കാശീമാഹാത്മ്യം
രാമായണം (കുറത്തിപ്പാട്ട് താൾ:രാമായണം (കുറത്തിപ്പാട്ട് താൾ:രാമായണം
2014 താൾ: 1922. 108 താൾ: 1863. 98 തെറ്റുതിരുത്തൽ വായന കഴിഞ്ഞവ */ 2014 താൾ: 1922.
'ഹലന്തപുല്ലിംഗപ്രകരണം കാരത്തിന്നു തകാരവും വ താൾ 19094 താൾ: 1 1908. 261
പറഞ്ഞിട്ടുള്ളതുന്നു വിരുദ്ധങ്ങളായ പ്രയോഗങ്ങൾ പ്രകൃതപുസ്തകത്തിൽ ഇല്ലെന്നു
യദ്യദ്വേദേഷു നിർണയം 88 സർവോപനിഷദാം ഭാവം സർവം ശശവിഷാണവത്. ദേഹോഽഹമിതി സങ്കൽപം
താൾ:ജ്യോതിഷവും ജ്യോതിശ്ശാസ്ത്രവും. 23 പ്രമാണം: 3. 150 നിഴൽഘടികാരം ഉപയോഗിച്ച്
വിജ്ഞാനമേവാപ്യേതി തദമൃതമഭയമശോകമനന്തനിർബീജമേവാപ്യേതീതി ഹോവാച ബുദ്ധിമേവാപ്യേതി യോ
ഭഞ്ജിക്കയാലതിപ്രീതനായ്‌വന്നിതോ. അതികത്തിനമസഹതരമാമിതുചെയ്കയാ-
തഥാ ദന്തി സഹസ്രം ച ഹയാനാം അയുതം പുനഃ ശിക്ഷാ ബലേന നിഹതം പിത്രാ തവ വിശാം പതേ 24 തതഃ
ആത്മാനാത്മലോകങ്ങൾ രണ്ടിലും ഒന്നുപോലെ രൂഡമൂലങ്ങളുമായ വൈദഗ്ദ്ധീസത്ഭാവാദികളെ
ഉണ്ടായ വെള്ളപ്പൊക്കം നിമിത്തം പ്രസ്തുതപട്ടണത്തിന്റെ എതിർക്കരയിലുള്ള ഗ്രാമത്തിലെ
പുരുഷന്മാർക്കും ഈ നാമം ബാധകമായിരുന്നു - പലപ്പോഴും മൂത്ത തമ്പുരാട്ടിയെന്നല്ല,
 അടച്ചൂററി (ഊററുക) അടപ്പു, അടവാകും കലം അടെപ്പു, അടപ്പു 1. കല്ലടപ്പു ഒച്ചയടപ്പു
മാത്രമെ ഭൂതങ്ങൾ പെടുന്നുള്ളൂ. ഭൂതങ്ങൾ മിക്കവാറും സ്ഥൂലശരീരത്തിന്റെ സഹായംകൊണ്ട
ക്കൈത്തലചെമ്പല്ലവം നൊന്തിടുന്നുണ്ടാം വിഭോ! ആയതിൻ കിലുക്കം ഞാൻ
 995. 369. 1711. 370. 724. 371. 620. 372. 38, 1553,1856. 373. 1553. 374. 1475,
പ്രകാശം അല്ലെങ്കിൽ അപ്രകാശം; ഉഷണം അല്ലെങ്കിൽ ശീതം ഇവകളും ഇരിക്കയാൽ ക്രമത്തിനു
ഏതദ്വിദുരമൃതാസ്തേ ഭവന്തി 2 ഭയാദസ്യാഗ്നിസ്തപതി ഭയാത്തപതി സൂര്യഃ. ഭയാദിന്ദ്രശ്ച
ദുർബ്ബലമാക്കൽ ഉദ്ദേശിച്ചതു അല്ലാഹു ദുർബ്ബലമാക്കി. അങ്ങനെ പുരുഷന് സ്ത്രീയുടെ
കൂടിയാട്ടവും മറ്റും ചിലപ്പോൾ മുട്ടാനിടവരുകയാൽ അവ മുട്ടാതെ നടത്തുന്നതിലേക്കു
തെറ്റുതിരുത്തൽ വായന നടന്നിട്ടില്ലാത്തവ */ ' കിളിപ്പാട്ട് 259
ദേവാതിഥിഃ 22 ദേവാതിഥിഃ ഖലു വൈദേഹീം ഉപയേമേ മര്യാദാം നാമ തസ്യാം അസ്യ ജജ്ഞേ ഋചഃ 23
മയ്യിത്ത് കട്ടിലിൽ വെച്ച് പുരുഷന്മാർ അത് ചുമലിലേറ്റി പുറപ്പെട്ടാൽ സുകൃതം ചെയ്ത
ഉദാഹരണം കൽ+കുറിതു=കർകുറിതു; മുൾ+കുറിതു=മുട്കുറിതു; കൽ+ഞരെിന്തത്=കൻഞരെിന്തത്;
സാഹിത്യ വിമർശകനായിരുന്നു. മലയാളത്തിൽ പുരോഗമന സാഹിത്യ പ്രസ്ഥാനത്തിനു തുടക്കം
പക്ഷം. സ്ത്രീയെയും സൗമ്യമായി ഭരിക്കാൻ അവൾക്കുള്ള കഴിവിനെയും കുടുംബത്തിന്റെ
പ്രാപ്തിയുണ്ടായിരിക്കണം. ചുരുക്കെഴുത്തു സമ്പ്രദായപ്രകാരമാകട്ടെ, ഓർമ്മശക്തി
മഹത് തവ 15 ഇത്യ് അഹം തസ്യ വചനം ശ്രുത്വാ പരമദുർമനാഃ നിശ്ചയം നാധിഗച്ഛാമി
അടുക്കലേക്ക് ആളയച്ചു. നബി(സ) യാകട്ടെ പുത്രിക്ക് സലാം പറഞ്ഞുകൊണ്ട് ഇപ്രകാരം
തീർന്നിരിക്കുന്നു. ഹസ്താസ്ഥികളെ പിണച്ചും കരതലങ്ങളെ സ്കന്ധങ്ങളോടു ചേർത്തും
നാഗാനാം തീർഥം ഉത്തമം അഗ്നിഷ്ടോമം അവാപ്നോതി നാഗലോകം ച വിന്ദതി 13 തതോ ഗച്ഛേത ധർമജ്ഞ