ഇരിക്കുന്ന ശൂദ്രനെ മാത്രമേ അധികരിക്കുന്നുള്ളു. 'സംവർഗ്ഗവിദ്യ' അർത്ഥവാദഘട്ടത്തിലാക
ഏറ്റവും വലിയ പാപം ഏതാണെന്ന് ഞാൻ നിങ്ങൾക്ക് പറഞ്ഞു തരട്ടെയോ? ഇപ്രകാരം മൂന്ന്
08274-249156 മൊ.:+91 9902273468 ഡിപ്പാർട്ടുമെന്റ്‌ ഓഫ്‌ ഫോറസ്റ്റ്‌ ബയോളജി ആന്റ്‌
അല്പസ്വല്പം മാറ്റം കണ്ടുതുടങ്ങിയത്. സി.എസ്. ചന്ദ്രികയുടെ കേരളത്തിലെ
ശ്രിയമാവഹ ലോമശാം പശുഭിഃ സഹ സ്വാഹാ ആ മാ യന്തു ബ്രഹ്മചാരിണഃ സ്വാഹാ വി മാഽഽയന്തു
അദ്ദേഹത്തോട് ചോദിച്ചു. അദ്ദേഹം പറഞ്ഞു. നബിയുടെ അൻഫഖ്തു (താടിക്കും ചുണ്ടിനും
അരുളി: നമ്മുടെ ഈ ജോലികളിൽ അതാവശ്യപ്പെട്ടുകൊണ്ടു വന്നവരെ നാം നിയമിക്കുകയില്ല.
വിധിച്ചുകൊണ്ട്, സ്വഭവനത്തിലേക്കു മടങ്ങുന്നതിനായി അദ്ദേഹം ആരംഭിച്ചു.
ലീലാങ്കണം/'നാട്ടിന്‌' നാട്ടിന് ലീലാങ്കണം/ഒരു പുൽക്കൊടിയുടെ പ്രേമഗാനം ഒരു
വസ്ത്രത്തിൽ കുട്ടിയെ കിടത്തി ചുമലിൽ കൂടി ഞാന്നുകിടക്കത്തക്കവണ്ണം അതിന്റെ
'ശുക്രനീതിയി, മിശ്രധാതുക്കളെ വേർതിരിക്കുവാനും ക്ഷാരം കളഞ്ഞു ധാതുക്കൾക്കു ശുദ്ധി
ചേത്ത്വാ. ജീവിഷ്യാമോ യാവദീശിഷ്യസി ത്വം വരസ്തു മേ വരണീയഃ സ ഏവ 27
ഉണ്ടാകാനെളുപ്പ മെന്ന് ഈ പ്രകൃതം കൊണ്ടു വ്യക്തമാകുന്നു. അപ്പോൾ എന്നു
അഞ്ചു ഉപാധികളോടു ചേർന്നിരിക്കുന്ന സൂക്ഷ്മശരീരവും അതിനെ അഭിമാനിക്കുന്ന
ഉപയോക്താവ്: കണ്ണൻ ഷൺമുഖം പൂർത്തിയായി 33 സ്വരരാഗസുധകവിതാസമാഹാരം) ഉപയോക്താവ്: മനോജ്
പ്രാച്ഛാദയത് തം ഇഷുഭിർ മഹാമേഘ ഇവാചലം 60 ശകുനിഃ പ്രതിവിന്ധ്യം തു പരാക്രാന്തം
ചുവന്നിരിക്കുന്ന മാമ്പഴങ്ങൾ. രംഭാഫലങ്ങൾ - കദളിപ്പഴങ്ങൾ.
തിരുവിതാംകൂർ സർക്കാർ വകയായതിന്റെ ശേഷവും അവിടെ മങ്ങാട്ടുഭട്ടതിരിയുടെ
അതുവരെയിരിക്കുന്നെങ്കിൽ വരുന്നോൾക്കാണാം. അതിലെയ്ക്കത്യാഗ്രമുണ്ടെന്നുള്ളതു
ഋൡ ക്കൾ കൃതിമമായി പാണിനിമുനി ഇടക്കു തിരിക്കിക്കേറ്റിയതാണെന്ന് അനവധി
മഴയുണ്ടാകും- 1355. ചെമ്മാനംകണ്ടാലന്നു മഴപെയ്തില്ലെങ്കിൽ പിന്നക്കൊല്ലം പെയ്തില്ല-
അപരിഷ്കൃതമായിക്കിടക്കുന്ന ഉൾനാട്ടിലേയ്ക്കും, ക്ഷാമനെ ആണ്ടമാൻ ദ്വീപിലേയ്ക്കും
പ്രത്യുത്തരം നൽകി. നബി(സ) അയാൾക്ക് തന്നെ ആദ്യം കൊടുത്തു. (ബുഖാരി. 3. 40. 541) 2)
വല്ലതുമൊന്നു ചെയ്യുകയോ പറയുകയോ ചെയ്തിട്ട് ഉടനെ മടങ്ങിപ്പോരും. അങ്ങനെയാണു പതിവ്.
പുരാണകഥകളിലും മറ്റും അവതാരികയ്ക്കാവശ്യം കാണും. ആഖ്യായികകളും നാടകങ്ങളും അവതാരിക
ത്വത്പീതപൂതസ്തനതച്ഛരീരാത്സമുച്ചലന്നുച്ചതരോ ഹി ധൂമഃ ശങ്കാമധാദാഗരവഃ കിമേഷു കിം
വർഗ്ഗം:മലയാളനാടകങ്ങൾ നാടകം വർഗ്ഗം:നാടകം താൾ:ജ്യോതിഷവും ജ്യോതിശ്ശാസ്ത്രവും. 123
കൊല്ലപ്പെടുന്നു എന്നു ഭാഷാപ്രയോഗത്തിൽനിന്നും വാസ്തവത്തിൽ ജനിക്കുന്ന ബോധം
ത്വലാഖ് ചൊല്ലിയിരുന്നുവെങ്കിൽ എനിക്കവൾ നിഷിദ്ധമാകുമായിരുന്നു. മറ്റൊരാൾ വിവാഹം
 കേൾക്കുന്നതിനായി പ യി. പിറ്റെ ദിവസം യാത്രക്കാർ അവിടെ നിന്നും യാത്ര തിരിച്ചു. 8
പ്രസിദ്ധീകരിച്ചു എന്നു പറയുന്നത് ശ്രീ നിത്യചൈതന്യയതിയുടെ ആമുഖത്തോടുകൂടിയുള്ളതാണ്
മധികാരിണാമനധികാരിണാം ഭക്തിയോഗ ഏവ പ്രശസ്യതേ. ഭക്തിയോഗോ നിരുപദ്രവഃ.
വിളിക്കുന്നത. സൎക്കാരറിക്കാട്ടിൽ കണക്കപ്പിള്ള എന്ന കാണും. മലയാളത്തിലെ അംശം മേനോൻ
സംസ്ഥാനം പശ്ചിമഘട്ടത്തിലെജില്ലകൾ മേഖല ഒന്നിൽ പെടുന്നവ മേഖല രണ്ടിൽ പെടുന്നവ
മിഥ്യാജ്ഞാനേ സഹേതുകേ. നേതി നേതീതി രൂപത്വാദശരീരോ ഭവത്യയം 68 ശാസ്ത്രേണ ന
സർവത്ര പശ്യന്തി ചതുർഥീം ഭൂമികാം ഗതാഃ 30 അദ്വൈതേ സ്ഥൈര്യമായാതേ ദ്വൈതേ ച പ്രശമം ഗതേ
അകാരത്തിനു ദീർഘം വന്നു ഭവിഷ്+യ+ആ+മി=ഭവിഷ്യാമി എന്നും, ഉത്തമ പുരുഷദ്വിവചനത്തിൽ വസ്
മാർക്സിസത്തിനെതിരായി പ്രയോജനപ്പെടുത്തുന്നതിൽ അതീവ തല്പരരായ ശാസ്ത്രജ്ഞന്മാരിൽ
യാക്കോബിന്റെ അമ്മയായ മറിയാളും സാളമെ എന്നവളും (മൂന്നുപേർ) കല്ലറയ്ക്കുപോയി.
ജാഗ്രത്സ്വപ്നസുഷുപ്തികളും നീയല്ല. അല്ലയോ പ്രിയശിഷ്യ! സ്ഥൂലശരീരമായ ജാഗ്രദവസ്ഥ
സ്വജാതിനാമത്തോടു ചേർക്കുന്ന കാര്യത്തിൽ പലർക്കും വെറുപ്പുതന്നെ. ശ്രവണ
രണ്ടും സുഷുപ്തിയിൽ മറയുന്നതായും അനന്തരം ഉണരു മ്പോൾ പ്രപഞ്ചം ഉദിക്കുന്നതായും
പൊതുധനം അപഹരിക്കുന്നുവെന്നും അദ്ദേഹത്തിന്റെ പേരിൽ ആക്ഷേപം
മന്യഥാസംഭവിക്കെന്നതില്ലെന്നുമേ. രജനികരശകലധരചരണപരിചർയ്യയാ രാഗരോഷദ്വേഷഹീനമനസ്കനായ്.
ക്രമത്തിൽ ആദ്യാക്ഷരങ്ങൾ വരുന്ന രീതിയിൽ ക്രോഡീകരിച്ചിട്ടുള്ളത്.
താൾ:വൃത്താന്തപത്രപ്രവർത്തനം. 75 സാധൂകരിച്ചവ */ താൾ:വൃത്താന്തപത്രപ്രവർത്തനം. 76
1939. 88 തെറ്റുതിരുത്തൽ വായന നടന്നിട്ടില്ലാത്തവ */ ' 79 * താപത്രയാഗ്നിയെ വെന്ന
ഏ. കേയൂരാണി - അ. ന. ദ്വി. ബ. ഭുജേഷു - അ. പു. സ. ബ. വാലയശ്രണീം - ഈ. സ്ത്രീ. ദ്വി.
ആ! അതെന്തരപ്പീ! കൊണ്ടതാരു കൊടുത്തതാര്, പൊറുപ്പാനുള്ള എടവാടെന്തര്? തങ്കച്ചി തന്റെ
യാതൊരു ശബ്ദവുമില്ല. കാലാധിക്യം ഹേതുവാ യിട്ട് ചില ശബ്ദങ്ങളുടെ കാരണം
കഴിഞ്ഞവ */ താൾ: തെറ്റുതിരുത്തൽ വായന കഴിഞ്ഞവ */ താൾ: താൾ: 12 താൾ: തെറ്റുതിരുത്തൽ
ക്ഷത്രിയനു ശൂദ്രസ്ത്രീയിൽ ജനിച്ച സ്ത്രീസന്തതി ക്ഷത്രിയനെ തന്നെ തുടർന്ന് വിവാഹം
വിക്കിപീഡിയ അല്ലാത്ത വിക്കികളിൽ മേയ് 13-നും എല്ലാ വിക്കിപീഡിയകളിലും മേയ് 15-നും
സാധുകരിച്ചവ */ വിക്കിഗ്രന്ഥശാല:എഴുത്തുകാർ-ഗ വിക്കിഗ്രന്ഥശാല: ഗ എന്ന താൾ
നിര്ഗ്ഗുണൻ നിരീശ്വരനായ് വന്നു മഹാകഷ്ടം! മന്നവൻ ഗുണവാനെന്നാകിലും ദുർമന്ത്രികൾ
തീക്ഷ്ണദം ഷ്ട്രായ ധീമഹി. തന്നോ നാരസിം ഹഃ പ്രചോദയാത് 30 ഭാസ്കരായ വിദ്മഹേ
ഭീഷ്മം നാകമ്പയദ് യുധി 11 സാത്യകിശ് ച മഹേഷ്വാസഃ കൃതവർമാണം അഭ്യയാത് തയോഃ സമഭവദ്
എന്നല്ല, കല്പാധിപന്മാരുടെ പോലും സ്ഥാനങ്ങളെ ആഗ്രഹിക്കാത്തവരാകുന്നു. അവർ മോക്ഷത്തെ
 നിരൂപണവിദ്യയുടെ മുഖ്യമായ ഒരു കൃത്യം, നിർമ്മാണ ശക്തിയെ പ്രയോഗസൌകര്യം ഉണ ടാക്കി
 പുറത്തു നിൎജ്ജനസ്ഥങ്ങളിൽ പാൎത്തു, എല്ലാടത്തുംനിന്നു (ജനങ്ങൾ) അവന്റെ അടുക്കെ
വായന കഴിഞ്ഞവ */ താൾ:മയൂഖമാല. 26 തെറ്റുതിരുത്തൽ വായന കഴിഞ്ഞവ */ താൾ:മയൂഖമാല. 27
സ്വതസിദ്ധമായ കേടുകൊണ്ടാണെന്നു് അച്ചിക്കൊതിയന്മാരായ ചിലരും അമ്മാവനും
സംരംഭോർജ്ജിതം ക്രമേണ ക്ഷയിച്ചു, സുബോധലബ്ധി ഉണ്ടായിത്തുടങ്ങിയപ്പോൾ ഒരു ഖുരശബ്ദം
കൃത്യങ്ങൾക്കുവേണ്ടുന്ന സഹായംചെയ്യുന്നു എന്നു നിങ്ങൾ പറയുന്നല്ലോ. യഹോവാ