സ്ഥൂലചലനമായിരിക്കുന്നത്. അധികം സൂക്ഷ്മമായുള്ളതിൽ എത്തുന്നതിനു നാം അതിനേക്കാൾ
(കുമാരനാശാൻ) നിജാനന്ദവിലാസം" / തലക്കെട്ടു മാറ്റം: നിജാനന്ദവിലാസം (കുമാരനാശാൻ
ശ്രവിച്ചക്ഷി തെളിച്ചൊന്നു വീക്ഷിച്ചാനൃക്ഷപുംഗവൻ. 22 തത്രത്യ ഹേമശൃംഗാ
തൂഷ്ണീമേവ സ്ഥിതസ്തൂഷ്ണീം തൂഷ്ണീം സത്യം ന കിഞ്ചന 40 പരമാത്മാ ഗുണാതീതഃ സർവാത്മാ
കൂട്ടത്തിൽ ഇബ്രാഹീം നബി(അ)യുടേയും ഇസ്മാഈൽ നബി(അ)യുടെയും പ്രതിമകളും
സ്വകൃത്യമെന്നപോലെ സമ്മതിച്ച് കല്ലറയ്ക്കലേക്ക് അഥവാ പെരിഞ്ചക്കോട്ടെ
പറ്റിയിരുന്നില്ല. വളരെ സാവധാനത്തിലാണ് മനുഷ്യന് അതിനു കഴിഞ്ഞത്. ഈ
വരുമെന്നു നിർണ്ണയം അന്നം വിഷമുള്ളതുണ്ണുന്നവർക്കതു തന്നുടെ പാകം വരുവോളമേതുമി-
കുഞ്ചിക്കുട്ടിപ്പിള്ള ഒരു കറുത്ത വസ്ത്രവും ധരിച്ച് ഒരായുധവുമായി മരത്തിന്റെ
ദർശനശ്രവണാദിഭിഃ ദേഹാദിബ്രഹ്മപര്യന്തേ ഹ്യനിത്യേ ഭോഗവസ്തുനി 21 വിരജ്യ
2 1913. 68 താൾ: 2 1913. 69 പ്രമാണം: 1919. 2014 അനുമതി വർഗ്ഗം: 2014 താൾ: 1893.
അധ്യായം151 അധ്യായം150 അധ്യായം150 അധ്യായം152 അധ്യായം152 മഹാഭാരതം
വർഗ്ഗം:ക്രിസ്തുമതനിരൂപണം വർഗ്ഗം:ഉപയോക്താക്കളുടെ സോഫ്റ്റ്‌വെയർ ഫലകങ്ങൾ
പുനരുജ്ജീവനത്തിനും ആവശ്യമായ നടപടികൾ ശുപാർശ ചെയ്യുക. പരിസ്ഥിതി (സംരക്ഷണ)
മാരവൈരിദ്ധ്യാനതല്പരചിത്തനായ് വാരാണസീപുരസേവചെയ്തീടേണം.
(തോറ്റംപാട്ടു് വയനാട്ടുകുലവൻ (തോറ്റം പാട്ടു് തോറ്റംപാട്ടുകൾ തോറ്റംപാട്ടുകളും
 വഴക്കും പറായാറില്ല. കുറച്ചു കൊടുത്താലും അധികം കൊടുത്താലും അവർക്കു സന്തോഷം തന്നെ.
മാതാവും മുമ്പ് നബി(സ)യുടെ ദാസിയുമായിരുന്ന ഉമ്മു ഐമനിന് അവ നൽകി. അനസ്(റ) പറയുന്നു:
ശബ്ദഭംഗിയും ദീക്ഷിച്ചിട്ടുണ്ട്. എന്നാൽ, പദ്യങ്ങൾ ചൊല്ലികേൾക്കുമ്പോൾ മധുരമായി
ഇട്ടുകൊണ്ടിരിക്കുന്ന പട്ടാണിച്ചികളുടെ കൂട്ടത്തോടുകൂടി തോഴർ ഇങ്ങോട്ടുതന്നെ
ചക്ഷുഃ 5. 1. 9 ശ്രോത്രം ഹോച്ചക്രാമ തത്സംവത്സരം പ്രോഷ്യ പര്യേത്യോവാച കഥമശകതർതേ
ദ്വേ സൃതീ ദേവനിർമിതേ. ശുകഃ വിഹംഗമഃ പ്രോക്തോ വാമദേവഃ പിപീലികാ 36
ചിത്രങ്ങൾ,സ്കാൻ ചെയ്ത പുസ്തകങ്ങൾ ഉൾപ്പെടുത്താൻ അംഗത്വം അത്യാവശ്യമാണ്‌. എങ്ങനെ
പരിപാടിയിലുമൊക്കെ ഇതിന്റെ ഗുണഭോക്താവായിട്ടുള്ളതിനാൽ മൊത്തത്തിൽ ഉപകരിക്കുമെന്ന്
പിന്നീടാണ്. കീഴാളജനങ്ങളുടെ (അധികാരം നിഷേധിക്കപ്പെട്ട ജനവിഭാഗങ്ങളാണ് കീഴാളർ -
വഴി ബഹുദൂരം ചെന്നു ഗുരുവായ മുനി വസിഷ്ഠനോടതി- ബലവാനായുള്ള ഭരതൻ ചൊല്ലിനാൻ.
സന്തോഷിക്കുകയും ചെയ്തു. അപ്പോൾ മാത്രമേ ചേരമാൻ പെരുമാൾക്കു മുമ്പുണ്ടായ കുണ്ഠിതം
അതിക്രമിക്കുന്നതിനാൽ അത് ആകപ്പാടെ ൧൦ ക്രോശങ്ങൾ പോകുന്നുണ്ടെങ്കിലും ഓരോ ഘടികയിലും
സത്യേനാതിവദാനീതി സത്യം ത്വേവ വിജിജ്ഞാസിതവ്യമിതി സത്യം ഭഗവോ വിജിജ്ഞാസ ഇതി 7. 16. 1
24 1926. 91 24 1926. 92 24 1926. 93 24 1926. 94 24 1926. 95 24 1926. 96 24 1926.
നിയമം(ബെഞ്ചമിൻ ബെയ്‌ലി) പുതിയ നിയമം (ബെഞ്ചമിൻ ബെയ്‌ലി / എന്ന ഉപയോക്താവ് പുതിയ
കൈകൊണ്ടത്‌ ഐക്യകണ്‌ഠേനയാണ്‌. അതോറിറ്റിയുടെ യോഗങ്ങളിൽ 70 മുതൽ 100 വരെ പ്രദേശവാസികൾ
തമാത്മാനമുപാസീതാജരമമൃതമഭയമശോകമനന്തം ശ്രോത്രമധ്യാത്മം ശ്രോതവ്യമധിഭൂതം
കോലുമാക്ഷണത്തിൽ ലലനാമണി വഞ്ചിറാണിതന്ന - ഞ്ചലർമെയ്ക്കുട്ടികളായതിൽക്കളിച്ചു.
ബ്രഹ്മാ വ്യവദത്യുഭേ ഏവ വർതനീ സം സ്കുർവന്തി ന ഹീയതേഽന്യതരാ 4. 16. 4 സ
താങ്കളുടെ സന്ദേശം താളിൽ നൽകുക. അങ്ങിനെ പറ്റില്ലെങ്കിൽ ദയവായി അറിയിക്കുക ഞാൻ
ഗ്രാമത്തിന്റെ സ്ഥിതിയെക്കുറിച്ചു വേറെയും ചില പുസ്തകങ്ങളിൽ പറഞ്ഞു കാണുന്നുണ്ട്.
76 1901. 77 1901. 78 1901. 79 1901. 80 1901. 81 1901. 82 1901. 83 1901. 84 1901.
താൾ: 1935. 359 തെറ്റുതിരുത്തൽ വായന നടന്നിട്ടില്ലാത്തവ */ ' ൩൪൮ ധർമ്മസ്ഥയം
ചെയ്തു. കീഴാളസ്ത്രീകൾക്ക് പ്രവേശനമില്ല! നാടകരംഗത്ത് ഇന്ന് ഒരു സ്ത്രീപക്ഷം
വിശ്വാസത്താൽ ഭയങ്കരമാംവണ്ണം ബന്ധിക്കപ്പെട്ടിരിക്കയാകുന്നു. ബോധാതീതാവസ്ഥയെ
ലോദിറോഡ്‌, ന്യൂഡൽഹി-110003 മാർച്ച്‌ 4, 2010 ആഫീസ്‌ ഉത്തരവ്‌ വിഷയം: പശ്ചിമഘട്ട
കൊടിയായപാണിയാൽ വിളിക്കയാം നമ്മെ വിശാലലോചനേ 47 മദത്തോടാരാമസമീരനെത്തി നിൻ
കാണാവുന്ന വെള്ളക്കുള്ളന്മാരെല്ലാം ഈ വാർദ്ധക്യദശയുടെ പ്രതിനിധികളാണ്.
പാവപ്പെട്ടവരുടെയും സാധാരണക്കാരുടെയും ജീവിതത്തെക്കുറിച്ച് വളരെക്കുറച്ചു വിവരമേ
സിദ്ധാന്തങ്ങൾക്കു ചില രൂപാന്തരങ്ങൾ വരുത്തിയിട്ടുണ്ട്. പഠനവും (ഹസ്വകാലസ്മൃതിയും,
ഏതെങ്കിലും ഒരു വർണ്ണത്തിൽ ജനിച്ചവനിൽ ആ വർണ്ണത്തിലേയ്ക്കു വേണ്ടതായ
ജീവൻ എന്നും, ബ്രഹ്മ എന്നതിന് ഈശ്വരനെന്നും വാച്യാർത്ഥമാകുന്നു. വാച്യാർത്ഥങ്ങളുടെ
മനുഷ്യാകൃതിയായിട്ടു സൃ ഷ്ടിച്ചപ്പോഴെതന്നെ അദ്ദേഹത്തിൽ ശുദ്ധിയും ജ്ഞാനവുംകൂടി
കലാശിച്ചു. ഇതിനിടയിൽ ദമയന്തി നളന്റെ പരാജയം കണ്ടു കരുതലോടുകൂടി പുത്രനേയും
മൃഷ്യന്തി ബാലം അർഥപരായണം 11 ഹിത്വാ കരാൻ യൗവനാശ്വഃ പാലനാച് ച ഭഗീരഥഃ കാർതവീര്യസ്
ചോദ്യത്തിന്ന് എങ്ങനെ ഉത്തരം പറയും. ഏതു ശരിയാണെന്നും ഏതു തെറ്റാണെന്നും എങ്ങനെ
പൊഴിയുംവ ണ്ണം അടലാർ അടലാർകാലൻ, അടലാര പ്പോർക്കളത്തിൽ ഒടുക്കുവാൻ അടവി അ ഡവു അടർ അട)
7 എന്നതിൽ നിന്ന് 17 പതിപ്പുകൾ 2 1 ഫലകം: ഫലകം: 8 എന്നതിൽ നിന്ന് 6 പതിപ്പുകൾ 1
മങ്കപോലവേ; ശരിക്കിളംപുൽത്തറമേൽ മൃദുച്‌ഛദം വിരിച്ചു വിത്തേശമുറങ്ങി നിസ്ത്രപം.
വർഗ്ഗം:മലയാളമഹാകാവ്യങ്ങൾ വർഗ്ഗം:പൂർണ്ണകൃതികൾ കേശവീയം/സ്വീകാരം എ.ആർ.
പ്രസ്തുതികാമാഃ പ്രശം സാകാമാഃ പ്രസ്താവഭാജിനോ ഹ്യേതസ്യ സാമ്നഃ 2. 9. 3 അഥ
ജൈവദുർ ബല പ്രദേശങ്ങൾ പ്രണബ്‌ സെൻ കമ്മിറ്റി റിപ്പോർട്ട്‌) തനത്‌ സ്വഭാവം അപൂർവത,
ഇരിക്കാഞ്ഞാൽ അവിടെ പിന്നെ നായിരിക്കും- 1488 താനുണ്ണാത്തേവർ വരംകൊടുക്കുമൊ- 1489
1870. 1870. 1870. 1870. 10 1870. 11 1870. 12 1870. 13 1870. 14 1870. 15 1870. 16
04-150 27 താൾ: 02 03-150 43 തെറ്റുതിരുത്തൽ വായന കഴിഞ്ഞവ */ താൾ: 02 04-150 28 താൾ:
ഉരുപ്പടികളോ പണമോ എത്തിച്ചു കൊടുക്കുന്നതിനു ഗവർമ്മെന്റുവകയായി ഒരഞ്ചൽ
പ്രജാപതയേ നമഃ ഓം ആഹാര്പതയേ നമഃ ഓം അഗ്നിഗര്ഭായ നമഃ ഓം ശമീഗര്ഭായ നമഃ ഓം വിശ്വരേതസേ
തമാത്മാനമുപാസീതാജരമമൃതമഭയമശോകമനന്തം ശ്രോത്രമധ്യാത്മം ശ്രോതവ്യമധിഭൂതം