സമയമോ സ്വയം ചേർക്കുന്നതല്ല. താളിന്റെ നാൾവഴിയിൽ നിന്നും ഈ വിവരങ്ങൾ ഈ ഫലകങ്ങൾ
പൃഷ്ഠേഷു ബദ്ധോഷുധയശ് ചിത്രബാണാ രണോത്കടാഃ സധ്വജാഃ സപതാകാശ് ച സഘണ്ടാഃ സപരശ്വധാഃ 29
ഒട്ടും പാഴാക്കാതെ പരമാവധി കാര്യക്ഷമതയോടെ ഊർജ്ജ ഉപഭോഗം നടത്തുന്ന കെട്ടിടങ്ങൾ
ചാമന്നാൾ (ചാം + അന്നാൾചാവുന്ന ദിവസം. തീവാല ധൂമകേതുക്കളുദിച്ചു എന്നു സാരം 2014
അപ്പോൾ എല്ലാ വ്യസനങ്ങളും അവസാനിക്കും. ദുഃഖങ്ങൾ അസ്തമിക്കും. കർമ്മബീജങ്ങൾ
പിടിച്ചുകളയാമെന്ന് നിശ്ചയിച്ച് ഒരു ദിവസം താസിൽദാർ മഞ്ചലിൽ കയറി പെരുമ്പിലാവിലേക്കു
പ്രവീരാഃ പാണ്ഡൂനാം അഭ്യധാവൻ യുധിഷ്ഠിരം സൂതപുത്രാത് പരീപ്സന്തഃ കർണം അഭ്യർദയഞ് ശരൈഃ
ദാക്ഷിണ്യാത്തു സമുദ്ഭൂതഃ കാമോ രതികരോ ഭവേത് 204 ബഹുമാനേന ദേവീനാം വല്ലഭാനാം ഭയേന ച
അങ്കുരിക്കാം.അങ്ങിനെയാണങ്കിൽ ഇ, ഉ, ഋ, ൡ ഈ അക്ഷരങ്ങളുടെ മുറയെയനുസരിച്ചു
തച്ചന്റെ മകൻ ഉപയോക്താവിന്റെ സംവാദം: സംവാദം 05:18, 10 ഓഗസ്റ്റ് 2012 ( ഒരു
4 യദി വാസ്യ വനസ്യാസി ദേവതാ യദി വാപ്സരാഃ ആചക്ഷ്വ മമ തത് സർവം കിമർഥം ചേഹ തിഷ്ഠസി 5
അധ്യായം36 അധ്യായം35 അധ്യായം35 അധ്യായം37 അധ്യായം37 മഹാഭാരതം
ചട്ടമ്പിസ്വാമികൾ ചട്ടമ്പിസ്വാമികൾ ക്രിസ്തുമതനിരൂപണം" / ക്രിസ്തുമതനിരൂപണം എന്ന
ഗായത്രസഞ്ജ്ഞം ച ശ്രീരാമശ്ചൈവ ദേവതാ. അഥവാ കാമബീജാദേർവിശ്വാമിത്രോ മുനിർമനോഃ 21
കാണാമായിരുന്നില്ല. എങ്കിലും വില്വമംഗലത്തു സ്വാമിയാരുടെ ദിവ്യത്വത്തെക്കുറിച്ചു
അനുലക്ഷണലമായും ഐഹികനരകാനുഭൂതികളാൽ ശിക്ഷിക്കപ്പെടുന്നുവെങ്കിൽ, രാവണാദിചരിത്രങ്ങൾ
തെറ്റുതിരുത്തൽ വായന കഴിഞ്ഞവ */ 393 870,2500. 394 649. 395 2500. 396 2379. 397
യ്ക്കുള്ളോരദ്ധൂമകേതുപ്രതിമനറിയുമേ നിന്നെ ഞാനാശരേശ! ചൂഡാമണി. ഇവിടെ നാലാംപാദത്തിൽ
വിട്ടുകൊടുക്കുന്നവനും ആയ മുസ്ലീം ഖജാഞ്ചി ആ ധനം ദാനധർമ്മം ചെയ്യുന്ന അതിന്റെ
പശ്ചിമഘട്ട ജില്ലകളിലും ഗ്രാമപഞ്ചായത്തുകൾ, താലൂക്ക്‌ പഞ്ചായത്തുകൾ,
കഴിഞ്ഞവ */ എന്നുള്ള അരുളപ്പാടുകൾ കൊടന്തആശാന്റെ മോഹച്ചിറകുകളെ തളർത്തി. ഒരു കിങ്കരൻ
പാദോദകം (കാൽ കഴുകാനുള്ള വെള്ളം ഉരരീകരിക്കുക - സ്വീകരിക്ക. ഭാവം - ഹേ ലോകജനനീ,
ഇവിടെ 16. 250 വിക്കിഗ്രന്ഥശാല പരിചയപ്പെടുന്ന വിദ്യാർത്ഥികൾ ഡിജിറ്റൈസ് ചെയ്ത
രാമചന്ദ്രവിലാസം/രണ്ടാം സർഗം രാമചന്ദ്രവിലാസം 2 അഴകത്ത് പത്മനാഭക്കുറുപ്പ് രണ്ടാം
വർഗ്ഗം:പന്തളം കേരളവർമ്മയുടെ കൃതികൾ വർഗ്ഗം:പട്ടത്താനം ഗവ.എസ്.എൻ.ഡി.പി.യു.പി.സ്കൂൾ
തിരുത്തലുകൾ നീക്കം ചെയ്തിരിക്കുന്നു; നിലവിലു രുദ്രാക്ഷമാഹാത്മ്യം മാണിക്കോത്ത്
അവർ അറിയുന്നില്ലെന്നേയുള്ളൂ. ഒരു ശക്തിയുടെ ആവിഷ്‌കരണ ത്തിൽ അവർ യദൃച്ഛയാ സ്ഖലിച്ചു
വർഗ്ഗം:കേരളസർവകലാശാല സൂചിക: ചക്രവാകസന്ദേശം അജ്ഞാതകർതൃകം കേരള സർവ്വകലാശാല
അന്തർഗൃഹന്തിങ്കൽവെച്ചുമരിച്ചവ- നന്തരമില്ലകൈവല്യംഗമിക്കുന്നു.
മനുഷ്യൻറെ ചിന്തക്ക് അതിനെപ്പറ്റി, ചിന്തയെപ്പറ്റിത്തന്നെ മനസ്സിലാക്കാൻ
23 ഊചുശ് ചൈനാം മഹാഭാഗാം ക്ഷത്രിയാസ് തേ വിചേതസഃ ജ്യോതിഃ പ്രഹീണാ ദുഃഖാർതാഃ
മൃഗശാലയിൽ ചെന്നാൽ ഇതിൻറെ ദൃഷ്ടാന്തം നിങ്ങൾക്ക് ഉടനെ കാണാം. ആനകളെ നിങ്ങൾ കാണുന്നു.
കണ്ഠ്യമാകയാൽ അടഞ്ഞ സ്ഥാനിയുടെ ആക്രമണവും ഈ വിഷയത്തിൽ കാരത്തിനു സ്ഥാനിവത്വം ക
അകലെ ഇവരും തെറ്റണം. ഈഴുവൻ ഇവരെ തൊട്ടാലും കമ്മാളൻ, ബാലൻ ഇവർ നന്നെ അടുത്താലും
പ്പെടുന്നു. അപ്പോൾ മാത്രമേ ആത്മാവു ഒരു മിശശ വസ്തുവല്ലെന്നും, ലോകത്തിലുള്ള
സർവദേഹിനാം 4 ഗുദമേഢ്രാന്തരാലസ്ഥം മൂലാധാരം ത്രികോണകം. ശിവസ്യ ജീവരൂപസ്യ സ്ഥാനം
ഭിത്തികളൊക്കെ പലേവർണ്ണങ്ങളോടുകൂടിയ അതിവിശേഷമായ ഒരു വിധം കല്ലോടുകൂടിയാണ്
ചായച്ചെടിയുടെ ഇല ഉണക്കി അതിനെ കഷായംവെച്ച്, പാലും പഞ്ചസാരയും ചേർത്തു കുടിക്കുന്ന
താൾ സൃഷ്ടിച്ചിരിക്കുന്നു അസ്വാസ്ഥ്യം ഇടപ്പള്ളി രാഘവൻ പിള്ള വർഗ്ഗം:ഇടപ്പള്ളി രാഘവൻ
നാർവാഗിന്ദ്രം പ്രതിമാനാനി ദേഭുഃ 44 ബ്രഹ്മജജ്ഞാനം പ്രഥമം പുരസ്താദ്വി സീമതഃ സുരുചോ
ജുഷ്ടം കൗന്തേയഃ സത്യവിക്രമഃ പദാതിർ ഭ്രാതൃഭിഃ സാർധം പ്രാതിഷ്ഠത യുധിഷ്ഠിരഃ 27
സംസാരിച്ചിരുന്നു. കുറച്ച് കവിതകളെങ്കിലും കിട്ടിയേക്കും. കെ. പാനൂർ കെ. പാനൂർ -
അധ്യായം24 അധ്യായം24 അധ്യായം26 അധ്യായം26 മഹാഭാരതം മൂലം/സഭാപർവം/അധ്യായം26 വ്യാസൻ
ആധുനികഭാഷാസാഹിത്യത്തിലെ കനകനക്ഷത്രമായി ആകല്പകാലം താൾ:സുധാംഗദ. 20 ബ്രൗണിങ്ങിന്റെ
താളാണ്. നാമമേഖലകളെക്കുറിച്ച് മീഡിയവിക്കിയിലെ താളുകൾ വിവിധ ആയാണ്
 പാദൈശ്ച ശകടാസ്യസ്ഥൈഃ പര്യായേണാഥ മണ്ഡലം 62 ആദ്യസ്തു ജനിതോ ഭൂത്വാ സ ഏവാസ്കന്ദിതോ
രണ്ട്‌, മൂന്ന്‌ എന്നിവയുടെ അതിർത്തി വ്യക്തമായി നിർണ്ണയിക്കുന്നതിനും ഒരു
എന്തുകൊണ്ടെന്നാൽ, ഒരാളോടു മാത്രം മന്ത്രിക്കുന്നതാ യാൽ
ഔജസദ്രവ്യം, അംഗാരോദം, വസ എന്നിങ്ങിനെ മൂന്നു വിധമായ മുഖ്യവസ്തുക്കൾ ഉണ്ടെന്നു
തക്കത്തിലാഴിയുടെ കോയ്മ കരസ്ഥമാക്കാൻ അക്കന്നർ ലന്തകൾ വരുമ്പൊഴവർക്കുമേർകും
ഗ്രാമീണനായ അറബി വന്ന് അത് രണ്ടുപിടിയായി തിന്നുകളഞ്ഞു. റസൂൽ(സ) പറഞ്ഞു. അവൻ ബിസ്മി
ഉൾപ്പെട്ടതായിരിക്കണം ഈ ജില്ലാകമ്മിറ്റികൾ. 3. പരിസ്ഥിതി അവബോധ വോളന്റിയർമാരെ
സാക്ഷീ ന കരോതി കിഞ്ചി- ന്ന കാരയത്യേവ തടസ്ഥവത്സദാ 423 ദ്രഷ്ടാ ശ്രോതാ വക്താ കർതാ
ഭൂമിയിൽ കുഴിച്ചു മൂടിയിരുന്നാൽ കൂടിയും ശ്വാസം വിടാതെ ജീവിച്ചിരിപ്പാൻ
ലോകാലോകം വ്യതീതസ്തിമിരഭരമഥോ ചക്രധാംനാ നിരുന്ധൻ ചക്രാംശുക്ലിഷ്ടദൃഷ്ടിം സ്ഥിതമഥ
പറഞ്ഞു: നീ മുഹമ്മദിനെ നിഷേധിക്കും വരേക്കും നിന്റെ സംഖ്യ ഞാൻ തരികയില്ല. അപ്പോൾ ഞാൻ
പാട്ട്‌വെ-മജ്‌ഗോൺ, ഉഡേലി, ഡെഗ്‌വെ, ബലാവൽ, സർമാലെ, ഒറ്റാവനെ, ഫൻസാവാഡെ, തമ്പോളി,
അത് അഭാവ യോഗം എന്നു പറയപ്പെടുന്നു. ഓരോന്നുകൊണ്ടും യോഗി തന്റെ ആത്മാവിനെ
രാഷ്ട്രത്തോടുള്ള ഭക്തിയാണ്. (18) - ഇങ്ങനെ 'സ്വദേശാഭിമാനി' രാഷ്ട്രീയ
സംവിധാനമാണ്‌. അവയുടെ പ്രവർത്തനത്തിൽ പ്രാദേശിക ജനതയ്‌ക്ക്‌ യാതൊരു പങ്കുമില്ല.
പതിനൊന്നുപേർക്കും ക്രമേണ പുരാണിയെക്കുറിച്ചും ഒട്ടും രസമില്ലാതെയായിത്തീർന്നു.
തീവെട്ടിക്കാർ, മുതലായവർപോലും പ്രാണഭീതിയോടുകൂടി നാലു പുറത്തേക്കും ഓടി.
37 മാളവികാഗ്നിമിത്രം (കാളിദാസൻപരിഭാഷകൾ) 15 38 ഭാഷാകുമാരസംഭവം (കാളിദാസൻപരിഭാഷകൾ)
ആശ്രിതന്മാരോ, അദ്ദേഹത്തിന്റെ ഔദാര്യത്തെ വല്ല പ്രകാരത്തിലും ആസ്വദിച്ചവരോ അല്ലാതെ