അൻസാരികളും അവർക്ക് പാൽ കറക്കുന്ന ചില മൃഗങ്ങളുമുണ്ടായിരുന്നു. അവയുടെ പാൽ
പരിഹാരമായിട്ടുള്ളത്‌ ജില്ല ഒന്നാകെ എം.പി.സി.യുടെ പരിധിയിലുൾപ്പെടുത്തുക എന്നതാണ്‌.
താപ്പാനകളുടെ സഹവാസംകൊണ്ടും മറ്റും കൊച്ചയപ്പൻ കാലക്രമേണ ഒരു താപ്പാനയായിത്തീർന്നു.
തുടർന്നുള്ള കാലത്തും ജാതിയുടെ ചിഹ്നങ്ങളായ വസ്ത്രങ്ങളും ആഭരണങ്ങളും ഉപേക്ഷിക്കാനും
അഭിപ്രായത്തിൽ, ഗവൺമെന്റ് ഉദ്യോഗസ്ഥന്മാർ പൊതുവേ അഴിമതിക്കാരാണ്. (99) തിരുവിതാംകൂർ
ചെയ്തിരിക്കുന്നു; നിലവിലുള താൾ: 1936. 73 14/ 14/ 15/ 15/ താൾ: 1936. 74 താൾ: 1936.
കുതിര. കലിതം - കൽപിക്കപ്പെട്ടത്. ഭാവം - അല്ലയോ ഭഗവതി, അവിടുത്തെ ഇ ഷ്ടംപോലെ പോകു
ഹംസപരമഹംസയോരാന്തരപ്രണവഃ തുരീയാതീതാവധൂതയോർബ്രഹ്മപ്രണവഃ. കുടീചകബഹൂദകയോഃ ശ്രവണം
ചിദ് വരോ ജാതു ഭവിഷ്യതി 50 [ഷ്] ശ്രുത്വാ തവ വരം ദാശവ്യവസ്യേയം അഹം ന വാ ദാതവ്യം
കാര്യമായ സംഭാവന നൽകിയിട്ടുള്ള ഓരോ സമൂഹ പ്രതിനിധികൾ വീതം. 1 മുതൽ 5 വരെയുള്ളവർ
പ്രയോജനപ്രദങ്ങളാണ്. ഇന്ത്യൻ സ്ത്രീകളുടെ രാഷ്ട്രീയാവകാശപ്രക്ഷോഭങ്ങളെക്കുറിച്ചുള്ള
വരുന്നതറിയാം. വിവാഹത്തിനു പൊരുത്തം നോക്കാനോ അതുപോലുള്ള ആവശ്യങ്ങൾക്കോ അന്ന് ജാതകം
ഒരു പടലവും അതിനുള്ളിൽ അതിവിപുലമായ ഒരു കേന്ദ്രമേഖലയും സ്ഥിതിചെയ്യുന്നു.
പരിശിക്ഷിയ്ക്കേണം പിഴയ്ക്കുതക്കതു തുരിയമായതുയമവൃത്തിവീര! പ്രതിദിനം
പൊതുവിദ്യാഭ്യാസവകുപ്പിൽ അസിസ്റ്റന്റ് ഇൻസ്പെക്ട്രസ്സായി ജോലിക്കുചേർന്നു.
ചോദ്യങ്ങൾക്കപ്പുറവുമാണെന്ന ധാരണ ശക്തമായിത്തുടർന്ന അന്തരീക്ഷമായിരുന്നു കേരളത്തിൽ
വ്യാസൻ അധ്യായം43 അധ്യായം42 അധ്യായം42 അധ്യായം44 അധ്യായം44 1 [ബ്ര്] മനുഷ്യാണാം തു
പാട്ടുമേഖലയിൽ മാത്രമല്ല, മതാദ്ധ്യാപനരംഗത്തും സ്ത്രീകളുണ്ടായിരുന്നു. സ്ത്രീകൾ
108-മഹാശിവക്ഷേത്രങ്ങളുടെ പേരുകൾ പ്രതിപാദിക്കുന്നു. സ്തോത്രം എഴുതിയിരിക്കുന്നത്
ബൃഹത്കരിച്ചും അനുചരസംഘത്തിനിടയിൽ ഇരുന്ന് കേവലം മൃഗശക്തിയോടേൽക്കാൻ താൻ
സമ്പൂർണ്ണ കൃതികൾ. 17 തെറ്റുതിരുത്തൽ വായന കഴിഞ്ഞവ */ താൾ:ഇടപ്പള്ളി സമ്പൂർണ്ണ
അബൂബക്കറത്ത്(റ) നിവേദനം: നബി(സ) അരുളി: രണ്ട് മാസങ്ങൾ അതായത് രണ്ടു പെരുന്നാൾ
സംശയിച്ച് ഇങ്ങനെ ചോദ്യം ചെയ്തു: അനന്തരവന്റെ അപകടം വല്ലാത്ത ദുർഘടംതന്നെ. എന്നാൽ
ഗുണിച്ചിട്ടുള്ളതു് ഈ ക്ഷേത്രത്തിങ്കന്നു കളയേണം. പിന്നെ ഗുണ്യത്തിങ്കലെ ഇഷ്ടത്തോളം
വർഗ്ഗം:2010-ലെ കൃതികൾ വർഗ്ഗം:സെന്റർ ഫോർ ഡെവലപ്മെന്റ് സ്റ്റഡീസ് വർഗ്ഗം:അപരാധികൾ
താമ്രപർണീസരിത്തും 60 തേടിപ്പിന്നെപ്പാണ്ഡ്യരാജന്റെ നാട്ടിൽ- ക്കൂടെ
അല്പവും ചേരുകയില്ലാ. സമസ്തനായകനായ ദൈവത്തെ ദുഷിക്കയും, ഒരുവനെ കൊല്ലുകയും, ഒരു
കാകസ്യവിഷ്ഠാവദസഹ്യബുദ്ധിർഭോഗ്യേഷു സാ തീവ്രവിരക്തിരിഷ്യതേ
ഇന്നു ചൊന്ന വാക്കിനില്ലാദരം എന്നു വന്നതിൻ കാരണം, വന്നോരെന്നിലുള്ള നിന്ദ നിർണ്ണയം;
ഇതിൽ താഴെ പറയപ്പെടുമവസ്ഥകളിൽ ആവരണശക്തിയിൽ ലഭിച്ചുദിച്ചതായി പറഞ്ഞുവെങ്കിലും അതിനെ
മുതലാളിത്തരീതിയിലുള്ള ഉല്പാദനവ്യവസ്ഥയിലാണ്. ഉല്പാദന-വിതരണോപാധികൾ മുഴുവൻ
വാക്യമബ്രവീൽ ശൃണു ദേവപതേ തത്വം മൽകാര്യഞ്ച വദാമ്യഹം മൽഭൂമ നൗിത്യവാസീനാം
പണ്ടത്തെ ഹിന്തുരാജാക്കന്മാരുടെ ഇടയിൽ ധാരാളം പ്രബലമായിരുന്നു എന്നു തോന്നുന്നില്ല.
തകർച്ച നേരിടുന്നു. ഈ കാലയളവിൽ നിരവധി സസ്യജീവജാല സമൂഹങ്ങൾ ഏതാണ്ട്‌
എന്നുവെച്ചാൽ ബ്രഹ്മജ്ഞാനം കൊണ്ടു നിവർത്തിക്കുക എന്നാണർത്ഥം. ഇത്രയുംകൊണ്ട്
ഏതമേവമാത്മാനം വൈശ്വാനരമുപാസ്തേ സന്ദേഹസ്ത്വേഷ ആത്മന ഇതി ഹോവാച സന്ദേഹസ്തേ
വിക്കിഗ്രന്ഥശാല:വിക്കിപദ്ധതി വർഗ്ഗം:വിക്കിഗ്രന്ഥശാല വർഗ്ഗം:ഔദ്യോഗിക താളുകൾ
ദശകം എൺപത് ദശകം എൺപത് ദശകം എൺപത്തിരണ്ട് ദശകം എൺപത്തിരണ്ട് ഫലകം:നാരായണീയം 81.1
മുൻപിൽക്കടന്ന് ഓടിത്തുടങ്ങി. അതു വലിയ കൂരിരുട്ടുള്ള കാലമായിരുന്നുവെങ്കിലും ആ
ഭാഷാഭൂഷണം/പേജ് 19 പേജ് 19 ഇവിടെ നീയാം തൊടുകുറി എന്ന് രാജാവിനെ ഭൂമിയുടെ തിലകമാക്കി
'അപ്രകാരം തന്നെ, ന്യൂസീലണ്ടിൽ ജനിച്ചുവളരുന്ന താൾ താൾ: 6 1913. 183 തെറ്റുതിരുത്തൽ
സ്വനം വിദ്രുതം ശിബിരം ദൃഷ്ട്വാ സായാഹ്നേ രാജഗൃദ്ധിനഃ സ്ഥാനം നാരോചയംസ് തത്ര തതസ് തേ
ദേശം പലപലനദീകടന്നുപോകുമ്പോൾ വഴിക്കുരാജാവേ പഴിച്ചുചൊല്ലുന്ന വചനമെന്നിയേ
പട്ടികയിൽപെടുത്തിയിരിക്കുന്ന സസ്‌തനിസ്‌പീഷീസുകളുടെ എണ്ണം. എന്നിരുന്നാലും
വരുന്നു! ശ്ലോ 76 ഓംകാരവാദമതിലാത്മഭവന്നുദിച്ചൊ- രാങ്കാരശൈലശതകോടിയമർത്ത്യനാഥൻ
അസ്തിത്വത്തെക്കുറിച്ച് ചോദിക്കുവാൻ വന്നവരാണെന്ന് പറഞ്ഞു. നബി(സ) അരുളി: ആദിയിൽ
ലക്ഷണമാകാത്തതെന്നറി ഏതൽക്ഷമിയ്ക്കെന്നുശാസിയ്ക്കലാമിദം ബാഹുപ്രകാരവും
യേന വാ ശൃണോതി യേന വാ ഗന്ധാനാജിഘ്രതി യേന വാ വാചം വ്യാകരോതി യേന വാ സ്വാദു ചാസ്വാദു
പാലവാക്ക, വിതി, വെള്ളം, തിട്ടുചാഴി ഇതാറും വ്യാകരണകൂറ്റിൽ തത്തവെഴുവും, വല്ലുകണ്ട,
കാർമ്മുകശരധാരികളെന്നുള്ളൊരു ദുർമ്മദമേറിയ നിങ്ങളെയൊക്കെ നിർമ്മഥനം ചെയ്യാനായ്‌ സംഗര
പിന്നെ ദ്വിതീയേഷ്ടവൎഗ്ഗം രണ്ടിലും കൂട്ടൂ അപ്പോൾ പ്രഥമേഷ്ടത്തിൽ ദ്വിതീയേഷ്ടം
അപ്പോഴാണ് അല്ലാഹു ഇപ്രകാരം അവതരിച്ചത്. നിങ്ങൾ ഭക്ഷണം ശേഖരീക്കുവീൻ. നിശ്ചയം,
ദിവസവുമില്ല. (മുസ്ലിം) 97) ഇബ്നുഅബ്ബാസി(റ)ൽ നിന്ന് നിവേദനം: (മദീനയോട് 36 മൈൽ
സച്ചിദാത്മന്യനുസ്യൂതേ നിത്യേ വിഷ്ണൗ പ്രകൽപിതാഃ വ്യക്തയോ വിവിധാഃ സർവാ ഹാടകേ
സഖിമാർ പ്രവേശിക്കുന്നു അനസൂയ: പ്രിയംവദേ, ഗാന്ധർവ്വവിധിപ്രകാരം വേളികഴിഞ്ഞ്
ഇവരിൽ ആർക്കും നമ്പൂതിരിസംബന്ധം ഇല്ലായിരുന്നു; മേൽപ്പറഞ്ഞ പലവിധത്തി പലവിധത്തിലുള്ള
അധ്യായം143 അധ്യായം143 അധ്യായം145 അധ്യായം145 മഹാഭാരതം മൂലം/വനപർവം/അധ്യായം145
ഉന്മൂലനം ചെയ്യാൻ കച്ചകെട്ടിയ ചിലരെങ്കിലും, മാർക്സിസം തന്നെ
നേഷ്യതേ പ്രഥമാദക്ഷരാദ്യത്ര ചതുർഥാത്പ്രാഗ്ലഘുഃ സ്മൃതഃ 175 പഥ്യാപാദം സമാസ്ഥാപ്യ
(വർഷമില്ലെങ്കിലും) കുറേശ്ശെ ശൈത്യവും പിന്നീടു് അതിശൈത്യപ്രദമായ മഞ്ഞുകാലവും
നൽകുകയായിരുന്നു. ജർമ്മനി ജർമ്മനിയിലെ ട്യൂബിങ്ങൻ സർവ്വകലാശാല ട്യൂബിങ്ങൻ
വിചാരിച്ചിരിയ്ക്കുമെന്നോ ഊഹിപ്പാൻ അശേഷവും യുക്തി കാണുന്നില്ല. ൭)
 തെറ്റുതിരുത്തൽ വായന കഴിഞ്ഞവ */ താൾ: 1912. 69 2014 താൾ: 3 1904. 655 താൾ: 1917. 89
എന്നിങ്ങനെ പൊരുലും ശബ്ദവും വ്യത്യാസമായിരിക്കുന്ന പദങ്ങൾ തമ്മിൽ ഇതിനാൽപ്പിണക്കം