എന്നാലാവട്ടെ, അടുത്ത മാസത്തിലും വരണം എന്നു കല്പിക്കുകയും കേശവൻ അതും സമ്മതിച്ച
തെറ്റുതിരുത്തൽ വായന നടന്നിട്ടില്ലാത്തവ */ താൾ: 76 ഫലകം: ഫലകം: എന്നതിൽ നിന്ന് ഒരു
ചെറിയ പെരുന്നാൾ ദിവസവും ബലിപെരുന്നാൾ ദിവസവും നോമ്പനുഷ്ഠിക്കുന്നതിനെയും
അധ്യായം73 അധ്യായം72 അധ്യായം72 അധ്യായം74 അധ്യായം74 മഹാഭാരതം മൂലം/വനപർവം/അധ്യായം74
തത്ര സ്നാത്വാ സ്ഥിതോ രാത്രിം രുദ്ര ലോകം അവാപ്നുയാത് 156 ബദരീ പാചനം ഗച്ഛേദ്
ന വേദ 490 വിക്ഷേപനാമ്നീ രജസസ്തു ശക്തിഃ പ്രവൃത്തിഹേതുഃ പുരുഷസ്യ നിത്യം
കൊണ്ടുവന്നു പിങ്കുടുമ്മമാറ്റി മുങ്കുടുമ്മയാക്കുക, മക്കത്തായം മാറ്റി
പ്രമുഖാഃ പാർഥാഃ പുരസ്കൃത്യ ശിഖണ്ഡിനം ഭീഷ്മം യുദ്ധേ ഽഭ്യവർതന്ത കിരന്തോ വിവിധാഞ്
മുതലായ നാനാപ്രകാരേണയുള്ള ലേഖനങ്ങളൊക്കെ വന്ന് കുന്നുപോലെ കൂടിയിരിക്കും.
കയ്യടക്കി ഇല്ലാത്ത മൂല്യം കൈക്കലാക്കുന്നു. അതുപോകട്ടെ, ഇങ്ങനെ പോയാൽ നമ്മുടെ ചർച്ച
റക്‌ൿഅത്തും ജുമുഅ: ക്ക്‌ ശേഷം പള്ളിയിൽ നിന്ന്‌ പിരിഞ്ഞ്‌ വീട്ടിൽ വന്നാൽ
പറയണം' എന്നു കൽപിചു. പട്ടർ ഭസ്മം വാങ്ങിക്കൊണ്ട് ഓടി ബ്രഹ്മസ്വം മഠത്തിലെത്തി ഭസ്മം
കുറ്റപ്പെടുത്തുന്നുവെങ്കിലും പെണ്ണിന്റെ 'വേഷംകെട്ടൽ' കൂടുതൽ അപകടമാണെന്നായിരുന്നു
താൾ: 02 03-150 49 താൾ: 1863. 234 ൨ഠൻ ഒററയക്ഷരം, ക ച ഗ മ യ ള എന്നിങ്ങനെ ഒററയായി
താൾ: 1913. 93 തെറ്റുതിരുത്തൽ വായന കഴിഞ്ഞവ */ താൾ: 02 04-150 34 താൾ: 1913. 94
ലയിക്കുന്നു' എന്നുതുടങ്ങിയ ശ്രുതിവാക്യങ്ങൾ ഈ ജഗത്ത് ഉത്പത്തിനാശങ്ങളുള്ളതാ ണെന്നും
ാേവ. തമിഴിൽ ഓകാരത്തിനു പരമായി സ്വരങ്ങൾ ഇരുന്നാൽ വ് എന്ന അർദ്ധാക്ഷരം ആഗമം വരും.
പൗരാ യേ തേ ഹർഷാച ചുക്രുശുര ഭൃശമ 74 ആഹുഃ കേ ചിന ന തസ്യൈതേ തസ്യൈത ഇതി ചാപരേ യദാ
ഈ ഒപ്പ് ഇടാത്ത കുറിപ്പ് ചേർത്തത്: 2 സംവാദം സംഭാവനകൾ 1 2 ഫലകം: ഫലകം: എന്നതിൽ
സ്വർഗ്ഗവുമായിരിക്കും. നുഹ് തന്റെ സമുദായത്തെ ഇവനെ സംബന്ധിച്ച് താക്കീത് ചെയ്തതുപോലെ
കരുതിക്കൊള്ളുകഗിരിദുർഗ്ഗങ്ങളും അനുനയം ചൊല്ലിത്തണുപ്പിച്ചുശോകം മനുകുലവരനയച്ചുവേടനെ
പ്രത്യയസന്നിവേശം കൂടാതെ തന്നെ അറിയിക്കുന്നതുകൊണ്ട് പ്രഥമ മുതലായ
ഈത്തപ്പഴക്കുരുവോളം സ്വർണ്ണം. നബി(സ) അരുളി: ഒരാടിനെ അറുത്തെങ്കിലും നീ വിവാഹസദ്യ
അനുബന്ധം രൂപം നൽകി. ചുവടെ പറയുന്ന ചുമതലകൾ നിർവ്വഹിക്കാനാണ്‌ സമിതിയോട്‌
മതിച്ചതുപോലെ പത്ത് വസ്കുണ്ടായിരുന്നു. അപ്പോൾ നബി(സ) അരുളി: എനിക്ക് മദീനയിലേക്ക്
അധ്യായം61 മഹാഭാരതം മൂലം/കർണപർവം/അധ്യായം61 വ്യാസൻ അധ്യായം61 അധ്യായം60 അധ്യായം60
നമ്മുടെ സുന്ദരിയായ കന്യക നിലത്തു ചവുട്ടിക്കുതിച്ചു സാവധാനത്തിൽ ആടുവാൻ തുടങ്ങി.
അനുബന്ധങ്ങൾ വർഗ്ഗം:വിക്കിഗ്രന്ഥശാല താൾ സൃഷ്ടിച്ചിരിക്കുന്നു
അത്‌ ഉദിച്ചുപൊങ്ങുംവരേക്കും നമസ്കാരം നിങ്ങൾ പൈന്തിപ്പിക്കുവീൻ, അതുപോലെ സൂര്യന്റെ
തെറ്റുതിരുത്തൽ വായന കഴിഞ്ഞവ */ ശാസ്ത്രവും സാങ്കേതികവിദ്യകളും അതിവേഗത്തിൽ
ഇങ്ങനെ നോക്കുമ്പോൾ ഒരവസ്ഥയിൽ സത്യമെന്നു തോന്നുന്ന പ്രപഞ്ചം മറ്റു രണ്ടവസ്ഥകളിലും
2014 044 താൾ: 1911. 84 2014 സൂചിക: 1906. 2014 കണ്ഠാമൃതം നീലകണ്ഠതീർത്ഥർ
പുസ്തകങ്ങൾ കൊടുക്കണമെന്നുള്ള എന്റെ അപേക്ഷയെ അനുസരിച്ചു നിങ്ങൾ എത്രത്തോളം
അവയിൽ ഏതാനും ചിലതു കൂടി പറയാം. ത്രികോണരാശികൾ-1 (അഥവാ ലഗ്നം) 5,9 എന്നീ രാശികൾ
നടന്നിട്ടില്ലാത്തവ */ 'ന്നെ സ്റ്റേഷനിലെത്തിയിരിയ്ക്കുന്നത്.ചുററിന താൾ 32026 താൾ:
ഇച്ഛാശമനത്തിന്, ആഗ്രഹപൂർത്തിക്ക്, അവിദ്യാകത്തിതങ്ങളായ വിഷയങ്ങളെ സമീപിക്കുന്നു ആ
ഛാന്ദോഗ്യോപനിഷദ് ഛാന്ദോഗ്യോപനിഷത്ത്" / എന്ന ഉപയോക്താവ് ഛാന്ദോഗ്യോപനിഷദ് എന്ന താൾ
സുഷ്ടുവായുള്ളതിരിയ്ക്കയില്ലെപ്പൊഴും കർമ്മവുമർത്ഥവും കാമവും സർവ്വവും ധർമ്മജ്ഞനാം
രാമന്റെ കോപ്പുമിരിപ്പും ബലങ്ങളും ഭീമമാമായുധസഞ്ചയമൊക്കയും.
വീണ്ടും അടയുന്നു. സകല ചലനവും നിൽക്കുന്നു. ലോകസാക്ഷികളോട് യാത്രയും ചൊല്ലി
ഭാഗത്തുള്ള ഗ്രാമത്തിൽ പ്രവേശിപ്പിചു. അവർ അപ്രകാരം ചെന്നു് ജനങ്ങളുടെ സ്വത്തുക്കളെ
യാത്രചെയ്യാനും പൊതുവേദികളിൽ പ്രസംഗിക്കാനും നിയമസഭകളിൽ പ്രവർത്തിക്കാനും
അഭിപ്രായങ്ങൾ മെന്ന നില്യ്ക്കു് വൈറ്റ്ലിലിങ്ങിന്റെ വിക്ഷണങ്ങൾ ക്രിയാത്മകമായ ഒരു
പതിപ്പുകൾ 144%; ഫലകം: ഫലകം: എന്നതിൽ നിന്ന് 5 പതിപ്പുകൾ 182%; ഫലകം: ഫലകം: എന്നതിൽ
പ്രതിപാദിതഃ 119 ജന്തൂപാഖ്യാനം അത്രൈവ യത്ര പുത്രേണ സോമകഃ പുത്രാർഥം അയജദ് രാജാ ലേഭേ
 മാണ്ഡവ്യമാമുനിതാനുമരുൾചെയ്തു. അസുരവരശൃണുനിജശരീരനാശംകൊണ്ടു-
പുകവലിക്കുകയും മദ്യം കഴിക്കുകയും ചെയ്യുന്നത് ആദ്യകാലങ്ങളിലൊന്നും വലിയ
ചക്രം അമ്മിക്കല്ല് സർപ്പത്തല കർക്കിടകം 10 മകം മഘം ശയനം(4) നുകം തൊട്ടിൽ മെലേഖ്,
വിപ്ലവത്തിന് മുമ്പുണ്ടായിരുന്ന എല്ലാ കലാ-സാഹിത്യ സമ്പത്തുകളും നശിപ്പിക്കണം. അവ
ഭ്രാതരം രാജരാജാനം മഹേശ്വര സഖം പ്രഭും ധനേശ്വരം വ്യപദിശൻ കഥം ത്വ് ഇഹ ന ലജ്ജസേ 24
ത,ന്നവനീതഭാണ്ഡവിവരേ ഹസ്തം കിമർഥം ന്യസേഃ? മാതഃ!കഞ്ചനവത്സകം മൃഗയിതും മാ ഗാ വിഷാദം
തലപുഷ്പാപവിദ്ധേ ദ്വേ വർതിതം സംനികുട്ടികം 177 ഊരൂദ്വൃത്തം തഥാക്ഷിപ്തമുരോമണ്ഡലമേവ ച
പോയി- 718 ഒറ്റാലിൽ വീണതതുമില്ല,കോർമ്പലെൽ കോർത്തതുമില്ല- 719 ഒറ്റെക്കു
വർഗ്ഗം: കുലസ്ത്രീയും ചന്തപ്പെണ്ണ അനുമതി 2.5- സെന്റർ ഫോർ ഡെവലപ്മെന്റ് സ്റ്റഡീസ്
99 സർവസങ്കൽപരഹിതാ സർവസഞ്ജ്ഞാവിവർജിതാ. സൈഷാ ചിദവിനാശാത്മാ സ്വാത്മേത്യാദികൃതാഭിധാ
അന്യാഭിപ്രായത്തെ പിന്തുടരാതെ, സ്വന്തബുദ്ധിയും ആലോചനയും വേണ്ടുംവണ്ണം ഉപയോഗിക്കുന്ന
ത്യജാഭിമാനം കുലഗോത്രനാമ- രൂപാശ്രമേഷ്വാർദ്രശവാശ്രിതേഷു ലിംഗസ്യ ധർമാനപി കർതൃതാദിം-
കുരുക്കുത്തിമുല്ലപ്പൂവ്. കരവീരപുഷ്പം - ചുവന്നരളിപ്പൂവ്. ലവംഗപുഷ്പം - ഇലവർ പ്പൂവ്.
തഥാ ഭോജഃ കാർതവീര്യസമോ യുധി ഗോപതിസ് താലകേതുശ് ച ത്വയാ വിനിഹതാവ് ഉഭൗ 31 താം ച
ചണ്ഡാളൻ 689 ആയാൾക്കു പഠിക്കാൻ കഴിയാത താൾ 28022 താൾ: 3 1904. 703 തെറ്റുതിരുത്തൽ
28040 താൾ: 2 1909. 254 തെറ്റുതിരുത്തൽ വായന നടന്നിട്ടില്ലാത്തവ */ '൨൩0 മംഗളോദയം
എണ്ണത്തി ലടങ്ങാത്ത അനേക പാണി പാദ മസ്തക ഊരു മുതലായ പരിണാമഭേദത്തിനു കാരണമായിരുന്ന
തെറ്റുതിരുത്തൽ വായന നടന്നിട്ടില്ലാത്തവ */ 'കിളിപ്പാട്ട് 613 നൃത്തം കലർന്നു
രാമുണ്ണിനായർ വർഗ്ഗം:രാഗം കർണ്ണാടകസംഗീതം വർഗ്ഗം:കർണ്ണാടകസംഗീതം വർഗ്ഗം:മദ്ധ്യമാവതി