ദേവൻ) ശനി ക്രോണോസും (കാലത്തിന്റെ ദേവൻ) ആയി രൂപാന്തരപ്പെട്ടു തലക്കെട്ട്4 3.3
പരിഗണിക്കേണ്ടതുണ്ട്‌. ജലസ്രോതസ്സുകളുടെ വികസനം. ഗ്രാമങ്ങളിൽ വറ്റാത്ത അരുവികൾ
മനസ്സിലാകുമെന്നു തോന്നുന്നില്ല. പ്ലോട്ട് ഉള്ള ഒരു കഥയായാൽ കവിക്ക് ഏതെങ്കിലും ഒരു
അമ്മാത്തോലിനെക്കുറിച്ചു മാതൃനിർവ്വിശേഷമായ ഭക്തിസ്നേഹാദരങ്ങളുമുണ്ടായിരുന്നു.
പ്രാണരോധനം. പ്രാണായാമൈസ്തഥാ ധ്യാനൈഃ പ്രയോഗൈര്യുക്തികൽപിതൈഃ 44 ചിത്തോപശാന്തിഫലദം
സത്യമഭവത് യദിദം കിഞ്ച തത്സത്യമിത്യാചക്ഷതേ തദപ്യേഷ ശ്ലോകോ ഭവതി ഇതി ഷഷ്ഠോഽനുവാകഃ
താൾ: 1930. 138 വർഗ്ഗം:താളുകൾ - 1930 താൾ: 1930. 139 വർഗ്ഗം:താളുകൾ - 1930 താൾ:
സത്യവേദപുസ്തകം/യിരെമ്യാവു/അദ്ധ്യായം 13 അദ്ധ്യായം 13
 തന്റെ കല്പനയുടെ സ ഹസത്തെ ഓർത്ത് അല്പമൊന്നു കലുഷമായിത്തീർന്നു. തന്നിൽ അധിരോപിതമായ
പത്തായം 31 പത്തായം 32 പത്തായം 32 പത്തായം 32 പത്തായം 33 പത്തായം 33 പത്തായം 33
അദ്ദേഹം മരിക്കുന്നതുവരേക്കും. (ബുഖാരി. 2. 24. 551) 52) ഇബ്നു ഉമർ(റ) നിവേദനം:
കിളിപ്പാട്ട്/മിത്രലാഭം കുഞ്ചൻ നമ്പ്യാർ ദ്വിതീയതന്ത്രം മിത്രലാഭം മിത്രഭേദം
127 1902. 128 1902. 129 1902. 130 1902. 131 1902. 132 1902. 133 1902. 134 1902.
30 സൂചിക:മൗനഗാനം. ഉപയോക്താവ്: 31 സൂചിക: ഉപയോക്താവ്: 32 സൂചിക:മണിമഞ്ജുഷ. 33
നിർവചിക്കാവുന്നതാണ്. ഓരോ കളത്തിന്റേയും വീതി പ്രത്യേകം പ്രത്യേകം പറഞ്ഞുകൊടുത്ത്
 സജീവ സജീവസാന്നിദ്ധ്യമായിരുന്നു. താൾ: 27 തെറ്റുതിരുത്തൽ വായന കഴിഞ്ഞവ */ അവർ ഈ
നിയമരംഗത്തേക്കു മാറിയ അവർ അഖിലേന്ത്യാ സ്ത്രീസംഘത്തിന്റെ ( സെക്രട്ടറിയായും
ഭൂചക്രഭ്രമണം തുടങ്ങി. ഭൂതകാലദൂരതയിലെ സാഹസപരാജയങ്ങൾ സംബന്ധിച്ചുള്ള സ്മൃതികൾ ആ
മനസാഭിഗച്ഛതി തദ്വാചാ വദതി തത്കർമണാ കരോതി തദേഷഭ്യനൂക്താ. കാമസ്തദഗ്രേ സമവർതതാധി
വപുഃ വ്യാത്തവ്യാപ്തമഹാദരീസഖമുഖം ഖംഗോഗ്രവദ്ഗന്മഹാ-
വിശ്വാസപൂർവ്വം നാം അഭ്യസിക്കണം. അപ്പോൾ സംഗതി വെളിവാകും. അറിവു സമ്പാദിക്കുന്നതിൽ
യുണ്ടാക്കിയതെന്നുവരികിൽ പാപം ഇല്ലാത്ത ദേവദൂതന്മാർക്കും സുഖം ഉണ്ടാക്കിയിരിക്കയാൽ
ആസീൻ നാന്യോ ഽഭ്യഭവദ് അർജുനം 40 ദ്രോണസ്യ തു തദാ ശിഷ്യൗ ഗദാ യോഗ്യാം വിശേഷതഃ
ശബ്ദശോധിനി(വ്യാകരണം / ശാസ്ത്രം) 15 32 സാഹിത്യസാഹ്യം (വ്യാകരണം / ശാസ്ത്രം) 15 33
1504 താററ്റ തുണി പോലെ 1505 താളിന്നുപ്പില്ല എന്നും താലിക്കു മുത്തില്ല എന്നും -
നിന്നും തിരിച്ചു. ഈ രണ്ടു യുവാക്കന്മാരുടേയും ഒടുവിലത്തെ ചിന്തകൾക്കു വിപരീതമായി
വിനതാ തദാ 13 തയോർ അണ്ഡാനി നിദധുഃ പ്രഹൃഷ്ടാഃ പരിചാരികാഃ സോപസ്വേദേഷു ഭാണ്ഡേഷു
ഭാഷാചമ്പുക്കൾ 5. കെട്ടറ്റഴിഞ്ഞലർപൊഴിഞ്ഞൊരു താൾ താൾ: 1 1918. 95 18133 താൾ: 1 1918.
പൃച്ഛിച്ചു മൂഷികം താഴത്തിറക്കിനാൻ. മന്ദരൻ ചോദിച്ചു താനെന്തെടോ! മർത്യ
ത്വഗ്രോഗങ്ങൾ പലതും മാറും; തേമൽ,മേഹകുഷ്ഠം മുതലായവയെ നശിപ്പിക്കും. വില,കുപ്പി
പ്രാപിക്കാനുള്ള നൈസർഗ്ഗിക കഴിവാണ്‌. തനതു ഘടനയിൽ നിന്ന്‌ കൂടുതൽ
134.കൊണ്ടൽക്കുഴലിയാളെയുംകൊണ്ടുവന്നാവസിഷ്ഠരെ ക്കണ്ടവാറാനൃപന്നേറ്റംകണ്ണുകുളുർത്തു
ഉദക്പ്രവണോ യജ്ഞോ യത്രൈവംവിദ്ബ്രഹ്മാ ഭവത്യേവംവിദം ഹ വാ ഏഷാ ബ്രഹ്മാണമനുഗാഥാ യതോ യത
കഥാസങ്കുലിതാഃ കമന്യഃ വൃത്തേഷു കൃത്യേഷു ഭവന്നിരീക്ഷാസമാഗതാഃ പ്രത്യഹമത്യനന്ദൻ 41.8
സങ്കല്പിക്കുന്നു. ന്യൂട്രോണിൽ വൈദ്യുതചാർജില്ല. പ്രോട്ടോണും ന്യൂട്രോണുമായി
ഹസ്തിനമദ്ധ്യവാത്സു: ബാല്യാത് പ്രഭൃത്യാത്തഗുണേഷു തേഷു പ്രദ്വേഷവന്ത: കില
നല്ല വിവരമുള്ള ആളാണ്; കാര്യവിഘ്നത്തിനിടയാക്കാതെ സൂക്ഷിക്കും. ദ്വാരപാലിക : അമാത്യൻ
ഇരുപത്തിഏഴ് അദ്ധ്യായം ഇരുപത്തിആറ് അദ്ധ്യായം ഇരുപത്തിആറ് അദ്ധ്യായം ഇരുപത്തിഎട്ട്
കസ്തൂരീതിലകം മുദാ വിരചയൻ ഹർഷാത്‌കുചൗ സംസ്‌പൃശൻ
പ. മതി ചൂതുചതുരങ്ഗവും; രാക്ഷസരെന്തു ചതിയോ ചൊന്നതു നേരോ? അനു. ക്ഷിതിയിലുള്ളൊരു
(ബുഖാരി. 3. 41. 573) 4) ഹൂദൈഫ(റ) നിവേദനം: നബി(സ) അരുളി: ഒരാൾ മരണപ്പെട്ടു. അപ്പോൾ
വീണിടുമ്പോളതിസംഭ്രമം പൂ- ണ്ടാരോടിവന്നെന്നെയെടുത്തു വേഗാൽ സാരസ്യമേറും കഥ
മനസ്സുറച്ചു് അശ്വാരൂഢന്മായി തിരഞ്ഞെടുക്കപ്പെട്ട അഞ്ഞൂറു ഭടന്മാരോടുകൂടെ കിഴക്കേ
ഭവിഷ്യകാലം,ഭാവികാലം, വരുംകാ ലം. [൩൩൧. ] താൾ: 1868. 53 2014 വർഗ്ഗം:താളുകൾ - 1868
പ്രവേശിക്കുവാൻ ഒരു പുരുഷൻ അനുവാദം ചോദിക്കുന്നത് അവർ കേട്ടു. ഞാൻ പറഞ്ഞു:
ഉപദ്രവത്തിൽ നിന്നും അതി നാലുണ്ടാകാവുന്നതിന്റെ ഉപദ്രവത്തിൽ നിന്നും അതിനോട്
ആദിഭാഷ പല്ലുയിരൈ മുന്നീന്റ മാതാവപ്പാ പരിതിമുകം പെടുമിന്ത പാർതാനപ്പാ ചൊലുമിതിൻ
തസ്യാനുപൂർവ്യാ വിജ്ഞേയാ പഞ്ചാവസ്ഥാ പ്രയോക്തൃഭിഃ 7 പ്രാരംഭശ്ച പ്രയത്നശ്ച തഥാ
തൽപ്രതിഷേധാർത്ഥം = അവയെ തടുപ്പാനായി, ഏകതത്വാഭ്യാസഃ = (ചിത്തത്തെ) ഓരെ വിഷയത്തിൽ
നമഃ ഓം ഹൃദ്യായൈ നമഃ ഓം ഹേയോപാദേയ വര്ജ്ജിതായൈ നമഃ ഓം രാജരാജാര്ച്ചിതായൈ നമഃ ഓം
വോട്ട് രേഖപ്പെടുത്തുകഉപയോക്താവ്: തച്ചന്റെ മകൻ 06:40, 24 ജൂലൈ 2010 ( അനുകൂലം
ഘടോത്കചഃ 39 പ്രാദുശ്ചക്രേ മഹാമായാം ഘോരരൂപാം സുദാരുണാം മോഹയൻ സമരേ ദ്രൗണിം മായാവീ
വീരകേസരിപോലുള്ളഭിമന്യു ഘോരാരവത്തോടെ പാണ താൾ 16057 താൾ: 1921. 391 41016 താൾ: 1921.
നമസ്കാരംജമാഅത്തായി നിർവ്വഹിക്കാതെ ഗ്രാമത്തിലോ കുഗ്രാമത്തിലോ മൂന്നാളുകൾ
ഉദ്യോഗത്തിലാക്കിയാൽ അവരെല്ലാം പുരുഷന്മാർക്ക് മാനക്കേട് വരുത്തത്തക്കവിധത്തിൽ
മറ്റേതു മറയണമെങ്കിൽ അവ രണ്ടും ഭൂമിയിൽനിന്നും ഒരേ രേഖയിൽ ആയിരിക്കേണ്ടാത്തൂ്
സ്ഥിതോഽസ്മ്യഹം. ഈഹിതാനീഹിതൈർമുക്തോ ഹേയോപാദേയവർജിതഃ 51 കദാന്തസ്തോഷമേഷ്യാമി
149 1871. 150 1871. 151 1871. 152 1871. 153 1871. 154 1871. 155 1871. 156 1871.
ദേവകീനന്ദനായ ഓം തത്സദ്ഭൂർഭുവഃ സുവസ്തസ്മൈ വൈ നമോനമഃ 8 ഓം സമാനാത്മനേ ഓം
ജ്ഞേയാ വർധമാനസൢഅരാ ബുധൈഃ 92 ഏകസൢഅരോ ദൢഇസൢഅരശ്ച ത്രിസൢഅരോഽഥ ചതുഃസൢഅരഃ
പറഞ്ഞുകേട്ടി ട്ടതിവിഷണ്ഡനായ്പറഞ്ഞു ഭൂപതി അരക്ഷണം കൊണ്ടു സുമന്ത്രരേ ചെന്നു
201) 45) മുസയ്യബ്(റ) നിവേദനം: നബി(സ) യുടെ അടുത്ത് ഒരാൾ വന്നു. നിന്റെ നാമം
കാമുകിമാരെ നശിപ്പിച്ചു പരീക്ഷിച്ചു. അപ്പോൾ അവൻ ക്ഷമ കൈക്കൊണ്ടു. എങ്കിൽ അവരണ്ടിനും
എന്നിടത്തോളംകൊണ്ടു് അർത്ഥം പൂർത്തിയായിയിരിക്കെ ത്വം എന്നു് അർത്ഥസിദ്ധകർത്താവിനെ