എഴുത്ത് ഇല്ലാത്തവ */ താൾ: സംവാദം നടത്തിയ തിരുത്തലുകൾ നീക്കം ചെയ്തിരിക്കുന്നു;
മെതിയടികൾക്കു പറഞ്ഞുകേൾപ്പിച്ചോ- രനന്തരം വന്നു പുറത്തിരുന്നവൻ
രൂപപ്പെടുന്നതെന്നും അവർ സൂചിപ്പിക്കുന്നു. 'ഒരുക്കത്തിന്റെ ഒടുവിൽ' എന്ന കഥയിലെ
(നിന്നെ പുല്ലായിട്ടും കൂടെ അതായതു പുല്ലോളവും കൂടെ വിചാരിക്കുന്നില്ല), ഗ്രാമം
പുരോഗമിയ്ക്കുന്ന പുസ്തകമാണ്. സൂചിക: 1 1934. ആചാൎയ്യൻ ഒന്നാം ഭാഗം പണ്ഡിതൻ വി.യു
ഹദീസുകൾ/നബി(സ) പേരിൽ സ്വലാത്ത് ചൊല്ലൽ തിരഞ്ഞെടുത്ത ഹദീസുകൾ തിരഞ്ഞെടുത്ത
അന്യഥാ ക്ലിശ്യതേ ബ്രഹ്മന്ന സിദ്ധിഃ ഖേചരീപഥേ. യദഭ്യാസവിധൗ വിദ്യാം ന ലഭേദ്യഃ
പ്രകാശിച്ചിരുന്നു എങ്കിൽ ആ മഹിമയേ വീണ്ടു പ്രകാശിപ്പിക്കുന്നതിനുവേണ്ടി ചെയുന്ന
തത്+ചരതി=തച്ചരതി; സം+ചരതി= സഞ്ചരതി; തത്+ശാസ്ത്രം=തച്ചാസ്ത്രം; സന്+ശംഭുഃ=സഞ് ശംഭുഃ
അടിയൊന്നാരംഭം- 276 ആയിരംമാകാണി അറംപത്തിരണ്ടര- 263 264 പാഷാണം = 269 കുറുന്തോട്ടി=
ലാഞ്ഛിതം വാഞ്ഛിതം നഃ കട്ടി-ശ്ലോ മാലിനി യാം ദൃഷ്ട്വാ യമുനാം പിപാസുരനിശം വ്യൂഹോ
ഇരുന്നുവെങ്കിലും കുറേ ക്കാലം കഴിഞ്ഞശേഷം ബ്രാഹ്മണർക്കുകൊടുത്തു എന്നു
വസ്ത്രഭാണ്ഡത്തേ യും ധരിച്ചുകൊണ്ടാണു നിന്നത്.ഇങ്ങിനെ ശ്രീരാമൻ ചാരു മെത്തയും
താൾ:തപ്തഹൃദയം. 40 താൾ:തപ്തഹൃദയം. 41 താൾ:തപ്തഹൃദയം. താൾ:തപ്തഹൃദയം. താൾ:തപ്തഹൃദയം.
ദേവസാന്നിദ്ധ്യത്തിന് ഇപ്പോഴും അവിടെ യാതൊരു മാറ്റവും വന്നിട്ടില്ല. ആ ദേശക്കാർ
ലക്ഷ്യത്തോടുകൂടിയാണ് ഇന്ത്യയിൽ മുൻഷി പ്രേംചന്ദ് അദ്ധ്യക്ഷനായി പുരോഗമനസാഹിത്യസംഘടന
കിഷ്ക്കിന്ധാകാണ്ഡം ടെ ആശ്രമത താൾ 35021 താൾ: 1922. 70 തെറ്റുതിരുത്തൽ വായന
ഇരിപ്പുതാക ആമെൻ. 100 10 10 100 2014 991 വർഗ്ഗം:താളുകൾ - 1868 താൾ: 1868. 311
തിരുമനസ്സുകൊണ്ടു കൽപിച്ച് ഉണ്ടാക്കിയത് 0.5 തൃശ്ശിവപേരൂർ ഭാരതവിലാസം അച്ചുകൂടത്തിൽ
ചെന്നു വണങ്ങേണമെനി- ക്കതിതാപം പോവാനതിനുചൊല്ലുക പിതാവു സ്വർഗ്ഗത്തിലെഴുനള്ളുന്നേരം
വർഗ്ഗം:രാജയോഗം (കുമാരനാശാൻ രാജയോഗം (കുമാരനാശാൻ)/അനുബന്ധങ്ങൾ/വ്യാസസൂത്രങ്ങൾ
ജയജയസൂര്യകുലമുടിമണേ! ഗുരുവായിട്ടുള ദശരഥനൃപൻ വരസുതൻ തന്നെയരണ്യത്തിലാക്കി
വിചാരിച്ച് അടുത്ത ദിവസംതന്നെ ചെങ്ങണംകുന്നത്ത് ഭഗവതിക്ഷേത്രത്തിലെത്തി ഭജനം
രചയിതാവ്:ഫ്രെഡറിക്ക് എംഗൽസ്" / രചയിതാവ്:ഫ്രെഡറിക്ക് എംഗൽസ് എന്ന താളിലേക്ക്
കൊമേഴ്സ് പഠിക്കാൻ കഴിയില്ലെന്ന്. അങ്ങനെ ഞാൻ പത്രപ്രവർത്തനത്തിലേക്കു തിരിഞ്ഞു.
ദൃഷ്ടിപ്രദാനേന രാജ്ഞഃ സന്ത്രാതും അർഹസി മഹാഭാരതം മൂലം/ആദിപർവം/അധ്യായം170 വ്യാസൻ
പുതിയ അപ്‌ലോഡുകൾ 1 ലേഖനേതര നാമമേഖലകൾ] പ്രത്യേകം:രേഖ/ തലക്കെട്ട് മാറ്റലുകൾ
എന്നും സിദ്ധിച്ചു. ഉത്തമപുരുഷദ്വിവചനത്തിൽ ല് എന്നതിനു വസ് വന്നു
പുനരുജ്ജീവനത്തിനും ആവശ്യമായ നടപടികൾ ശുപാർശ ചെയ്യുക. പരിസ്ഥിതി (സംരക്ഷണ)
ഹംസഃ സാക്ഷാന്നാരായണോ യതിഃ. ഏകരാത്രം വസേദ്ഗ്രാമേ നഗരേ പഞ്ചരാത്രകം 14
ജീവന്മുക്തപദം ത്യക്ത്വാ സ്വദേഹേ കാലസാത്കൃതേ. വിശത്യദേഹമുക്തത്വം പവനോഽസ്പന്ദതാമിവ
 പ്രഭുക്കളാകിലുമിതൊന്നുചെയ്യുമ്പോൾ പലർ ്കും ചേരുമെന്നിരിക്കിലേയാവൂ
അടുത്തേക്ക്പറഞ്ഞയച്ചു. അദ്ദേഹത്തിൽ നിന്ന്‌ നമസ്കാരത്തിൽവെച്ച്‌ മുആവിയാ(റ)വിന്‌
രാമചന്ദ്രവിലാസം/പതിനെട്ടാം സർഗം രാമചന്ദ്രവിലാസം 2 അഴകത്ത് പത്മനാഭക്കുറുപ്പ്
/ കുചേലവൃത്തം വഞ്ചിപ്പാട്ട് എന്ന താളിലേക്ക് തിരിച്ചുവിടുന്നു കുചേലവൃത്തം
സംസേവതേ പിതൃഗണപ്രവരോ ഋയമായം തം ത്വാം ഭജാമി ഭഗവൻ പരചിന്മയാത്മൻ 21.7 കിം ചോത്തരേഷു
127.0.0.1 127.0.0.1 2 2 2 2 2 2 05:59, 7 2008 ( 255.255.255.255 05:59, 7 2008 ( 2
രാമാനുജ കടമ്പിന്റെ ചുവട്ടീന്നു കാമദേവപടു കടവുകളിക്കുന്ന കണ്ണു തങ്കും ഉടലൊടു
കേണ് തൃക്കൺതുടയ്ക്കുവതിനാദ്യമെടുത്തു ശേഷ- മുൾക്കൊള്ളുമെന്നു കരുതുന്നിതപുത്രനാം
പുനഃപുനസ്തദ്വദേവ പശ്ചിമദ്വാരലക്ഷണം. പൂരിതസ്തു സ തദ്ദ്വാരൈരീഷത്കുംഭകതാം ഗതഃ 121
ചെയുന്നതു തന്നെയാണ് ബുദ്ധിക്കു ശ്രഷ്ഠതയായിട്ടുള്ളത്. ഇദ്ദേഹം തന്നെ ഒരു
നമസ്കരിച്ചിരുന്നു. (മുസ്ലിം) ഉമ്മുഹബീബ(റ)യിൽ നിന്ന്‌ നിവേദനം: റസൂൽ(സ) പറഞ്ഞു:
അരുളി: ചൂട്കഠിനമായാൽ അതിന്‌ ശാന്തത്ത വന്ന ശേഷം നിങ്ങൾ നമസ്കാരം നിർവ്വഹിക്കുക.
സ്വാഹേത്യഗ്നാവാജ്യസ്യ ഹുത്വാ മന്ഥേ സമ്പാതമവനയേദായതനായ സ്വാഹേത്യഗ്നാവാജ്യസ്യ
അപൂർണമായ വിവരശേഖരണമാണെന്ന്‌ പശ്ചിമഘട്ട ആവാസവ്യവസ്ഥ വിദഗ്‌ധസമിതി വിലയിരുത്തുന്നു.
ജൂൺ മുതൽ സെപ്‌തംബർ വരെ നല്ല മഴ ലഭിക്കും. ഈ നദീതടം നിത്യഹരിതവനങ്ങളുടേയും
തെറ്റുതിരുത്തൽ വായന കഴിഞ്ഞവ */ സമരങ്ങളിലൂടെ ലഭിച്ചവയാണ് - ആരുടെയും സൗജന്യമല്ല.
 തുടങ്ങിയിട്ടില്ല ഫലകം: താൾ സൃഷ്ടിച്ചിരിക്കുന്നു ഫലകം: 20 പുരോഗമിക്കുന്നു ഫലകം:
മൃഗത്തിൻ പ്രതിമെക്ക് ആത്മാവ് കൊടുപ്പാനും മൃഗപ്രതിമ ഉരിയാടി ആ പ്രതിമയെ
ത്തേയും വെക്കയും ചെയ്യുവിൻ. കുറിപ്പുകൾ വർഗ്ഗം:രാജയോഗം (കുമാരനാശാൻ രാജയോഗം
ഹസ്തിയൂഥം ഉപാഗമത് പാനീയാർഥം ഗിരിനദീം മദപ്രസ്രവണാവിലാം 7 മാർഗം സംരുധ്യ സംസുപ്തം
കൎത്താവിന്റെ നേൎവഴികളെ നീ മറിച്ചുകളയുന്നതു നില്ക്കയില്ലയൊ? ഇപ്പോൾ കൎത്താവിൻകൈ
കേൾക്കയാൽ പെരിയ മോഹത്താൽ നിരൂപിക്കാതെ ഞാൻ പരത്യജിച്ചല്ലോശിവ! ശിവ! സൂത!
വടിവേറും നൃപവരാസനത്തേയും കുടയും ചാമരയുഗവും കൂടവെ പ്രദക്ഷിണം വെച്ചു നമസ്കരിച്ചുട-
ഹ്യംബുബിന്ദുർമൃഗതൃഷ്ണികായാം 404 മായാമാത്രമിദം ദ്വൈതമദ്വൈതം പരമാർഥതഃ ഇതി ബ്രൂതേ
മസ്തകിനസ്തഥാ ചൈവ കിരീടിനഃ ത്രിവിധോ മുകുടോ ജ്ഞേയോ ദിവ്യപാർഥിവസംശ്രിതഃ 140
അവരെ സംബന്ധിച്ചും നമ്മെ സംബന്ധിച്ചും അവതരിപ്പിക്കപ്പെട്ടതാണ്. ഇത് എന്റെയും
ചരിയ്ക്കുന്നുവെന്നതു ചിത്രമല്ലേതും ജഗത്തിലറിഞ്ഞിതോ?
ക്ഷത്രധർമാദ് ധി ശ്രേയാംസം സാധു ചാരിണാം അനാഗസം പ്രജാനാനാഃ പ്രമാദാദ് ഇവ ജൽപഥ 6
ചെല്ലൂ. അയിസഖി ശ്ളോകം. 14 സുലളിതപദവിന്യാസാ രുചിരാലങ്കാരശാലീനീ മധുരാ മൃദുലാപി
നിരോധിച്ചിരിക്കുന്നു ഇനി സഭകൾ കൂടി പ്രസംഗങ്ങൾ ചെയ്തിട്ട് ആവശ്യമില്ല. അടുത്ത
നാട്ടിലെ ബഹുഭൂരിപക്ഷം സ്ത്രീകളും അനുഭവിക്കവെ, ചില വിഭാഗക്കാർമാത്രം
1877. 87 1877. 88 1877. 89 1877. 90 1877. 91 1877. 92 1877. 93 1877. 94 1877. 95
വരമന്ത്രിജനമവരെയുമെല്ലാം ധരം സുതന്മാരും ജനപദേശന്മാർ ധരാപതികളും മുനിവരൻ തന്റെ