തിരുള്ളാക്കേടു വളരെയുണ്ടാമെന്നൊരുശങ്കകൊണ്ടു കുലവിനാശിനീ തവ വധം ചെയ്‌വാൻ
പ്രത്യേകതയുണ്ട്. ഇവ സചേതനവസ്തുക്കളെപ്പോലെയും അചേതന വസ്തുക്കളെപ്പോലെയും
ശ്ചരണേ കോമളതാണ്ഡവം കുമാരം കട്ടി-ശ്ലോ വസന്തമാലിക 16 അമുനാഖിലഗോപഗോപനാർത്ഥം
നടന്നിട്ടില്ലാത്തവ */ ' ലക്ഷ്മീകര കസ്തൂരിഗുളികകൾ താംബൂലം ഉപയോഗിക്ക താൾ താൾ: 1942.
പത്രങ്ങൾക്ക് മാത്രമല്ല, മറുനാട്ടിലിരുന്നച്ചടിച്ച് മൈസൂരിനകത്ത്
ഏത് ഒരുത്തൻ ഈശ്വരനാകുന്നു. പരിഭാഷ - ഗുണാനുവർണ്ണം - ഗുണസങ്കീർത്തനം. ചതുരാ നനാദികൾ
ഉപദ്രവങ്ങളാണ് ചെയ്യുക പതിവ്. ഭക്തവത്സലനായ ഭഗവാനു ഭക്തന്മാരുടെ അടുക്കൽ
വിൻ' ഇതി വാചാ സഹിതാ ശുചാ ദമ മദാന്തസോദ രി യു- മതി താ ന്ത യാ രൊ ടൂചേ; തിരക ദിശി
രഘുപതേ ഹരേ ജയ ജയേത്യലം മുഷ്ടിഭി- ശ്ചിരം തവ സമർചനം വ്യധിത ഭക്തചൂഡാമണിഃ 80.5
ഏതത്പഞ്ചാഗ്നിരൂപം യോ ഭാവയേദ്ബുദ്ധിമാന്ധിയാ. തേന ഭുക്തം ച പീതം ച ഹുതമേവ ന സംശയഃ
 ചേർത്തവയെന്നു തോന്നുമാറു അവ പ്രത്യേകിച്ചു ഘടിപ്പിച്ചിരിക്കുന്നതായും
തത്സാധു പദമാസാദയസ്യലം 75 സത്താസാമാന്യരൂപേ വാ കരോഷി സ്ഥിതിമാദരാത്.
വർഗ്ഗം:കൃതികൾ_വർഷം_അനുസരിച്ച് വർഗ്ഗം:1902-ലെ കൃതികൾ വർഗ്ഗം:കൃതികൾ_വർഷം_അനുസരിച്ച്
ദേവാർഹാ മാനുഷാ ഭോഗാഃ പ്രാപ്താ അസുലഭാ നൃപൈഃ ഐശ്വര്യം ചോത്തമം പ്രാപ്തം കോ നു
15 153, 153, 153); 153, 153, 153); 153, 153, 153); അമ്മ ഇല തറ പറ പശു ആന 153, 153,
ഗ്രാമപഞ്ചായത്തുകളും ഡാറ്റാബേസ്‌ പ്രകാരം മേഖല ഒന്നിൽ ഉൾപ്പെട്ട പ്രദേശങ്ങളുടെ ഒരു
തിരിച്ചുവിടുക വിക്കിഗ്രന്ഥശാല:വിക്കിപദ്ധതി/പുസ്തകപ്പട്ടിക രാമചന്ദ്രവിലാസം/മൂന്നാം
അവകാശമേ ഇല്ലെന്നു വരും. മുൻകാണിച്ച മഹാഭാരതസംഗ്രഹവാക്യത്തിലെപ്പോലെ ക്രിയകളെ
മന്തവ്യേ യശ്ചന്ദ്രേ യോ നാഡ്യാം യഃ പ്രാണേ യോ വിജ്ഞാനേ യ ആനന്ദേ യോ ഹൃദ്യാകാശേ യ
ഇനമാണിത്‌. 3. വികസന പദ്ധതികൾ പഞ്ചഗണി, മഹാബലേശ്വർ, ടൗൺഷിപ്പ്‌ അടക്കമുള്ള വികസന
ബോധി ക്കേണം; ഘ്യതവും മധു ഗുളവും ക്ഷീരവും നിന ക്ക ധീ നം, പചി ക്കേണം ഭൂസു രരെ ഭുജി
നിന്ന് ഒരു പതിപ്പ് ഫലകം: ഫലകം: എന്നതിൽ നിന്ന് ഒരു പതിപ്പ് ഫലകം: ഫലകം: എന്നതിൽ
അനുഭവമായിരിക്കേ ആ നാണ്യങ്ങളെ ധനമെന്നുപറയുവാൻ പാടില്ലെന്നു വ്യവഹരിക്കുന്നതു
മമദേശേ ന കിഞ്ചന ദ്വിജസ്ത്രീയോജനാസ്സർവ്വേ ക്രീഡായാമ ദ്വിജോത്തമാഃ
തസ്മാത്പ്രശസ്തിർവപുഷോ സ്യ ജാഗരേ 89 സർവാ പി ബാഹ്യസംസാരഃ പുരുഷസ്യ യദാശ്രയഃ വിദ്ധി
എങ്ങനെയതെന്നുടൻ ചോദിച്ചു ദമനക,- നെങ്കിൽ നീ കേൾക്കെന്നുര ചെയ്തിതു കരടകൻ.
കൃഷിഭൂമിയിൽ വൃക്ഷങ്ങൾ വളർത്തിയെടുക്കേണ്ടതായും വന്നു. ഇന്ത്യ ഉപഭൂഖണ്ഡത്തിൽ
സംഖ്യയില്ലായ്കയാൽ അവിടം ശൂന്യസ്ഥാനമാകുന്നൂ, അതിന്നുനേരെ ഗുണ്യത്തെ വെയ്ക്കേണ്ടാ,
1914. 65 തെറ്റുതിരുത്തൽ വായന കഴിഞ്ഞവ */ 2014 താൾ: 1914. 66 തെറ്റുതിരുത്തൽ വായന
ഇങ്ങനെയിരിക്കവേ ഈ മലയാളി നായന്മാരിൽ ശൂദ്രശബ്ദാരോപണം ചെയ്വാൻ, പ്രമാണ
ദുഃസഹം വാജിണാ സംഖ്യേ പരാജിഗ്യേ ഭൃഗോഃ സുതം 55 ദ്രൗണിം പരാജിത്യ തതോ ഽഗ്രധന്വാ;
ആ ബ്രഹ്മം താൻതന്നെയാകയാൽ തനിക്കു തന്റെ അനുഭവം ഉണ്ടാവുകയെന്നത്
അനാദികർതൃത്വം ഇല്ലാത്തവനെന്നും അനാദിയേ കർതൃത്വം ഇല്ലാതിരുന്ന ചില കാലങ്ങൾക്കു
16 ഭൃഗവസ് തു ദദുഃ കേ ചിത് തേഷാം വിത്തം യഥേപ്സിതം ക്ഷത്രിയാണാം തദാ താത കാരണാന്തര
ഛിന്നധന്വാനം പുനർ വിവ്യാധ പഞ്ചഭിഃ 9 വിന്ദാനുവിന്ദൗ ച തഥാ ത്രിഭിസ് ത്രിഭിർ അതാടയത്
തു ശക്രം പ്രസമീക്ഷ്യ ദേവോ; ജഹാസ ശക്രം ച ശനൈർ ഉദൈക്ഷത സംസ്തംഭിതോ ഽഭൂദ് അഥ
താൾ: 1902. 58 സാധൂകരിച്ചവ */ കർണ്ണൻപെട്ടാൽ പടയില്ല- 955 കാര്യം കാണാൻ കഴുതക്കാലും
അവിടത്തെ വന്യതയെ പരിരക്ഷിപ്പാൻ സംക്രമിച്ചുതുടങ്ങിയ ശാർദ്ദൂലാദി ഹിംസ്രമൃഗങ്ങളെ, ആ
കൃഷ്ണരായരുടെയും ചേരമാൻ പെരുമാളുടെയും കഥ കൃഷ്ണരായരുടെയും ചേരമാൻ പെരുമാളുടെയും കഥ
തര്യംബകം തൊഷ്യ യുദ്ധേ അവാപ തത പാശുപതം മഹാസ്ത്രം; തദാ നാശംസേ വിജയായ സഞ്ജയ 110
മതിരുചിരമാക്കുന്നതൊന്നിസ്മരണതാൻ! വിധിയൊടൊരുമട്ടൊക്കെ മല്ലടിച്ചീവിധം
ഇപ്പോൾ അദ്ദേഹത്തിന്റെ ആഗ്രഹത്തെ സാധിപ്പിപ്പാനായി അങ്ങു പ്രയത്നം ചെയ്യേണം 2014 17
വീതവും തരികയും ചെയ്യാമെന്ന് ഈ മനുഷ്യൻ സമ്മതിച്ചിട്ടുണ്ട്. അതിനാൽ എന്റെ കുട്ടൻ
നബി(സ)യുടെ അടുത്തുവന്ന് ആളുകൾ കച്ചവടത്തിൽ തന്നെ വഞ്ചിച്ചു കളയുന്നുവെന്ന്
കെട്ട് 4. മധ്യമബന്ധം (ന ടുത്തരം മടക്ക് കെട്ട്ശിഖയെ കീഴ് വക്കിന്റെ മധ്യ ത്തിൽ
ചേർന്നു അഭൂ+ല് എന്നും ച്ലി ലു എന്ന സൂത്രത്താൽ ഭൂ എന്നതിനും ല് എന്നതിനും ഇടയ്ക്ക്
ഒരുത്തനായാൽഒരുത്തിവേണ്ടെ, പിന്നെവേണ്ടെ, പിന്നെവേണ്ടെ- 696 ഒരുത്തനും കരുത്തനും
ഇടയായിട്ടുള്ളതിൽ എന്താണ് അത്ഭുതം? തന്റെ പ്രജകളിൽ സകലവർഗ്ഗക്കാരും പരിശീലനം
ഇരു കരം കൂപ്പി നെടു വീർപ്പു മു നി യന്നു വിന മൊടു വണങ്ങി നില്പ രെ ന്നിതു കേൾപ്പൂ
തമ്പുരാൻ ഏഴാമദ്ധ്യായം ആറാമദ്ധ്യായം ആറാമദ്ധ്യായം എട്ടാമദ്ധ്യായം എട്ടാമദ്ധ്യായം
നിഴൽ നല്കും. നീതിമാനായ ഭരണാധിപൻ, ദൈവാരാധനയിൽ വളർന്ന യുവാവ്, ഹൃദയം എപ്പോഴും
പരമാക്ഷരവൈഭവം ഓം പൂർണമദഃ പൂർണമിദം പൂർണാത്പൂർണമുദച്യതേ. പൂർണസ്യ പൂർണമാദായ
കേന്ദ്രമാണെന്ന ധാരണ ചോദ്യം ചെയ്യപ്പെടുന്നു. പക്ഷേ കോപ്പർനിക്കസിനും ബ്രൂണോയ്ക്കും
കിടന്നു. പലതും പയറ്റിനോക്കി. അതു് എണീറ്റില്ല. അവസാനം ജീനി ശിവരാമമേനോൻ
പുനർനിമിത്താപായേ ച ശാന്ത ഏവോപലീയതേ ഏവം നവരസാ ദൃഷ്ടാ നാട്യജ്ഞൈർലക്ഷണാന്വിഅതാഃ ]
ചെയ്യുമെങ്കിൽ വിശപ്പിന്റെ ശക്തിതന്നെ അലസതയെ ഭക്ഷിച്ചുകളയും. ഇന്ത്യയിൽ ജനങ്ങൾ
നാവാലുരചെയ്യുവാൻ പണി; എന്നെത്യജിപ്പാനറിയിച്ചിടുന്നു ഞാൻ; പിന്നെ പ്രമാണം
മാറ്റം: ആമയും പക്ഷികളും ഈസോപ്പ് കഥകൾ/ആമയും പക്ഷികളും: വർഗ്ഗീകരണം തിരിച്ചുവിടുക
മൃതസഞ്ജീവനി മുതലായ ദിവ്യസിദ്ധിപ്രയോഗങ്ങളാൽ കാര്യങ്ങൾ നിർവ്വഹിതമായി
നിങ്ങളുടെ രക്തവും ധനവും അഭിമാനവും ഈ ദിവസംപോലെ ഈ രാജ്യം പോലെ ഈ മാസം പോലെ
1893. 57 1893. 58 1893. 59 1893. 60 1893. 61 1893. 62 1893. 63 1893. 64 1893. 65
അലപല്ലവസൂചീം ച കൃത്വാ വിക്ഷിപ്തമേവ ച 179 ആവർതിതം തതഃ കുര്യാത്തഥൈഅവ ച നികുട്ടകം
പറഞ്ഞയച്ചതായി പുരോഹിതൻ സോമരാതനോട് ചെന്ന് പറയൂ. ഞാനും തപസ്വികളെക്കാണ്മാൻ ഉചിതമായ
പശ്ചിമഘട്ടമലനിരകളുടെ നെറുകയിലേക്ക്‌ റോഡുവെട്ടി അവിടെ കാറ്റാടിയന്ത്രങ്ങൾ (