മന്ത്രികോപനിഷത് ഉപനിഷത്തുകൾ വർഗ്ഗം:ഉപനിഷത്തുകൾ ഉപനിഷത്തുകൾ/മുക്തികോപനിഷദ്
ആദായങ്ങളെടുക്കുന്നത് അപ്പോഴത്തെത്തരംപോലെയും അവരവരുടെ സാമർത്ഥ്യംപോലെയുമായിരുന്നു
ഇതിലൂടെയുണ്ടായി എന്ന് പല പണ്ഡിതന്മാരും അഭിപ്രായപ്പെടുന്നു. 1960കളോടെ പുതിയ
മൂന്നു വിരലുകളും നക്കാറുണ്ട്. അനസ്(റ) പറയുന്നു. നബി(സ) പറയുകയുണ്ടായി. നിങ്ങളിൽ
ളുദ്രസം തവ പാദപല്ലവം കെടുത്തട്ടേ! മൽപ്രിയേ, ശുഭശീലേ, മൃദുമാനസനാകും
കുടിക്കാമെന്നോ തോന്നന്നുണ്ടോ? എന്നു പറഞ്ഞു. മി. ചാക്കോയെ കൊണ്ടുവന്നിരുന്നവർ
അധർമ്മചാരിയും അനിയന്ത്രിതനുമായുള്ള കുഞ്ചുമായിറ്റിപ്പിള്ള ഭാര്യാപുത്രികളുടെ
താമസേ ഹേതുരേഷജരഠൻ. അംബരീഷചരിതം കഥകളി. എന്നാൽ, മണ്ടന്തി പാന്ഥനിവഹാഃ പടിബന്ധപേട്യാ
മേന്മേലിന്നെന്നിലെരിയുന്നല്ലോ, നാഥേ! ഉഗമായ്പ്പേർത്തും പേർത്തുമുയരും തജ്ജ്വാലക-
ശക്തമായപ്പോഴാണ് സ്ത്രീകൾ മേൽവസ്ത്രം നിർബന്ധമായും ഇട്ടുതുടങ്ങിയത്. ഈ തോന്നൽ
വർഗ്ഗം:താളുകൾ - 1930 താൾ: 1930. 171 വർഗ്ഗം:താളുകൾ - 1930 താൾ: 1930. 170
വിൽ നിന്ന് നിവേദനം: അദ്ദേഹം പറഞ്ഞു. എന്റെ അധീനതയിൽ ഒരു സ്ത്രീ ഉണ്ടായിരുന്നു. ഞാൻ
കീഴ്പ്പോട്ട് അമർന്നു. അപ്പോൾ കൈലാസപർവ്വതത്തിങ്കലുള്ള വള്ളികളിൽ രാവണന്റെ കൈകൾ
പ്രത്യക്ഷമാകയും ചെയ്യുന്നു. 16പം സൂത്രത്തിൽ വർണ്ണിച്ചിരിക്കുന്ന പ്രകാരമുള്ള ഈ
 മഷി ചേരവേ പാരിടത്തിന്നു വന്നല്ലോ-ഭാഗധേയം നമസ്‌തവും. മരങ്ങളഞ് ുതാൻ
അന്യദേശക്കാർ തങ്ങളുടെ രാജ്യത്തെ ആക്രമിക്കുകയും ചെയ്യുന്നുവല്ലോ; നമ്മുടെ
മറ്റും ശരണം പ്രാപിച്ചു രക്ഷപ്പെടാൻ തുനിഞ്ഞിട്ടും ആവശ്യമില്ല. നീലകണ്ഠദീക്ഷിതർ
എന്തതിൻമൂലം? പൂരിത. പദം 22 നാരദൻ: വിദർഭമന്നവനുണ്ടങ്ങനല്പസദ്ഗുണാ കന്യാ
തു ശുദ്ധം രക്തം വിചിത്രിതം] ദിവ്യാനാം ഭൂഷണവിധിര്യ ഏഷ പരികീർതിതഃ 52 മാനുഷാണാം തു
പോരുന്ന വീഥിയിൽ ഭീതിദമായിക്കരഞ്ഞുനരികളും നീതിമാൻ കേട്ടുടൻ നണ്ണിനാനിങ്ങിനെ
പറഞ്ഞു. അപ്പോൾ നബി(സ) പറഞ്ഞു: നിനക്ക് നാശം. നിന്റെ സ്നേഹിതനെ നീ കഴുത്തു മുറിച്ചു
വാക്യം അബ്രവീൻ മധുരാക്ഷരം 70 പശ്യ ഭീമ ശുഭാൻ ദേശാൻ ദേവാക്രീഡാൻ സമന്തതഃ അമാനുഷ ഗതിം
ചെന്നപ്പോൾ പരശുരാമനാൽ പ്രതിഷ്ഠിക്കപ്പെട്ടിരുന്ന വിഗ്രഹം കണ്ടെത്തി. എങ്കിലും
താൾ:ഇടപ്പള്ളി സമ്പൂർണ്ണ കൃതികൾ. 75 വനജ'യെ മറക്കുവാനാളല്ല ഞാൻ ദൃഢം.
യ്യുന്നതു കുടുംബക്ഷേമത്തിന്ന് അത്യാവശ്യമായിട്ടു ള്ളതാണെന്നാണ് തോന്നുന്നത്.
മറിച്ചും ജനിപ്പതുണ്ടൽപ്പം. എല്ലാവരും പോയി) വർഗ്ഗം:മലയാളശാകുന്തളം പ്രമാണം:പഴയ-ഈ.
കുപ്രസിദ്ധിനേടിയ ബങ്കാളത്തെയാണ് തിരുമേനികൾ സന്ദർശിച്ചതെന്നു ആരും പറയുന്നതല്ല.
വിഷയേഭ്യഃ പരാവർത്യ സ്ഥാപനം സ്വസ്വഗോലകേ ഉഭയേഷാമിന്ദ്രിയാണാം സ ദമഃ പരികീർതിതഃ
കൃപാപരൻ പരൻ നൃപകുലവരൻ അനംഗസുന്ദരൻ മൃംഗസുസ്വരൻ സുമംഗലാചരനംഗലഹരൻ രമണീമോഹനൻ
ചെയ്യുന്ന പോരായ്കയോ ചേതംമറ്റവനാകയോ ചെവികളിൽ ശ്ലോകങ്ങളെത്തായ്കയോ പെയ്തീടും
കണ്ണൻ മാൻപേട: വർഗ്ഗീകരണം ശരിയാക് തിരിച്ചുവിടുക ഈസോപ്പ് കഥകൾ/ഒറ്റ കണ്ണൻ മാൻപേട
ജുരഇ ചർച്ചതി ചമ്പ ഇ ത്രസ്യതി വ മാർഷ്ടി ലുഭഇ സുപഇ ഇവ ഉദാഹരണങ്ങൾ. ഖേദിക്കുന്നു,
നമ്പൂതിരിപ്പാടന്മാർ എന്നു സമ്മതിച്ചു. പിന്നെയും രണ്ടുപേരുംകൂടി വളരെ നേരം
പ്രക്ഷ്യന്തി മാമിമേ മഹാശാലാ മഹാശ്രോത്രിയാസ്തേഭ്യോ ന സർവമിവ പ്രതിപത്സ്യേ
സ്വഫാ-മർവ്വായ്ക്കിടയിൽ നടന്നശേഷം ഇഹ്റാമിൽ നിന്ന് പൂർണ്ണമായും വിരമിച്ചുകൊള്ളട്ടെ.
പരീക്ഷായുദ്ധത്തിന് പാക്കിൽ പട എന്നാണ് പേരു പറഞ്ഞുവന്നിരുന്നത്. ഈ യുദ്ധത്തിനായി
സംസ്കൃതത്തിലില്ല. സംസ്കൃതത്തിൽ തകാരത്തോടും നകാരത്തോടും ചകാരശകാരങ്ങൾ ചേരുമ്പോൾ
280 2014 വർഗ്ഗം:താളുകൾ - 1868 താൾ: 1868. 619 991 2014 991 വർഗ്ഗം:താളുകൾ - 1868
നടന്നിട്ടുണ്ട്. ഇന്ത്യയിലെ ആദ്യത്തെ സ്ത്രീസംഘടനകളിലൊന്നായിരുന്ന അഖിലേന്ത്യാ
ഗുജറാത്തിന്റെ ഭാഗമായ തെക്കേ മാർവാഡിൽ ഭിലമാല എന്ന സ്ഥലത്ത് 598ൽ ആണ്
ഗഗനസ്യേവ പരബ്രഹ്മണോഽപി ജഡത്വമാപദ്യേത. തസ്മാത്പരബ്രഹ്മണഃ പരമാർഥതഃ സാകാരനിരാകാരൗ
മൊരുമിച്ചുകൂടിചരിക്കനാമെന്നും നരപതിരാമൻ വനേ ഗമിക്കുമ്പോൾ
തലക്കെട്ട്1 കാന്ത വൃത്തം 40 10 10 40 കൊടുങ്ങല്ലൂർ കൊച്ചുണ്ണിത്തമ്പുരാൻ
തലത്തിൽ വേണ്ടത്ര ശേഷിയില്ല. തോട്ടങ്ങളിലും വനങ്ങളിലും വാതകങ്ങൾ സൃഷ്‌ടിക്കുന്ന
അബൂമൂസ(റ)യിൽ നിന്ന് നിവേദനം: റസൂൽ(സ) തറപ്പിച്ചു പറഞ്ഞു: ഒരാളുടെ സന്താനം
താൾ: 1877. 52 താൾ: 1877. 108 താൾ: 1877. 68 താൾ: 1903. 33 കൽക്കട്ടായിലെ ഇന്ത്യൻ
സംരക്ഷണമൂല്യമുള്ളതായി കണക്കാക്കപ്പെടുന്ന പ്രദേശങ്ങളും അവയിലെ സവിശേഷമായ
ശൂദ്രനും. ബ്രഹ്മവാ ഇദമഗ്ര ആസീത്' ബൃഹ. ഉപനിഷത്ത് അർത്ഥം: ആദ്യം ബ്രഹ്മമെന്ന ഒരു
പരിപ്രീതാഃ യാതാഃ ഖലു ഭവദുപേതാ വ്രജജുഷോ വ്രജം യാവത്താവന്നിജമഖവിഭംഗം നിശമയൻ ഭവന്തം
ച രാജാ; ധർമശ് ച സൂക്ഷ്മോ നിപുണോപലഭ്യഃ വാചാപി ഭർതുഃ പരമാണു മാത്രം; നേച്ഛസി ദോഷം
അംഗീകരിക്കപ്പെടാത്തവർക്ക് അപ്പോഴും ചരിത്രത്തിനു പുറത്തുതന്നെ നിൽക്കേണ്ടിവന്നു.
ഖല്വ് അസി ന വ്യാപന്നസ് തസ്മിൻ നാഗഭവനേ സ ചാപി മമ സഖാ ഇന്ദ്രഃ 176 തദ് അനുഗ്രഹാത്
പിംഗജടാജൂടമണ്ഡലമണ്ഡിത പങ്കജബാണാന്തകനമസ്തേസദാ. ഇങ്ങിനെവ്യാസാദിയായമുനിജനം
ഗൗരീമംബാമംബുരുഹാക്ഷീമഹമീഡേ ശ്ലോ 7 യസ്യാമോതം പ്രോതമശേഷം മണിമാലാ- സൂത്രേ
ഭവാവസ് എന്നും നിത്യം 117 ആദിഭാഷ ിതഃ ന്ധ-ന്ധ-99) എന്ന സൂത്രത്താൽ സ് എന്നതിനു ലോപം
അങ്ങിനെ പറയരുത്, അത് അവന്ന് അനുകൂലമായി പിശാചിനെ സഹായിക്കലായിരിക്കും. (ബുഖാരി. 8.
നിയമവിരുദ്ധമായി ജനങ്ങൾക്ക്‌ പ്രവേശനം നിഷേധിച്ചുകൊണ്ട്‌ വനംവകുപ്പ്‌ കാറ്റാടിയന്ത്ര
ഞങ്ങളുടെ നെഞ്ചുകളും ചുമലുകളും ശരിയാക്കി ഒരുഭാഗത്തുനിന്ന്‌ മറ്റൊരു ഭാഗം വരെ
അവനൊഴികെ മറ്റാരുമില്ല എന്നു പറഞ്ഞപ്പോൾ യേശു ശരിതന്നെയെന്നു സമ്മതിച്ചു. (യോഹന്നാൻ
അപഗ്രഥനം, കേന്ദ്ര-സംസ്ഥാന മലിനീകരണ നിയ ന്ത്രണ ബോർഡുകൾ, തീരദേശനിയന്ത്രണ മേഖല,
സ്ഥിരമായില്ല. ഒരു ദിക്കിൽ താമസമാക്കിയിരുന്ന മുഹമ്മദീയരുടെ ഉപദ്രവം
സർവം ത്വമേവ സർവം ത്വമേവ സർവം. ത്വമേവ മോക്ഷസ്ത്വമേവ മോക്ഷദസ്ത്വമേവാഖിലമോക്ഷസാധനം
വേണ്ടായിരിന്നു. കുട്ടിയെ തിരികെ തന്നുകൊൾക അപ്പോൾ ധർമ്മരാജാവ്‌ പറഞ്ഞു: ഞാൻ
മനഃ പ്രശമമായാതി നിർവാണമവശിഷ്യതേ 32 യതോ വാചോ നിവർതന്തേ വികൽപകലനാന്വിതാഃ.