ഹാര്ദ്ദ തമോ ഭേദ ഭാനുമദ്ഭാനു സന്തത്യൈ നമഃ ഓം ശിവദൂത്യൈ നമഃ ഓം ശിവാരാദ്ധ്യായൈ നമഃ
ദ്രൗണിഃ പാഞ്ചാല ദായാദം അഭ്യവർഷദ് അഥേഷുഭിഃ 5 ധൃഷ്ടദ്യുമ്നം തു സംസക്തം ദ്രൗണിനാ
വ്യവഹാരാർഥം യസ്യ സഞ്ജ്ഞാ മഹാത്മനഃ 45 യഥാ കടകശബ്ദാർഥഃ പൃഥഗ്ഭാവോ ന കാഞ്ചനാത്. ന
അവിടെയുണ്ടായിരുന്നവരെല്ലാം സമ്മതിക്കുകയും ചെയ്തു. ആര്യൻ നാരായണൻ മൂസ്സവർകൾക്കു
4) അബൂഹുറൈറ(റ) നിവേദനം: നബി(സ) അരുളി: ഞാൻ ഉപേക്ഷിച്ച വിഷയങ്ങളിൽ നിങ്ങൾ എന്നെ
സ്ഥിതിക്ക്, മാർഗ്ഗബാധകളായിത്തടയുന്ന ശല്യശകലങ്ങളാൽ ക്ഷതോത്സാഹനായിക്കൂടെന്നു
യുധിഷ്ഠിരസ് തു രാമേണ സമാഗച്ഛദ് യഥാവിധി മൂർധ്നി കേശവം ആഘ്രായ പര്യഷ്വജത ബാഹുനാ 37
തുടങ്ങിയ സാമൂഹ്യസൗകര്യങ്ങൾ ചെയ്‌തുകൊടുക്കണമെന്ന്‌ ബന്ധപ്പെട്ട ഉദ്യോഗസ്ഥർക്ക്‌
തദ്ദർശനേന യോഗീ ഭവതി. തപ്തകാഞ്ചനസങ്കാശജ്യോതിർമയൂഖാ അപാംഗാന്തേ ഭൂമൗ വാ പശ്യതി
സാധിച്ചത്. എന്നാൽ ചില മതഭ്രാന്തുക്കളും ആ ഉപദേശങ്ങളുടെ മഹത്വം ലോകത്തിനു ചെയ്ത
ചട്ടങ്ങൾപ്രകാരം സമ്മാനങ്ങൾ ചേർക്കുന്നതായി നിർദ്ദേശിക്കപ്പെട്ടിട്ടുള്ള ലിസ്റ്റ്
ഒരു നാഴികയായിരിക്കുന്നു. മകൾ എണീറ്റിരുന്ന് അമ്മ ഉള്ള കാലത്തിൽത്തന്നെയുംള്ള
സംസാരിൽക്കുൽന്നതും(നിരോധിൽച്ചിരിൽക്കുൽന്നു) (അബൂദാവൂട്‌) ഖുള്ള?റാ(റ) നിവേദനം
തുടർന്ന്‌ 6 മാസവും ദീർഘിപ്പിച്ചു. അവലോകന ചുമതല കാര്യക്ഷമമായി നിർദ്ദേശിക്കാൻ
വർദ്ധിക്കുന്നതോടൊപ്പം താപവും വർദ്ധിക്കുന്നു. ഈ ചിന്താഗതിക്ക് ഇന്നു ചില മാറ്റങ്ങൾ
ഇഷ്ടാപൂർതം ബഹുധാ ജാതം ജായമാനം വിശ്വം ബിഭർതി ഭുവനസ്യ നാഭിഃ 6
ആദ്യസ്ഥാനത്തിങ്കന്നു തുടങ്ങി വൎഗ്ഗിക്കുംപ്രകാരം. ആദ്യസ്ഥാനത്തെ മൂന്നിന്റെ വൎഗ്ഗം
പൂര്ത്തീകരിക്കാനുദ്ദ്യേശിക്കുന്നുണ്ട്. അഭിപ്രായം അറിയിക്കുകഉപയോക്താവ്: 04:14, 17
കൂടുതലായുള്ളത്‌ ശിലായുഗ നായാടി കളായ യഥാർത്ഥ ചോല നായ്‌ക്കന്മാരെ നീലിഗിരിയിൽ
മാർക്സിസത്തിനുള്ള സുവ്യക്തധാരണകളെക്കുറിച്ചദ്ദേഹം അജ്ഞനാണ്. രണ്ട് ജീവശാസ്ത്രം
മഹാവാക്യാർത്ഥത്തെ ഇപ്രകാരം ശ്രവിച്ച ശിഷ്യൻ, മനനനിദിദ്ധ്യാസനങ്ങൾ കൊണ്ട്
തെറ്റുതിരുത്തൽ വായന നടന്നിട്ടില്ലാത്തവ */ ' യുദ്ധകാണ്ഡം ൨൬൯ രാമപട്ടാഭിഷേകം
ഭാവത്തിലാണ് ആഖ്യായികാകാരന്മാരും നാടകകർത്താക്കളും കഥയുടെ
ഉടമസ്ഥനോടൊപ്പം പ്രതിഫലത്തിൽ പങ്കാളിയാണ്. (ബുഖാരി. 2. 24. 519) 28) അബൂഹുറൈറ(റ)
ആർക്കുവേണ്ടിയാണെന്നു മാനുഷകീടങ്ങൾ സംശയിച്ചിട്ടേയില്ല. മനുഷ്യർക്കുവേണ്ടി, അവരുടെ
നിൎത്തീട്ട മറ്റൊരുത്തൻ കയ്യിലൊരു വാളും കോഴിയുമായി ചൂട്ടും കത്തിച്ച കുഴി മൂന്നു
വിസ്മരിച്ചുപോകുന്നില്ല. ജ്ഞാനമാണ് ശക്തി (സിദ്ധി നാം ഒരു വസ്തുവിനെക്കുറിച്ച്
ചാപി വേത്ഥാസ്യ വികൃതിം ചാപി ഭൂയസീം 36 തസ്യ നാശം വിനാശം വാ ജരയാ മരണേന വാ അനർഥം ഇതി
1358. ചെറിയോൻപറഞ്ഞാൽ ചെവിട്ടിൽപോകാ- 1359. ചെറുപ്രായത്തിൽ പഠിച്ചതു മറുരാജ്യത്തിലും
കാമാബ്ധികല്ലോലരതം വിസ്മൃതാത്മപിതാമഹം 134 സമുദ്ധര മനോ ബ്രഹ്മന്മാതംഗമിവ കർദമാത്.
തമ്മിലുള്ള ബന്ധത്തെ വെറും ഒരു ഉപകരണംപോലെയല്ലേ പുതിയ മാതൃത്വം
കൊതിപെരുകുന്നു (രാമാനുജ ഗോപികമാരുടെ മുഖംതോറും നുകർന്നിട്ടു ലോഭം വർദ്ധിക്കും
എന്നാണ് അവൻ നിശ്ചയിചുറചത്. ഒരു ദിവസം പകൽ സമയം ആ ചാരൻ പള്ളിയറയുടെ സമീപത്തു ചുറ്റി
 1772. 141 വർഗ്ഗം:താളുകൾ - 1772 താൾ: 1902. 137 തെറ്റുതിരുത്തൽ വായന കഴിഞ്ഞവ */ 3
നാനാശാസ്ത്രൊപബൃംഹിതാമ 18 ജനമേജയസ്യ യാം രാജ്ഞൊ വൈശമ്പായന ഉക്തവാന യഥാവത സ ഋഷിസ
ഹേമന്തകാലമൊരുനാളുഷസ്സിനായ് രാമൻ തനിയ്ക്കുള്ള കൃത്യങ്ങൾ ചെയ്‌വതി-
എന്നാൽ അതോടുകൂടിത്തന്നെ എന്റെ ജീവിതത്തിന്റെ ഘടകാംശങ്ങളിൽ ഒരു വലിയ ഭാഗം എന്റെ
2 അതഃ സമുദ്രാ ഗിരയശ്ച സർവേഽസ്മാത്സ്യന്ദന്തേ സിന്ധവഃ സർവരൂപാഃ. അതശ്ച വിശ്വാ ഓഷധയോ
21 ദേവൈരത്രാപി വിചികിത്സിതം കില ത്വം ച മൃത്യോ യന്ന സുജ്ഞേയമാത്ഥ. വക്താ ചാസ്യ
വികാസം ! വികാസം ! വികാസം ! വികാസം ! വർഗ്ഗം:അമൃതവീചി വർഗ്ഗം:അമൃതവീചി 1945-ലെ
ശ്വാസംമുട്ടോടുകൂടി) ഫൊയി സാമീ കാര്യം! എന്റെ അരുമച്ചെറുക്കനെ കൊലയ്ക്കു തള്ളിയ
അനുഷ്ഠിച്ചില്ലല്ലോ! സാനുമതി : സരസമായ അവധി വിധി തെറ്റിച്ചുകളഞ്ഞു. വിദൂഷകൻ :
53.25 പ്രമാണം: 02 08. 300 താൾ: 44 പ്രമാണം: 02 09. 600 താൾ: 45 തെറ്റുതിരുത്തൽ വായന
കൃത്വാ തത്ര വേദാന്തശ്രവണം കുർവന്യോഗം സമാരഭേത്. ആദൗ വിനായകം സമ്പൂജ്യ
വർഗ്ഗം:ഖണ്ഡകാവ്യം കുമാരനാശാന്റെ കൃതികൾ വർഗ്ഗം:1907-ലെ കൃതികൾ
 ചോദ്യങ്ങളേപറ്റി ഒരാൾ നല്ലവണ്ണം ആലോചിക്കുന്നതായാൽ അത്യന്തം
അധ്യായം14 മഹാഭാരതം മൂലം/വിരാടപർവം/അധ്യായം15 അധ്യായം15 മഹാഭാരതം
പഴുക്കാത്തതു അപ്ജയം അവ പൊരുതു തങ്ങളിൽ അപജയപ്പെട്ടു മുറിയും പാരമായി 8. തോല്വി
ദുർബലമേഖല-ഒന്ന്‌ ആയി തരംതിരിച്ചുള്ള പ്രദേശത്താണ്‌ ഗുണ്ഡിയ ജലവൈദ്യുത പദ്ധതി
ഉപയോക്താവ്: ബാലു ഉപയോക്താവിന്റെ സംവാദം: സംവാദം 23:12, 14 മേയ് 2013 ( ഉപയോക്താവിനെ
ഇളക്കിവിടുന്നു. വൈരാഗ്യം എന്നത് ഇവയോടു പോരാടി മനസ്സിനെ നിശ്ചലമായി
വിതച്ചയാൾ വിളയും മുമ്പുണ്ടായ മഴക്കാലത്തുതന്നെ പോയതു കേണുചൊന്നാൾ അങ്ങനെ ഞാൻ
സന്മാർഗ്ഗീയായി. വാഴ്ച ക്രി. ശ. ർന്റേ മദ്ധ്യം. ൨൩) പ്രസിദ്ധനായ ഒരു ആംഗ്ലേയ രാജ്യ
പൂർണാവച്ഛിന്നയോഗേ വ്രജതി ലയമവിദ്യാ സ്വകാര്യൈഃ സഹൈവ 54 ദൃശ്യന്തേ ദാരുനാര്യോ
നീതിജ്ഞൻ; ഫ്ാക്ക്സിന്റേയും ഷെരിഡന്റേയും സഹജീവിയായ വാ ഗീശ്വരൻ; അമ്മേരിക്കയിലേ
2555 1001 100/2/2 100 1.5 100 1.5 10; 000; 100 50/2 100100) 0% ഫലകം: 1' താൾ
തൊണ്ണൂറ്റിയഞ്ച് ദശകം തൊണ്ണൂറ്റിയഞ്ച് ഫലകം:നാരായണീയം 94.1 ശുദ്ധാ നിഷ്കാമധർമൈഃ
120 1877. 121 1877. 122 1877. 123 1877. 124 1877. 125 1877. 126 1877. 127 1877.
ഉപയോഗിക്കാൻ കൊള്ളുകില്ലാത്ത വിധത്തിലായിരുന്നതിനാൽ അവർ അവയെല്ലാമെടുത്തു
സത്യസന്ധയായ സ്ത്രീയാകുന്നു. (മുസ്ലിം) വർഗ്ഗം:തിരഞ്ഞെടുത്ത ഹദീസുകൾ തിരഞ്ഞെടുത്ത
കാലത്തു ഭൂമിയൊടാകാശത്തൊടു ഒക്ക ഉയർന്നുകാണാകിൻറ വിഷയെന്ദ്രിയഗൊചരമൻറിയെ മൂരി
രാക്ഷസപ്രവൃത്തികൾക്കു തക്ക കൂലി കൊടുത്തതും കടുവാനഖങ്ങളിൽനിന്നു് അനേകരെ
13110 താൾ: 10 1916. 221 തെറ്റുതിരുത്തൽ വായന നടന്നിട്ടില്ലാത്തവ */ '൨൦൪ മംഗളോദയം
മൃകണ്ഡോ ര്യമപ്രാണനിർവാപണം ത്വത്പദാബ്ജം ശ്ലോ 14 ശിരോദ്ദൃഷ്ടിഹൃദ്രോഗശൂലപ്രമേഹ