ദ്വിവചനത്തിൽ തസ്ഥസ്ഥമിപാംതാന്തന്താമഃ എന്ന സൂത്രത്താൽ തസ് എന്നതിനു തം ആദേശമായി
എഴുത്തുകാർ പകർപ്പവകാശം ക്രമസംഖ്യ !! എഴുത്തുകാരൻ / കാരി !! മരിച്ചത് !! പകർപ്പവകാശം
നിരതന്മാരും, വർണ്ണാശ്രമനിഷ് 2014 താൾ: 1870. 39 താൾ: 02 05-150 26 2014 താൾ: 1933.
സാധിച്ചുനിന്നുടെ ചാരുവായുള്ള ചരണങ്ങൾ കണ്ടു ഞാൻ മന്നവ! നീവരുമെന്നുകേട്ടോരള-
ഒരു സ്ഥാനം അലങ്കരിക്കുന്ന ശാസ്ത്രജ്ഞനാണ് അദ്ദേഹം. മറ്റു രണ്ടു സഹപ്രവർത്തകരോടൊപ്പം
സൂര്യോദയമുണ്ടായിക്കൂടെന്നു നിശ്ചയിച്ച്, അതിന്മണ്ണം പ്രസാദിച്ചരുളിയിട്ട്,
ചിദ് രഥാൻ കേ ചിച് ച മാരിഷ ഗജാൻ അന്യേ സമുത്സൃജ്യ പ്രാദ്രവന്ത ദിശോ ദശ 6 അപരേ
കാണിക്കുന്നുവൊ, ആ സമുദായം ന്യായമായി അർഹിക്കാവുന്ന ആദായങ്ങളെ പ്രാജ്ഞയോടുകൂടി
ചെടിയുടെയും സ്പന്ദങ്ങൾ ആന്തരികവൽക്കരിച്ചുകൊണ്ട് പത്മിനി രചിച്ച ചിത്രങ്ങളിൽ
ഇവരെല്ലാം പൊതുരംഗത്ത് സജീവസാന്നിദ്ധ്യമായിത്തീർന്നു. ഇവരുടെ നിലയ്ക്ക്, പക്ഷേ,
ജുമുഅ: ക്ക്‌ പോകുന്നതും അതേനിലക്കുതന്നെയായിരുന്നു. അപ്പോൾ തിരുമേനി(സ) അവരെ
നീക്കിവെയ്‌ക്കപ്പെട്ട സ്ഥലങ്ങൾ സംരക്ഷണലക്ഷ്യം നേടാൻ പര്യാപ്‌തമാണ്‌. ഇപ്രകാരം
ഗുണഗണങ്ങളും പശ്ചിമഘട്ടത്തിനുണ്ട്‌. സെൻകമ്മിറ്റി നിശ്ചയിച്ച മാനദണ്ഡത്തെ ഈ
മിത്ഥ്യോക്തിയായതു പിന്നേത്തതാരാന്റെ നാരിയെക്കാമിയ്ക്ക മൂന്നാമതെന്നതു
പരമേശ്വരൻ വർഗ്ഗം:1935-ൽ ജനിച്ചവർ വർഗ്ഗം:എഴുത്തുകാർ_ജനനവർഷം_അനുസരിച്ച് താൾ
ചങ്ങനാശ്ശേരി ലഷ്മീപുരത്തുകൊട്ടാരംവക ഒരാനയെ വൈക്കത്തു വരുത്തിയിരുന്നു. ആ ആനയും
ആദായംകൊണ്ട് അത് ഇപ്പോഴും പതിവായി നടന്നുവരുന്നുണ്ട്. ഇതുകൂടാതെ പതിവായി എന്നും
സഹജസ്വഭാവങ്ങൾക്കും പറ്റിയതാണു.ഇത് ഞങ്ങളുടെ അനുഭവമാണു. താൾ: 02 01-150 74 താൾ:
കേന്ദ്രഗവണ്മെന്റിനോടും കോടതി നിർദ്ദേശിച്ചു. 3. അതുപ്രകാരമുള്ള നടപടിയുടെ ഭാഗമായി
ചിലതിന് ഉദാഹരണങ്ങൾ : 10. കുംഭീകുലോത്തമൻ തുമ്പിക്കരം കൊണ്ടു കുമ്പിട്ടു
ചെയ്തു. അതിന്നു മഹാരാജാവു ചെയ്തു ഔചിത്യമായ താഴെ കൊടുക്കുന്ന മറുപടി എല്ലാവരേയും
കട്ടി-ശ്ലോ മാലിനി 89 സരസഗുണനികായം സച്ചിദാനന്ദകായം ശമിതസകലമായം സത്യലക്ഷ്മീസഹായം
ഒച്ചപ്പാടുണ്ടായി. അവിവാഹിതകൾക്കേ ജോലികൊടുക്കാവൂ എന്ന നിയമം അനാവശ്യമാണെന്ന്
ചൂതസായകനു ലോകഭേദവും ദ്വീപഭേദവുമതുണ്ടോ? ഭൂതലത്തിലുള്ളവരെല്ലാവരുമിവിടെയുപഗമിതരായുൾ-
അനഭിലാഷണീയമായ വികസനം ഭാവിയിലുണ്ടാകില്ലെന്ന്‌ മേഖലാമാസ്റ്റർ പ്ലാൻ
ചെയ്കയോ അല്ല. കൊഴിച്ച ചട്ടയിൽ പാമ്പിനുള്ളപോലെയുള്ള സക്തിഹീനത (ഉലുെീിറ ീള വേല
ദ്വിതീയയും ചതുർഥിയും ഒരേ അർത്ഥത്തിൽ വരുന്നു. ഉദാഹരണം ത്വാം തൃണാം തൃണായ വാ നഗന്യേ
നേന്ദ്രിയാണി ക്ഷരമതിചപലം നോ മനോ നൈവ ബുദ്ധിഃ പ്രാണോ നൈവാഹമസ്മീത്യഖിലജഡമിദം
അധ്യായം129 മഹാഭാരതം/അനുശാസനപർവം/അധ്യായം130 അധ്യായം130
പരിഷ്ക്കരിച്ചതിന്റെ ശേഷം വേറെ രണ്ടു നമ്പൂരിമാരും അൽപാല്പം ഭേദഗതികളോടുകൂടി കഥകളി
ക്രമമനുസരിച്ചായിരുന്നു പണ്ടു ചിട്ടപ്പെടുത്തിയത്. കൃഷി മാത്രമല്ല, വിവാഹവും
പാപ്മാ സച്ചിദാനന്ദഘനജ്യോതിർഭവതി തേ ദേവാ ജ്യോതിരുത്തിതീർഷവോ ദ്വിതീയാദ്ഭയമേവ
ആകർഷിക്കുന്നില്ല. അതിനാൽ അവ സംയോജ്യക്കാതെ യഥേഷ്ടം സഞ്ചരിക്കുന്നു. നമ്മുടെ
ദേവേഭ്യഃ സ്വാഹാ. ധ്രുവായ ഭൂമായ സ്വാഹാ. ധ്രുവക്ഷിതയേ സ്വാഹാ. അച്യുതക്ഷിതയേ
ഏതെങ്കിലും പദ്ധതികളിൽ പങ്കുചേർന്ന് തുടങ്ങുകയാകും കൂടുതൽ അഭികാമ്യം. പുതുതായി
5. 2. 8 ഇതി ദ്വിതീയഃ ഖണ്ഡഃ തൃതീയഃ ഖണ്ഡഃ ശ്വേതകേതുർഹാരുണേയഃ പഞ്ചാലാനാം സമിതിമേയായ
സമയത്ത് തന്നെ പിൻമാറാൻ സ്വാതന്ത്യമുണ്ടെന്ന് വ്യവസ്ഥ വെക്കുന്ന കച്ചവടത്തിൽ നിന്നും
ദാശകന്യാം മഹീപതിഃ പ്രത്യയാദ് ധാസ്തിന പുരം ശോകോപഹതചേതനഃ 54 തതഃ കദാ ചിച് ഛോചന്തം
നാമെന്തിന് ത്വവാഫ് ഓടി നടന്നു ചെയ്യണം? അന്ന് നാം അത് മുശ്രിക്കുകളുടെ മുമ്പിൽ
നിയമിക്കുകയും ചെയ്യുന്നതിനാണ് പ്രാണായാമം എന്നു പറയുന്നത്. യോഗശാസ്ര്തത്തിന്റെ
സ്ഥലത്ത് ഒരു പാലമിടുന്നതിനു സാമാന്യത്തിലധികം വലുതായ ഒരു കാഞ്ഞിരത്തടി കുമാരപിള്ള
സ്മരന്തീ - ഈ. സ്ത്രീ. പ്ര. ഏ. അന്വയം - ജഗദംബ! (ത്വം) അസ്മിൻ മൃദുതരതൂലികയാ
മതപ്രചാരമായിരുന്നു പ്രധാനം. എല്ലാ ഹിന്ദുവിന്റെ കണ്ഠവും ഒന്നുകിൽ ഗോമാംസത്തിന്റെ
ഹാരാ വക്ഷോവിഭൂഷണം മണിജാലാവനദ്ധം ച ഭവേത് സ്തനവിഭൂഷണം 34 ഖർജൂരകം സോച്ഛിതികം
നമ്പൂരിപ്പാടുതന്നെനടത്തുകയും ആ സംഗതി വലിയതമ്പുരാൻ തിരുമനസ്സിലെ അടുക്കൽ
ചികിത്സ നിങ്ങൾ കഴിച്ചില്ലെ! നിങ്ങളുടെ പിഴിഞ്ഞുകുത്തും ധാരയും ഇവിടെ കഴിപ്പിക്കാം'
പോലെ നിസ്സാരനും ആയിരിക്കാം. എന്നാൽ ഓരോരുത്തനും ആ അപാരമായ ശക്തിസമുദ്രത്തോട്
ഓരോ തവണ ഒപ്പിടുമ്പോഴും ഉപയോഗിക്കുന്ന താളുകൾ പ്രശ്നസങ്കീർണ്ണമായിട്ടാവും എണ്ണുക.
- 2011 മാലിന്യങ്ങൾ സ്രാത ിൽ തന്നെ തരം തിരിച്ച്‌ വികേന്ദ്രീകൃതാടിസ്ഥാനത്തിൽ
പാശാങ്കുശധനുർബാണധരാം ധ്യായേത്ത്രിലോചനാം 33 ധ്യായന്നേവം വർണലക്ഷം ജപതർപണതത്പരഃ.
ജൈവവൈവിദ്ധ്യ മാനേജ്‌മെന്റ്‌ കമ്മിറ്റികളുടെ സഹായത്തോടെ അലങ്കാരമത്സ്യങ്ങളുടെ വിപണനം
പ്രതിഗൃഹ്ണീയാത്. സോഽനന്തഫലമശ്നുതേ. സ ജീവന്മുക്തോ ഭവതീത്യാഹ ഭഗവാന്നാരായണോ
ബ്രഹ്മച- ര്യാശ്രമാദിതുരീയാശ്രമവത് കുടീചകാദീനാം സംന്യാസവിധിഃ. പരമഹംസാദിത്രയാണാം ന
14 വിജ്ഞേയമേതദ്വ്യായാമേ വിചിത്രം നാമ മണ്ഡലം കൃത്വോർധ്വജാനുചരണമാദ്യം സൂചീം
'ശോഭയുണ്ടാക്കിയവയും, പൃത്ഥ്വിവലയം ആസുകലം പരവ താൾ താൾ: 1906. 11 തെറ്റുതിരുത്തൽ
ഊഹിക്കേണ്ടതാണ്. സംസ്കൃതത്തിലും ലകാരളകാരങ്ങൾ കാണുന്നു. ലളയോരഭേദഃ ലകാരളകാരങ്ങൾക്കു
മണ്ഡലാന്തമണിദീപികാം മനസി ഭാവയാമി പരദേവതാം ശ്ലോ വാരണാനനമയൂരവാഹമുഖദാഹവാരണപയോധരാം
തമിഴ്‌നാട്‌ 30065910 ബോസ്‌റ്റൈറ്റ്‌ ഡിണ്ടിഗൽ, 342687 3663 576 261 863014 289493
4%99% 0% 5%8 0% 4%99% 0% 5% 29 925825 0. 4. 0. 5.8 0. 4. 0. 0. 4. 4. 0. 5.8 0. 4.
വെക്കമയച്ചതൊരുത്തിയല്ലോബലാൽ പിന്നെയിവിടെയിരുന്നുകൂടാതെതാൻ തന്നെ
യദ്യദാചാര്യഭാഷണം. യദ്യത്സ്വരേന്ദ്രിയൈർഭാവ്യം യദ്യന്മീമാംസതേ പൃഥക് 86
പ്രാചീനവാസനാവേഗാദസൗ സംസരതീതി ചേത് ന സദേകത്വവിജ്ഞാനാന്മന്ദീ ഭവതി വാസനാ 443
പറയുന്നു. സൂത്രം 25. തത്ര നിരതിശയം സർവജ്ഞബീജം അർത്ഥം: തത്ര = അവനിൽ (ഈശ്വരനിൽ),
ധാതുക്കൾ ജില്ല ജില്ല ടൺ ടൺ സംസ്ഥാന സംസ്ഥാന ഉല്‌പാദന ഉല്‌പാദന ത്തിന്റെ മൂല്യം