നമഃ ഓം രാജ്യദായിന്യൈ നമഃ ഓം രാജ്യവല്ലഭായൈ നമഃ ഓം രാജത്കൃപായൈ നമഃ ഓം രാജപീഠ
 ഞാനായിരുന്നുവെന്ന് അദ്ദേഹം പറഞ്ഞു. തിരുമേനി(സ) അരുളി: മുപ്പതിൽപരം മലക്കുകൾ ആ
ചില മനുഷ്യർ പള്ളിയിൽ ളുഹാ നമസ്കരിക്കുന്നു. ഞങ്ങൾ അദ്ദേഹത്തോട് അവരുടെ
ശ്രേയോ ഽഭികാങ്ക്ഷിണഃ 31 [യ്] ധന്യാ വയം യദ് അസ്മാകം സ്നേഹകാരുണ്യയന്ത്രിതാഃ അസതോ
002562. 54750] [ 133434/] 15 133403/] [ 133401/] [ 133400/] 52673] [ 133986/]
സ്യുർനായകാഃ പരികീർതിതാഃ മധ്യമോത്തമപ്രകൃതൗ നാനാലക്ഷണലക്ഷിതാഃ 16 ധീരോദ്ധതാ ധീരലലിതാ
കലർന്നിരിക്കുന്ന സ്ഥൂലശരീരം ജാഗ്രദവസ്ഥ (ഉണർന്നിരിക്കുന്ന അവസ്ഥ)ആണല്ലോ. അതു
1911. 38 1911. 39 1911. 40 1911. 41 1911. 42 1911. 43 1911. 44 1911. 45 1911. 46
ശ്രദ്ധയോടെ നിരീക്ഷിച്ചു. ജീവന്റെ നിലനിൽപിൽ സൂര്യനുള്ള സ്ഥാനം അവർ തിരിച്ചറിഞ്ഞു.
ജീവേദഥവാദ്രഷ്ടാശ്രോതാമന്താബോദ്ധാകർതാവിജ്ഞാതാ ഭവത്യഥാന്നസ്യായൈ ദ്രഷ്ടാ ഭവതി ശ്രോതാ
വ്യാസൻ അധ്യായം10 അധ്യായം9 അധ്യായം9 അധ്യായം11 അധ്യായം11 മഹാഭാരതം
സമാഖ്യാതം സത്ത്വം പ്രകൃതിമേവ ച 8 ഷട് ചക്രാണി പരിജ്ഞാത്വാ പ്രവിശേത്സുഖമണ്ഡലം.
സംഘടനയായിരുന്ന കമ്മ്യൂണിസ്റ്റ് ലീഗിന്റെ 1847 നവംബറിൽ ലണ്ടനിൽ ചേർന്ന
പശ്ചിമഘട്ട പരിസ്ഥിതി അതോറിട്ടിയുടെ സംസ്ഥാനതല അതോറിട്ടിയുടെയും
പരിശോധിക്കാൻ ഞങ്ങൾക്കു സാധിച്ചിട്ടില്ല. വിക്കിഗ്രന്ഥശാല ആർക്കും തിരുത്തലുകൾ
വർഗ്ഗം: 2014 037 സൂചിക: 1913. തിരുമാന്ധാംകുന്നു വൈശിഷ്ട്യം ആകെ താളുകൾ: 59 ഈ ഭാഗം:
നഷ്ടമായിക്കഴിഞ്ഞിരിക്കുന്നു. എന്നാൽ, വാസ്തവത്തിൽ ഇത് അതിമഹത്തുകളായ ശാസ്ത്രങ്ങളിൽ
അദ്ധ്യായം 15 ദിൽബാസുരൻ പൂർത്തിയായി 58 ഇന്ദുലേഖ അദ്ധ്യായം 16 ദിൽബാസുരൻ പൂർത്തിയായി
അട്ടഹാസം, പ്രവാഹമുഖത്തിൽ ശോണകണസമ്മിശ്രമായ ബുൽബുദനിരകളെ ഉത്ഭവി ഉത്ഭവിപ്പിച്ചു.
പരിരക്ഷിക്കുന്നതിനും ഇതിന്‌ സുപ്രധാനമായ പങ്ക്‌ വഹിക്കാൻ കഴിയും. അവയുടെ
പുറത്തേക്കുള്ള കണ്ണികൾ വർഗ്ഗം:മലയാളകവികൾ വർഗ്ഗം:എഴുത്തുകാർ-ഭ വർഗ്ഗം:ചേർത്തല
 ചണ്ഡരാമുലൂകന്മാരിജ്ജനങ്ങൾക്കു രാത്രൗ കണ്ണുകാൺകയില്ലെന്നു കല്പിച്ചു നിമ്മര്യാദം
പ്രസരിക്കപ്പെടുമ്പോൾ ആദ്യം ഒരു ന്യൂട്രോണും ധന-മീസോണും പിന്നെ ധന-മീസോണിൽനിന്ന് ഒരു
പരാക്രമോപമാനത്തിൽ പരം ദാരിദ്രമേകിനാൻ. യുഗ്മകം) 4 ചിരമായ് വന്നുമേവുന്ന ജരയായ
 11020 താൾ: 3 1910. 19094 വെറും പാൾവാക്കോ േമൊഴിയോ അ താൾ: 1911. 78 താൾ: 1915. 10
കാര്യമുണ്ടാകുന്നതിനു മുമ്പ് ക്ലിപ്തമായി നിലനിൽക്കുന്നതാണ് കാരണം. കാര്യത്തിനു
അറിയൂ. സമാധിപാദം കഴിഞ്ഞു കുറിപ്പുകൾ വർഗ്ഗം:രാജയോഗം (കുമാരനാശാൻ രാജയോഗം
താൾ സൃഷ്ടിച്ചിരിക്കുന്നു വർഗ്ഗം:രസികരഞ്ജിനി രസികരഞ്ജിനി/വോല്യം 2/ഭാഗം 2
അനുചരസംഘത്തെ ശേഖരിച്ചുകൊണ്ട് പ്രതിജ്ഞാനുസാരമുള്ള ഒന്നാം ദ്രോഹകർമ്മത്തിനായി
ഒരാൾ ചോദിച്ചു. പ്രവാചകരെ! സ്വർഗവാസികളെയും നരകവാസികളെയും വേർതിരിച്ചറിയാൻ കഴിയുമോ?
താൾ: 387 തെറ്റുതിരുത്തൽ വായന കഴിഞ്ഞവ */ താൾ: 155 രാമവർമ്മത്തെ വീടും
അതിനോടുകൂടിയൊരായിരമാന യലംകരിച്ചതിൽ ചുഴലും നിൽക്കുന്നു രഘുവരഞ്ചോറുകൊടുത്തുള്ള ജനം
ശിവം 9 ന നിരോധോ ന ചോത്പത്തിർന ബദ്ധോ ന ച സാധകഃ. ന മുമുക്ഷുർന വൈ മുക്ത ഇത്യേഷാ
അവസാനയോഗം 2011 ആഗസ്റ്റ്‌ 16-17 തിയ്യതികളിൽ ബംഗളൂരുവിലായിരുന്നു. 42 ഔദ്യോഗിക
രജ്ജുവിൽ ലയിക്കുന്നില്ല. ശാസ്ത്രങ്ങളിൽ ലയിക്കുന്നുവെന്ന് പറയുന്നത്
നടപ്പാൻ പോകുന്നതായി നാം വഴിയെ കാണും. പ്രാണചലനമാർഗ്ഗങ്ങൾ മാറ്റപ്പെടേണ്ടതായും പുതിയ
നാഴിക കഴിഞ്ഞപ്പോൾ വിചാരിപ്പുകാരനു ബോധം വീണു. ഉടനെ അയാൾ ഒരു വിധത്തിൽ
എങ്കിലും വിടില്ലായിരുന്നത്രേ. പറിഞ്ഞിടത്ത് മരുന്നുവെച്ച് കൂട്ടിച്ചേർത്തശേഷം
സാകമമിതാദരമർചയിത്വാ തം യാദവം തദുദിതാം നിശമയ്യ വാർതാം ഗോപേഷു ഭൂപതിനിദേശകഥാം
നിങ്ങളെ കാണുകയില്ല. നിങ്ങൾ മറഞ്ഞു പോകുന്നു. ആ ഭൂമിയിലുള്ളവർ പ്രത്യക്ഷപ്പെടുകയും
അതായത് ഓ ാധരങ്ങളെ ഒരുമിച്ചു ചേർത്തു വാ മൂടിയും ശബ്ദിക്കാതെയും ഉള്ള ഇരുപ്പിന്
 എല്ലാറ്റിന്റേയും മേലധികാരം ദി ാൻജിക്കാകുന്നു. ഇവയിൽ സഞ്ചായത്തിനു താൾ: 1936. 67
ദധദന്തഃഫലൈർഹീനം വടധാനാ വടം യഥാ 133 ചിന്താനലശിഖാദഗ്ധം കോപാജഗരചർവിതം.
നടന്നിട്ടില്ലാത്തവ */ താൾ: 39 90 എഴുത്ത് ഇല്ലാത്തവ */ താൾ: 39 91 എഴുത്ത്
നീങ്ങുകയില്ലെന്നും കാണുകയാൽ ആ വീട്ടുകാർ അപ്രകാരമൊക്കെ ചെയ്യിച്ചു പൂജ ആണ്ടുതോറും
സഞ്ചാരികാസ്തു വിജ്ഞേയാ നാട്യജ്ഞൈഃ സമുദാഹൃതാഃ പ്രേഷണേ കാമസംയുക്തേ
എന്നായിരുന്നു ബാലകൃഷ്ണന്റെ അഭിപ്രായം. എന്തായാലും ആരെയും കൊല്ലരുതെന്നായിരുന്നു.
ശാസ്ത്രാനുസൃതമാ ശാസ്ത്രാനുസൃതമായല്ല താൾ: 308 താൾ: 239 തെറ്റുതിരുത്തൽ വായന കഴിഞ്ഞവ
ധ്യായേന്മനസി മാം നിത്യം വേണുശൃംഗധരം തു വാ. മഥ്യതേ തു ജഗത്സർവം ബ്രഹ്മജ്ഞാനേന യേന
ന്ഥകാരന്മാ൪ താൾ താൾ: 1912. 84 2014 താൾ: 1911. 149 2014 താൾ: 1922. 193 താൾ: 6
(ബുഖാരി. 2. 23. 340) 12) അബൂഹുറൈറ(റ) നിവേദനം: നബി(സ) അരുളി: ഏതെങ്കിലും ഒരു
' 22 ഹേ സഖെ ആ കാണുന്ന അരയാൽ വൃക്ഷത്തിന് ഇട ത്തായ താൾ 28019 താൾ: 1919. 88
പരാധീനമർധേന്ദുമൗലേ ശ്ലോ 27 യദാ ശ്വേതപത്രായതാലംഘ്യശക്തേഃ കൃതാന്താദ്ഭയം
വ്യക്തികളുടെ വിവരങ്ങളും, വിശദീകരണങ്ങളും,മറ്റു വിക്കിപദ്ധതികളുമായി
പ്രതാപംകൊണ്ടു രാജാവും പ്രകാശിച്ചീടുമേ ഭൃശം. - സ്വ. ഇതിൽ ഉത്കൃഷ്ടങ്ങളായ
ക്ഷിപ്രം ത്വയാ ദത്തം പരന്തപ ഏഷ മേ സർവലാഭാനാം ലാഭഃ പരമകോ മതിഃ 6 [കർണ] അവനിം പ്രമദാ
പരിധിക്കുള്ളിൽ അചേതന വസ്തുക്കൾതന്നെ പുതിയ രീതിയിൽ സംശ്ലേഷിക്കപ്പെട്ടതിന്റെ ഫലമാണ്
വായന കഴിഞ്ഞവ */ താൾ: 59 തെറ്റുതിരുത്തൽ വായന കഴിഞ്ഞവ */ താൾ: 60 തെറ്റുതിരുത്തൽ
മേൽപറഞ്ഞ ഗ്രഹങ്ങൾക്കും സ്ഥാനഭേദങ്ങൾ വരുന്നത് സൂര്യൻറെ ഏതെങ്കിലും ഒരു വശത്ത്
എത്രത്തോളമെന്ന് ചിലർ ചോദിച്ചപ്പോൾ, ഈ തണ്ടൻകാലുകളുടെ പകുതിവരെ എന്ന് ഞാൻ
പെട്ടൊന്നുമേ കിട്ടാഞ്ഞു സന്തത- മാടല താൾ 41073 താൾ: 1939. 95 തെറ്റുതിരുത്തൽ വായന
അഭീഷ്ടം ഇപ്പോഴത്തെ യുദ്ധഫണ്ടി ലേക്കു ദ്രവ്യം സഹായിക്കുകയാകുന്നു. ഈ ഫണ്ടുകളുടെ
ശുദ്ധസത്ത്വൈകലക്ഷണാ 309 14 ഈശ്വരഃ മായോപഹിതചൈതന്യം സാഭാസം സത്ത്വബൃംഹിതം
അധ്യായം74 അധ്യായം76 അധ്യായം76 മഹാഭാരതം മൂലം/അശ്വമേധികപർവം/അധ്യായം76 വ്യാസൻ