സംവാദം:കേരളോല്പത്തി കേരളോല്പത്തി പോലുള്ള പുസ്തകങ്ങളുടെ പദ്ധതികളും 2011 ലെ പ്രധാന
അധ്യായം42 1 [വൈ] തതസ് തേ ഭരതശ്രേഷ്ഠാഃ സമാജഗ്മുഃ പരസ്പരം വിഗതക്രോധമാത്സര്യാഃ സർവേ
പരിസരസ്ഥിതികൾ ഗ്രഹിപ്പാൻ വീണ്ടും സ്ഫുടബോധവാനായപ്പോൾ സ്ഥാനപതികളുടെ യോഗം
വർഗ്ഗം: 2014 093 താൾ: 1906. 12 തെറ്റുതിരുത്തൽ വായന നടന്നിട്ടില്ലാത്തവ */ ൩)
മണ്ണു വാങ്ങാൻ പ്രകാമദൈന്യത്തൊടിരന്നു പിന്നെ.54 അയോഗ്യമാമിത്തൊഴിലിജ്ജനത്തെ-
ചാമരങ്ങൾ. മേഘതുല്യം - മേഘംപോലെയുള്ളത്. മത്ത മാതംഗം - മദിച്ച ആന. മുത്ത് - സന്തോഷം.
കുറവനെപോലെ- 1049 കുരങ്ങായും കോന്തനായും വാഴയ്ക്കുകേട്- 1050 കുരങ്ങിനു ഏണിചാരെണ്ടാ-
വർഗ്ഗം:വിക്കിഗ്രന്ഥശാലാ സമാഹരണം ഉപയോക്താക്കൾ വിക്കിഗ്രന്ഥശാലാ ഉപയോക്താക്കൾ
തേജോരൂപന് ഈ വിധമായ മരണം സംഭവിക്കുന്നതിന് സംഗതിയാക്കിയ പാപകർമ്മം എന്താണെന്നുള്ള
പ്രാപിച്ചു. പന്ത്രണ്ടു സ്ത്രീരത്നങ്ങൾ ഗംഭീരത്തിനു്: ഒരു പത്രപ്രസ്താവന കാലത്തിന്റെ
ഭാവം - മുത്ത്, മുല്ലപ്പൂവ്, ചന്ദ്രൻ എന്നിവയെപ്പോലെ വെളുത്ത നിറത്തോടുകൂടിയവളും
സൗഭദ്രോ ഽഥ ഘടോത്കചഃ 38 ദ്രൗപദേയാഃ ശിഖണ്ഡീ ച കുന്തിഭോജശ് ച വീര്യവാൻ സുശർമാ ച
വിലീയതേ സാധു യഥാ തമിസ്രാ 318 തമസ്തമഃകാര്യമനർഥജാലം ന ദൃശ്യതേ സത്യുദിതേ ദിനേശേ തഥാ
വ്യാഹൃതപൂർവ്വജന്മചരിതം യോ രാധയാ വീക്ഷിതഃ സേർഷ്യം ശങ്കിതയാ സ നസ്സുഖയതു
ദിവ്യൗഷധങ്ങൾ. താൾ: 1918. 178 തെറ്റുതിരുത്തൽ വായന നടന്നിട്ടില്ലാത്തവ */ ' പാഠം ൩
അഭിമുഖരായി മുറ്റത്തു നിലകൊണ്ടപ്പോൾ, ശ്രീരാമഗുഹന്മാർ തമ്മിൽ
ഓടും കല്ലും പാകുന്നതും സിമന്റിട്ട്‌ ഉറപ്പിച്ചിരിക്കുന്നതും പരമാവധി
സ്വഭാവവൈജാത്യങ്ങളെ താൾ: 40 തെറ്റുതിരുത്തൽ വായന കഴിഞ്ഞവ */ ങ്ങളെ
സർവക്രതുഭിരിഷ്ടവാൻഭവതി. തേനേതിഹാസപുരാണാനാം രുദ്രാണാം ശതസഹസ്രാണി ജപ്താനി ഫലാനി
സാമയജുഋഗ്വർണാഃ ക്രിയാ നാസീച് ച മാനവീ അഭിധ്യായ ഫലം തത്ര ധർമഃ സംന്യാസ ഏവ ച 14 ന
മനുവര! തവഗുരുവായഞാനും പറഞ്ഞതുകേട്ടിന്നരുളുകഭവാൻ പ്രവാസിജനം പറഞ്ഞതുകേൾക്ക
എന്നിവർ. സഖാവ് കെ. മീനാക്ഷി എന്ന തൊഴിലാളി സംഘാടക പിന്നെ അധികമുയർന്നുവന്നില്ല.
ഭൈമി അമ്മയുടെ അനുമതികയോടുകൂടെ ബാഹുകനെ ആളയച്ചു വരുത്തി സ്വയമേവ ചോദ്യങ്ങൾചെയ്തു
നഷ്ടസ്മൃതിർഹതഗതിശ്ഛർദിതഹിക്കാകഫൈഃ സുബീഭത്സഃ ഗുരുസജ്ജമാനജിഹ്വോ നിഷ്ഠീവതി
പുരാണേതിഹാസങ്ങളിൽ അങ്ങനെ കാണുന്നുണ്ടല്ലോ? വക്താവ്: ബ്രഹ്മത്തിൽ നിന്ന് മായ ഉണ്ടായി
ശ്രമത്തിന്റെ തുടക്കമായി ഈ പുസ്തകത്തെ കരുതാം. കേരളീയർ പൊതുവെ മുഴുത്ത ജ്യോതിഷ
നെടിയത്കുറിയത്, ചെറുത്വലുത്, നീളംഘനം, ഇവകൾ കൂടാതെ, പ്രത്യക്ഷപ്പെടാതെ താനായി
നബി(സ) ചോദിച്ചു. നിന്റെ പ്രശ്നമെന്താണ്? അയാൾ പറഞ്ഞു: റമളാനിൽ നോമ്പുകാരനായികൊണ്ട്
മനുഷ്യനും. 246 എഴുത്ത് ഇല്ലാത്തവ */ താൾ:പ്രപഞ്ചവും മനുഷ്യനും. 247 എഴുത്ത്
വളരെ പ്രാധാന്യത്തോടെ നിർവ്വഹിക്കാവുന്ന പ്രധാനപ്പെട്ട
എഴുത്തുകാരികളെല്ലാവരും കേരളത്തിലെ ആൺകോയ്മയെ അതിശക്തമായിത്തന്നെ
585) 14) അബൂഹുമൈദ്(റ) നിവേദനം: അനുചരന്മാർ ചോദിച്ചു. പ്രവാചകരെ! ഞങ്ങൾ അങ്ങേക്ക്
അന്ധതമസ്സ് അന്ധതാമിസ്രം ( അ'സ്രസമാനം കുണ്ടറ അന്ധാളി ( അന്ധാളം ) അന്ധാളിത്വം,
അനുമതിലബ്ധിക്കുശേഷം വില തന്നാൽ മതിയെന്നും അദ്ദേഹം നിശ്ചയിക്കുന്ന വില
ഭാഷാ പരിഷ്കരണക്കമ്മറ്റി 1928 2014 താൾ: 2 1913. 88 സൂചിക: 1917. 2014 മലയാളത്തിലെ
2232 2233 കസ്തുരി= 3236 മുക്രാഞ്ചൻ= 2014 താൾ: 24 1926. 48 താൾ: 1877. 135 താൾ:
വിശ്വസിക്കാത്തവൻ ദൈവം സ്വപുത്രനെ കുറിച്ചു ചൊല്ലിയ സാക്ഷ്യത്തെ
പടിഞ്ഞാട്ടു മാറിയ ശേഷം ഉണ്ടായ ഭൂമിയിൽ ജനങ്ങൾ പാർത്തു തുടങ്ങി കേരളം എന്നു
നിങ്ങൾ 'മലബ്ബദ്' എന്നു പറഞ്ഞുവരുന്ന ഒരു പുതപ്പും അവർ എടുത്തുകാണിച്ചു. (ബുഖാരി. 4.
നാർഹത്യുപകർതുഭീഷത് യഥാ തഥാ കർമസഹസ്രകോടിഃ ജ്ഞാനസ്യ കിം നു സ്വയമേവ ലീയതേ 187
സ്ത്രീശൂദ്രബിഡാലാദി ഭക്ഷ്യഭോജ്യാദികം ച യത്. ന പ്രൗഢഹീനോ നാസ്തിക്യം ന
പുരമഥനപദവിമുഖമായ്‌മലമൂത്രേണ പൂരിതമായസൈന്യത്തോടുമക്ഷേത്രം.
വിഷുവും വരാതെ പോകട്ടെ- 744 ഓപ്പയീയിരുപ്പിരുന്നാൽ അത്താഴം ഉണ്ണുന്നതെങ്ങിനെ- 745
 മറ്റും തിരുത്താനും ഉണ്ട്. ഈ കുറ ുകൾ ഒക്കെ പരിഹരിക്കാനായി എല്ലാവരേയും
ഗന്ധേന രസേന വാ സർവമേവ ഭാവിതമിതി തച്ച വ്യാപ്ത്യർഥം ശ്ലോകാശ്ചാത്ര- വിഭാവേനാഹൃതോ യോ
നമുക്കിപ്പോൾ വയസ്സു് അതിക്രമിച്ചിരിക്കുന്നു. വാർദ്ധക്യത്തിൽ രാജാക്കന്മാർ
19-ാം നൂറ്റാണ്ടിൽ തലശ്ശേരിയിൽ പരിചയപ്പെട്ട തീയ്യവനിതകളെക്കുറിച്ച് പറഞ്ഞത്
യാതം ഘനസ്പന്ദക്രമാന്മനഃ 147 ഭാവയത്യനിലസ്പന്ദം സ്പർശബീജരസോന്മുഖം.
ഉപദേശിക്കു ന്നു. രോഗങ്ങളുടെ പൌർവ്വാപർയ്യം മുതലായ അന്യോന്യസംബന്ധം കൊണ്ടുള്ള
ിലാക്കേണ്ടതുണ്ട്‌ ഉദാഹരണത്തിന്‌ വൻ തോതിലുള്ള കാറ്റാടി പാടങ്ങൾ പ്രാദേശിക ജൈവ ആവാസ
തോന്നുന്ന തോന്നുന്നതാണ്. താൾ: 100 താൾ: 35 ഇതി. ഇങ്ങനെ സംഖ്യയ്ക്കു ഗുണനവും
എന്നായിത്തീർന്നു. ആ നദിയുടെ തീരത്തുള്ള ദേശത്തിനും ആ പേരു തന്നെ സിദ്ധിച്ചു. ആ
അച്ഛൻ മൂസ്സ്" / തലക്കെട്ടു മാറ്റം: ഐതിഹ്യമാല/വയക്കരെ അച്ചൻ മൂസ്സ്
എന്തോ സംശയ നിവൃത്തി വരാനുണ്ടെന്നും അതിലേക്ക് കുറച്ചുകൂടി സ്ഫുടമായ
അദ്ദേഹത്തെ സഹായിച്ചു. തുടർന്ന് മാർക്സിന്റെ മരണശേഷം മൂലധനത്തിന്റെ രണ്ടും മൂന്നും
പ്രമാണത്തിന്റെ പുതിയ പതിപ്പ് അപ്‌ലോഡ് ചെയ്തിരിക്കുന്നു അനുമതി 2.5- സെന്റർ ഫോർ
ആളുകൾക്ക് ഭക്ഷണസാധനങ്ങൾ ഇല്ലാതായി. അവിടെനിന്നു് വിയന്നാ പട്ടണത്തിലേക്ക്
പ്രസരിപ്പിക്കപ്പെടുന്നുണ്ടെന്ന് അദ്ദേഹം സിദ്ധാന്തിച്ചു. ഇതിന്റെ അടിസ്ഥാനത്തിൽ
സ്വമാത്മാനം സ്വയം ചര. ആത്മാനമേവ മോദസ്വ വൈദേഹീ മുക്തികോ ഭവേത്യുപനിഷത് ഇതി
ഗുണിച്ചിട്ടുള്ളതായിട്ടിരിക്കും. ചെറിയ രാശിയും അന്തരവുമുള്ള യോഗം വലിയ
ഹംസഃ സാക്ഷാന്നാരായണോ യതിഃ. ഏകരാത്രം വസേദ്ഗ്രാമേ നഗരേ പഞ്ചരാത്രകം 14
സാവകാശമില്ലായ്മയും ആണ് പുനഃപ്രസിദ്ധീകരണം നീണ്ടുപോകാനുള്ള കാരണങ്ങൾ. പുതിയ ധാരണകൾ
പ്രജൽപമാത്രഃ പരിശിഷ്യതേ യതഃ 398 അസത്കൽപോ വികൽപോ യം വിശ്വമിത്യേകവസ്തുനി നിർവികാരേ
അർദ്ധനിത്യഹരിത വനങ്ങളുടെയും വീതി കുറഞ്ഞ പ്രദേശമാണ്‌. ഈ നിത്യഹരിത വനങ്ങളെ രണ്ട്‌