എന്നർത്ഥം ധാതുപ്രത്യയസംബന്ധം അറിവാൻ അവയവങ്ങളെ പറയുന്നു നിൽക്കുക നില് എന്ന
യോഗീശ്വരൻ വൃദ്ധയെ കാൺമാൻ പുറപ്പെട്ടതും അമ്മാളുക്കുട്ടിയെ കടാക്ഷിച്ചതും തനിക്കു
അക്കാലത്തുതന്നെ ചൂണ്ടിക്കാണിച്ചിരുന്നു. 'സഹവിദ്യഭ്യാസം' എന്ന തന്റെ ലേഖനത്തിൽ എൻ.
28 ജൂൺ 2012 ( ഉപയോക്താവ് : ഉപയോക്താവ്: ഉപയോക്താവിന്റെ സംവാദം: സംവാദം 15:26, 15
ദ്വിജസത്തമ 2 കിമർഥം മോക്ഷിതാശ് ചൈവ പന്നഗാസ് തേന ശംസ മേ ആസ്തീകേന തദ് ആചക്ഷ്വ
പണ്ടുനീചെയ്തുള്ളപാപങ്ങളൊക്കെയും ദണ്ഡകവാസത്തിനെക്കൊണ്ടുപോയിതു വണ്ടാർകുഴലി!
40 1907. 41 1907. 42 1907. 43 1907. 44 1907. 45 1907. 46 1907. 47 1907. 48 1907.
ന്യൂനതകളൊന്നും ഇതിൽ സ്ഥാനം പിടിച്ചിട്ടില്ല; പിടിക്കാനും തരമില്ല.
സുഖശയനത്തിനുള്ള ഭവനം നിർമ്മിച്ചു; അവരുടെ ബഹുകാലസുഖാശനത്തിനുള്ള ധനാർജ്ജനത്താൽ
മഹാഭാരതം/അനുശാസനപർവം/അധ്യായം113 അധ്യായം113 മഹാഭാരതം/അനുശാസനപർവം/അധ്യായം114
ഭവതി. സ രാമമന്ത്രാണാം കൃതപുരശ്ചരണോ രാമചന്ദ്രോ ഭവതി. തദേതദൃചാഭ്യുക്തം. സദാ. ബീജാംശേ തത്പ്രാജ്ഞഃ. സാക്ഷ്യംശേ തത്തുരീയഃ. മകാരസ്ഥൂലാംശേ സുഷുപ്തവിശ്വഃ.
അങ്ങനെയായപ്പോൾ മണ്ടക്കാട്ട് അമ്മന്റെ അടുക്കൽ അപേക്ഷിച്ചാൽ സകല കാര്യങ്ങളും
അവരെല്ലാവരുംകൂടി തിരുമേനി(സ)യുടെ അടുത്തിരുന്നു. ശേഷം അവിടുന്നു പറഞ്ഞു. അമ്മാബഅ
കാണുന്നുള്ളു. മി: കറുപ്പന്റെ പ്രിയഭാഗിനേയനായ പ്രസാധകൻ മറ്റുഭാഗങ്ങളെ കൂടി
ളല്ക്കുലുക്കംവെടിഞ്ഞഭ്യ താൾ 16012 താൾ: 1888. 163 തെറ്റുതിരുത്തൽ വായന
സഹായിക്കാനാകും.വഴിയേ ഫോളോപ്പ് ചെയ്യാം.ഇത് ഗണത്തിലെ പെന്റിങ്ങ് ജോലികൾ
ക്കാർക്കു അവിടെച്ചെന്നു ജോലി ചെയ്വാൻ നിവൃത്തിയില്ലാതാവുകയും ചെയ്യുകയാൽ അവർ
ഉപേക്ഷിച്ചുകൂടെന്നു് വൈയാകരണൻ ശഠിക്കയാണെങ്കിൽ, പാകമാവുക കാലമാവുക മുതലായതുപോലെ
'ലക്കം ൧൧ കാലം പോയ പോക്കു് ൪൭൯ ൩ ദായാദരോ താൾ താൾ: 3 1924. 208 തെറ്റുതിരുത്തൽ വായന
ഇടയായിട്ടുള്ളതിൽ എന്താണ് അത്ഭുതം? തന്റെ പ്രജകളിൽ സകലവർഗ്ഗക്കാരും പരിശീലനം
തിരച്ചിൽ നാമമേഖലകൾ, ലോഗിൻ ചെയ്തിട്ടുള്ള ഉപയോക്താക്കൾക്ക് അവരുടെ
കതമർക്കതമത്കതമത്സാമ കതമഃ കതമ ഉദ്ഗീഥ ഇതി വിമൃഷ്ടം ഭവതി 1. 1. 4 വാഗേവർക്പ്രാണഃ
മൃത്യുലോകായ കാലാന്തകസമദ്യുതിഃ 14 ഹതാശ്വാത് തു രഥാത് തൂർണം അവപ്ലുത്യ മഹാരഥഃ ശരാംശ്
ഹയഗ്രീവഷട്ത്രിംശദക്ഷരമന്ത്രഃ പുനരഷ്ടത്രിംശദക്ഷര മന്ത്രശ്ച. ഹംസഃ.
സൂചാഭിനയേന യോജയേദന്യഃ തത്സംബന്ധാർഥകഥം ഭവേന്നിവൃത്ത്യങ്കുരഃ സോ ഥ 50 ഏതേഷാം തു
നബി(സ) അരുളി: നീ പോയി വീണ്ടും നമസ്കരിക്കുക. നീ നമസ്കരിച്ചിട്ടില്ല. അങ്ങനെ മൂന്നു
യേഷു ഭാരം സമാസജ്യ രാജ്യേ മതിം അകുർമഹി തേ സന്ത്യജ്യ തനൂർ യാതാഃ ശൂരാ ബ്രഹ്മ വിദാം
വായനക്കാർ തന്നെ അവ തിരുത്തുകയോ ലളിതമായി സംശോധനം ചെയ്യുകയോ ആണ് ചെയ്തിട്ടുണ്ടാവുക,
ദ്വിതീയാദ്യെകവചനവിഭക്തികൾക്ക്- യ്- എന്ന ആദ്യാഗമം വരും ഏക 2014 16 താൾ: 1903. 13 ൧.
വിധത്തിലുള്ള 'സവിതർക്കം' ആകുന്നു. ഈ പദങ്ങൾക്കു വിവരണം ആവശ്യമാണ്.
വചനത്തെകുറിച്ചു ചിന്തിക്കുന്നു. സംസ്കൃതത്തിൽ ഏകവചനം, ദ്വിവചനം, ബഹുവചനം, എന്നു
ചെയ്യാൻ നിർദ്ദേശിക്കാൻ പകർപ്പവകാശ ലംഘന സംശയം മാത്രമാണ് കാരണം. നമുക്ക് ഇവിടെ
സ്വതന്ത്ര മലയാളം കമ്പ്യൂട്ടിങ്ങ്] എന്നിവരുടെ സംയുക്താഭിമുഖ്യത്തിൽ ഒരു മത്സരം
ദ്വേ ഭാര്യേ ബഭൂവതുഃ ഉശനസോ ദുഹിതാ ദേവ യാനീ വൃഷപർവണശ് ച ദുഹിതാ ശർമിഷ്ഠാ നാമ
മദ്ധ്യകാലരാഷ്ട്രീയ-സാംസ്കാരികാന്തരീക്ഷത്തിൽ സ്ത്രീപുരുഷഭേദം
സുഭഗോ ഭവതി. ഏവമേതാം ചക്രാസനഗതാം ത്രിപുരവാസിനീം സദോദിതാം ശിവശക്ത്യാത്മികമവേദിതാം
അദ്ദേഹം ശേഷമുണ്ടായിരുന്ന ആലിലകളെല്ലാം പെറുക്കിയെടുത്ത് യഥാക്രമം
പ്രസ്ഥാനം സാഹിത്യ വിചാരം സൗന്ദര്യ നിരീക്ഷണം കാവ്യദർശനം രചയിതാവ്:എം.പി. പോൾ" /
ഏറ്റുമാറ്റും ഇല്ലാത്തജാതി- 669 ഏൽക്കുംകാലം തോല്ക്കെണ്ടിവരും- 670 ഒടിയാത്ത കമ്പേൽ
സാധുകരിച്ചവ */ താൾ: 1868. 115 സാധുകരിച്ചവ */ താൾ: 1868. 76 താൾ: 1868. 72 താൾ:
മേദിനീം 71 വാജിനശ് ച ഹതാരോഹാഃ പത്തയശ് ച ഗതാസവഃ ശേരതേ യുധി നിർഭിന്നാ വമന്തോ രുധിരം
വേണ്ടി ബാങ്കും ഇഖാമത്തും കൊടുക്കുവീൻ. എന്നിട്ട് നിങ്ങൾ രണ്ട് പേരിൽ ഏറ്റവും ഉത്തമൻ
48100 താൾ: 1925. 82 തെറ്റുതിരുത്തൽ വായന കഴിഞ്ഞവ */ 48100 താൾ: 1925. 83
താളുകളാണ്‌ കവാടങ്ങൾ. രചയിതാവിന്റെ താളുകളിൽ ചേർക്കുന്നതിന് ഉചിതമല്ലാത്ത
പോകാവൂ എന്ന് അവൻ ധരിക്കലാണത്. തിരുമേനി(സ) നമസ്കാരത്തിൽനിന്നു വിരമിച്ചശേഷം
പരിവർജയൻ അധർമേണാപി സംയുക്തം പ്രിയം ആഭ്യാം കരോമ്യ് അഹം 25 ധർമം ഏവ ഗുരും ജ്ഞാത്വാ
വർഗ്ഗം:ചരിത്രം വർഗ്ഗം:പദ്യം വർഗ്ഗം:സ്കൂൾ പാഠപുസ്തകങ്ങളിലെ കവിതകൾ പദ്യം
സോപാധികത്വാത്പ്രകൃതേർവികാരാത് കാര്യത്വഹേതോഃ സുകൃതക്രിയായാ വികാരസംഘാതസമാഹിതത്വാത്
പ്രാണപ്രവൃത്തിമാർഗ്ഗത്തി ലൂടെ മാത്രമേ ശബ്ദത്തെ വെളിയിൽ നിടുന്നതിനു സാധിക്കു
നബിയാണ്) ഏതെങ്കിലുമൊരു സത്യവിശ്വാസി ധനം കൈവശമുള്ള സ്ഥിതിയിൽ മരണമടഞ്ഞു. എങ്കിൽ
അത്രതന്നെ ശുദ്ധരൂപത്തിലല്ലാത്ത സ്ത്രീരക്തത്തിൽ നിന്നാണ്, ഭ്രൂണശരീരം ജന്മം
കിളിപ്പാട്ട് - ലബ്ധനാശനം പഞ്ചതന്ത്രം കിളിപ്പാട്ട്/ലബ്ധനാശനം/ശിവശിവ! കിമിതി വദതി
അവസാനിക്കുകയും ചെയ്തതിന്റെ ശേഷം രാമയ്യൻദളവയും വട്ടപ്പറമ്പിലുണ്ണിത്താനും
52 സർവേഷ്വേവ തു നിക്ഷേപ്യം സ്തംഭമൂലേഷു കാഞ്ചനം സ്വസ്തിപുണ്യാഹഘോഷേണ ജയശബ്ദേന ചൈവ
അരുളി: കഷ്ടം! നീ എന്റെ സ്നേഹിതന്റെ കഴുത്ത് മുറിച്ചുകളഞ്ഞു. അവിടുന്ന് ഈ വാചകം പല
വിശേഷാവസ്ഥകളും പറഞ്ഞ് ഗൗണ്ഡൻ ആ മഹതിയെ വിനോദിപ്പിച്ചു. മീനാക്ഷിഅമ്മ ആകട്ടെ,
തരോത്തരച്ഛദമായി കനകമയമായിരിക്കുന്ന ഈ പര്യങ്കത്തിൽ നിഷദിചാലും. 96 ദേവീമാനസപൂജാ
അജ്ഞാനഹൃദയഗ്രന്ഥേർനിഃശേഷവിലയസ്തദാ സമാധിനാ വികൽപേന യദാ ദ്വൈതാത്മദർശനം 353
2) അനസ്(റ) നിവേദനം: നബി(സ) യുടെ മരണത്തിന് അൽപം മുമ്പ് മുതൽ അല്ലാഹു അവിടുത്തേക്ക്
രമണീയതരമാക്കുന്നു. ചെമ്പരുത്തിപ്രഭയെ പ്രദ്യോതിപ്പിക്കുന്ന മകുടങ്ങളോടുകൂടിയ
അബൂഹുറൈറ(റ) നിവേദനം: തിരുമേനി(സ) അരുളി: നിങ്ങളിലൊരാൾ ആമീൻ ചൊല്ലി. അതനുസരിച്ച്
മുഖവുര മൂലഗ്രന്ഥത്തിന്റെ മുഖവുര വർഗ്ഗം:രാമചന്ദ്രവിലാസം വർഗ്ഗം:എ.ആർ.
എന്നൊരാൾ ഉണ്ടായിരുന്നു എന്നു് എല്ലാവരും പറയുന്നതിനേക്കാൾ പ്ലൂട്ടാർക്കു് എന്നൊരാൾ