കൗടില്യനയജ്ഞനായ ഭട്ടപാദർ കാര്യസിദ്ധിക്കുള്ള ഉപായമായി ദണ്ഡനമസ്കാരത്താൽ
 അധ്യായം109 അധ്യായം111 അധ്യായം111 98 23 033 834 മഹാഭാരതം മൂലം/ആദിപർവം/അധ്യായം111
ആക്കിത്തീർത്ത ശ്രീമൽ കേരളവർമ്മരാജശേഖരനാൽ ഭരിക്കപ്പെട്ട മഹനീയക്ഷേത്രത്തിലെ
ഛേദാസ്തു യേ മയാ പ്രോക്താ സമവൃത്തവികൽപിതഃ ത്രികൈർവിഷമവൃത്താനാം സമ്പ്രവക്ഷ്യാമി
പ്രദേശവാസികൾ ഉൾപ്പെടെയുള്ളവരു മായി മേഖലാതലത്തിലും സംസ്ഥാനതലത്തിലുമുള്ള
പരിദേവനം 40 ഉപമാ രൂപകം ചൈവ ദീപകം യമകം തഥാ അലങ്കാരാസ്തു വിജ്ഞേയാ ചത്വാരോ
വിക്കിയിലും മറ്റു പല പദ്ധതികളിലുമുള്ള ഒരു രൂപത്തിനു പ്രത്യേകമായി മീഡിയവിക്കി:
പ്രചണ്ഡമാരുതൻ മഹാവൃക്ഷങ്ങളെ നിഷ്കൃപം തകർത്ത് ഭൂമുഖപ്രണാമം ചെയ്യിച്ചു.
കോപം ഒരു വസ്തുവും ഞാൻ മറ്റൊന്നും ആയിരുന്നു. എന്നാൽ എപ്പോൾ എനിക്കു കോപം വന്നുവോ
 5 6 7 8 9 10 10 11 11 12 12 13 13 14 14 15 15 16 16 17 17 18 18 19 19 20 20/
മഹാഭാരതം/അനുശാസനപർവം/അധ്യായം36 അധ്യായം36 മഹാഭാരതം/അനുശാസനപർവം/അധ്യായം37 അധ്യായം37
പരഗൃഹീതനായുള്ള കാമുകനു ശത്രുവിൽനിന്നു വല്ല ആപത്തും സംഭവിക്കുമെന്ന് അവൾ
പ്രദേശങ്ങളുടെയും മേഖല ഒന്നിന്റെയും മൊത്ത വിസ്‌തീർണ്ണം ആകെയുള്ള പ്രദേശത്തിന്റെ
വാക്യാർഥശ്ചിന്ത്യതേഽധുനാ താദാത്മ്യമത്ര വാക്യാർഥസ്തയോരേവ പദാർഥയോഃ 37 സംസർഗോ വാ
തിരോധാനത്തെപ്പോലെതന്നെ പ്രകൃത്യാ സംഭവിക്കുന്ന ചരിത്രപരമായ വളർച്ചയുടെ ഫലമാണെന്നും
ശുഭാശുഭാതിരിക്തഃ ശുഭാശുഭൈരപി കർമഭിർന ലിപ്യതേ. യ ഏഷ ദേവോഽന്യദേവാസ്യ
ജ്യോതിഷികൾ രാശിചക്രം വരയ്ക്കാറ് ചതുരത്തിലാണ്. മുകളിൽ നിന്ന് രണ്ടാമത്തെ കള്ളി മേടം
അധ്യായം135 മഹാഭാരതം/അനുശാസനപർവം/അധ്യായം136 അധ്യായം136
എമ്പ്രാന്റെ വിളക്കത്തു വാര്യന്റെ അത്താഴം എന്ന രീതിയിൽ പ്രകൃതത്തിന്റെ
മനുഷ്യരുടെ ഭയാട്ടഹാസങ്ങളും രോദനങ്ങളും ആപത്സാമീപ്യത്തെ ധരിപ്പിക്കുന്നു. നദീതീരം
തെറ്റുതിരുത്തൽ വായന കഴിഞ്ഞവ */ താൾ: 59 തെറ്റുതിരുത്തൽ വായന നടന്നിട്ടില്ലാത്തവ */
നടത്തുന്നതിനായിപ്പോയത് മറ്റൊരു നമ്പൂതിരിപ്പാടായിരുന്നു. അദ്ദേഹവും വലിയ
പുത്രിയെവാരാണസീപുരിയിൽവെച്ചുപിന്നെ. ബദ്ധസമ്മോദംവേൾപ്പിച്ചീടുവനെന്നുമുന്നേ
മൃന്മയം വിജ്ഞാതം സ്യാദ്വാചാരംഭണം വികാരോ നാമധേയം മൃത്തികേത്യേവ സത്യം 6. 1. 4 യഥാ
കാളിദാസനുണ്ടാക്കിയതാണെന്നു പറഞ്ഞാൽ ഒട്ടും പോരായ്കയില്ലെന്നു മാത്രമല്ല, ഈ
പ്രവേശി പ്പിച്ചും ശരിയായി വരുത്തിക്കൊള്ളും. അല്ലാതെ ഉള്ള കാലം 149
വരാഹമിഹിരൻ നൽകിയ തത്സമയ പരിഭാഷയമാണ് ദ്രേക്കാണം. ബാബിലോണിയർ എന്താണതിനെ
അഭിപ്രായപ്പെടുന്നു. 2000 മി.മീറ്ററോ അതിലധികമോ മഴ ലഭിക്കുന്ന പശ്ചിമഘട്ടത്തിലെ
1000000) 0 /100 0) - 1000000) 0 /10000 0100 = 9 1000000) 0 /100 0) - 1000000) 0
പരശുരാമൻകൊണ്ടുവന്നിട്ടില്ല മലയാളബ്രാഹ്മണരെ പരശുരാമൻകൊണ്ടുവന്നിട്ടില്ല
നോമ്പനുഷ്ഠിക്കുവാൻ നബി(സ) അനുവാദം നൽകിയിട്ടില്ല. (ബുഖാരി. 3. 31. 216) 68)
ഹാസ്യസ്ഥാനാനി യാനി സ്യുഃ കാര്യോത്പന്നാനി നാടകേ ഉത്തമാധമമധ്യാനാമേവം താനി
വരുമെന്നതിനും, ഉടനെ അത്തി ഉണങ്ങിപ്പോയതു ജറൂസലേമിന്റെ നാശത്തിനും അടയാളമാകുന്നു
ധാർമിക ഇതി തത്ര പ്രഥമോ ജീവോ ബ്രാഹ്മണ ഇതി ചേത് തന്ന അതീതാനാഗതാനേകദേഹാനാം
പറഞ്ഞു. കേശവൻ അതു കേട്ടു സമ്മതിച്ചു തല കുലുക്കുകയും അടുത്ത ദിവസം അവൻ തനിച്ചു പോയി
ദീൎഗ്ഘിച്ചുപോയിരിക്കുന്നു. അതുകൊണ്ട് ഇത്രനേരം സംസാരിക്കുന്നതിന് എന്നെ സദയമായി
വർഗ്ഗം:ഗായത്രിമന്ത്രം ഗായത്രിമന്ത്രം/രാമഗായത്രി രാമഗായത്രി ശ്രീകൃഷ്ണഗായത്രി
മലയാളമല്ലാത്ത ഒരു സാധനം നമ്മുടെ വിക്കിയിൽ കയറുന്നതെങ്ങനെ? കയറ്റുന്നതെങ്ങനെ?-
നിനച്ചങ്ങിരിക്കുന്നേരം * തച്ചോളി ഓമന കുഞ്ഞിഒതേൻ * കാവൂട്ടും വേല കഴിച്ചുകൂട്ടി *
ഫോട്ടോഗ്രഫി, അടുത്തകാലത്തായി സിനിമ എന്നിവയെപ്പറ്റിയും മതത്തെപ്പറ്റിയും
മൃത്യോരാത്മാനം പരിഹരാണീതി 2. 22. 5 ഇതി ദ്വാവിംശഃ ഖണ്ഡഃ ത്രയോവിംശഃ ഖണ്ഡഃ ത്രയോ
വിശോഭി നാനാ ര ങ്ങളെക്കൊണ്ട് ഏറ്റവും ശോഭിക്കുന്നത്. ഹേമ കലശം. - സ്വർണ്ണക്കുടം.
സംഗതികളെല്ലാം അദ്ദേഹത്തോട് കൽപ്പിക്കുകയും ഏതുവിധവും ഈ ഉപദ്രവം
പാശ്ചാത്യരുടെ അധിവാസം ആയിത്തീർന്ന ഈ സ്ഥലത്തിനു 'തിരുമധുരപ്പേട്ട' എന്നുള്ള
254 ശക്രസ്യൈരാവതീ പിണ്ഡീ ഝഷപിണ്ഡീ തു മാന്മഥീ ശിഖിപിണ്ഡീ കുമാരസ്യ രൂപപിണ്ഡീ
ഞങ്ങളോട് മല്ലിട്ടവർക്കെതിരെ ഞങ്ങളെ നീ സഹായിക്കൂ! ഞങ്ങളുടെ മതനടപടികളിൽ അനർത്ഥങ്ങൾ
ശ്രീമഹാഭാഗവതം/തൃതീയസ്കന്ധം/വിദുരമൈത്രേയസംവാദം വിദുരമൈത്രേയസംവാദം
ഉദ്യോഗസ്ഥയായി. 1971ൽ രാഷ്ട്രീയത്തിലേക്കു മടങ്ങാൻ ശ്രമിച്ചു. ആ വർഷത്തെ പാർലമെന്റ്
ആളുമൂത്താൽകുലംഅണയും- 1844 പന്നിയെപായും കടവുശേഷിക്കും- 1845 പയ്യെതിന്നാൽ പനയും
പരമാത്മാനമന്യഥാ വിമൃഗ്യതേ പുനഃ സ്വാത്മാ ബഹിഃ കോശേഷു പണ്ഡിതൈഃ 292 വിസ്മൃത്യ
ജീവന്മാർക്കു തിരോധാനപ്പെട്ട് കിഞ്ചിജ്ഞരെന്നപോലെ ഭവിച്ച തിനും, ഖണ്ഡാഖണ്ഡങ്ങളായ
സമുദാഹൃതം 32 ഭവതാപ്യേഷ ഏവാർഥഃ കഥിതോ വാഗ്വിദാം വര. ഏഷ ഏവ ഹി വാക്യാർഥഃ ശാസ്ത്രേഷു
പറഞ്ഞു സാന്ത്വമായി ശരാസനം കൊണ്ടും പെരിയ വാൾ കൊണ്ടും വരാനനനമുക്കിവിടെയെന്തിപ്പോൾ?
മാഢ്യവ്യനോടിങ്ങനെ പ്രവർത്തിച്ചത്? മാതലി : അതും പറയാം. എന്തോ ഒരു മനസ്താപത്താൽ
വിരുദ്ധ പ്രവണതകളുടെ ഐക്യം അഥവാ വേർപിരിക്കാനാകായ്ക ആണത്. പ്രപഞ്ചത്തിലെ എല്ലാ
 ഉരുക്കഴിച്ചുകൊണ്ടിരുന്നു. മരുമക്കത്തായ കുടുംബങ്ങളിലെ 'നാത്തൂൻപോരും
നാലു പക്ഷങ്ങളും പ്രപഞ്ചോത്തത്തിക്ക് യോജിച്ചതല്ലെങ്കിൽ, വിവർത്തപക്ഷം
യസ്താണ്ഡവവിധിഃ പ്രോക്തോ നൃതേ പിണ്ഡീസമന്വിതഃ രേചകൈരംഗഹാരൈശ്ച ന്യാസോപന്യാസസംയുതഃ
മലയാളത്തിൽ ഉണ്ടായിട്ടുള്ളത്! എന്നാൽ അവയിലൊന്നിനെങ്കിലും 'പാവങ്ങ'ളെ സമീപിക്കുവാൻ
വിസ്മരിക്കരുത്. ആദികാലത്തു സർവ്വജനീനമായ ഒരു ഭാഷയായിരുന്നു സംസ്കൃതം എന്നതിലേക്കു
നേരിടേണ്ടിവരുന്ന വന്യ സ്‌പീഷീസുകളെയാണ്‌ ഇത്തരത്തിൽ വിശേഷിപ്പിക്കുന്നത്‌. മേഖല:
സമ്യഗ് രോഹന്തി ഭാരത അധർമഫലം അത്യർഥം തദാ ഭവതി ചാനഘ 45 തഥാ ച പൃഥിവീപാല യോ ഭവേദ്
ബാലു ഉപയോക്താവിന്റെ സംവാദം: സംവാദം 23:12, 14 മേയ് 2013 ( പുതിയ ഉപയോക്താവിനെ
തുഞ്ചത്തെഴുത്തച്ഛൻ/പ്രസ്താവന തുഞ്ചത്തെഴുത്തച്ഛൻ വിദ്വാൻ കുറുവാൻ തൊടിയിൽ ശങ്കരൻ