ആരെങ്കിലും വിചാരിക്കുന്നുണ്ടോ? ശ്രമക്കുറവിന്റെ പരമാവധികാണുന്നത് ഒരു ശവത്തിന്റെ
സഞ്ചരതി സോഽയമാത്മാ തമാത്മാനമുപാസീതാജരമമൃതമഭയമശോകമനന്തം ചിത്തമധ്യാത്മം
പോകയില്ല- 425 ഇല്ലത്ത് പഴയരിയെങ്കിൽ ചെല്ലുന്നെടത്തും പഴയരി- 426 ഇല്ലത്ത്
കാരണമെന്തായിരുന്നാലും രാജാവ് അവിടെ നടയ്ക്കു നേരെ ചെന്നു സ്വാമിയെ
ജിതേന്ദ്രിയതാ കുത ഇത്യത ആഹ ശമാദിഷഡ്ഗുണപൂർണായേതി. ശമാദിഷഡ്ഗുണസമ്പത്തേഃ
അപ്പോൾ തിരുമേനി(സ)ചോദിച്ചു. ഇന്നവനേ! നീ (തഹിയ്യത്ത്‌) നമസ്കരിച്ചുവോ? ഇല്ലെന്ന്‌
കേറിപ്പടിക്കുകിലവൻതല കൊയ്‌തെടുക്കും. കട്ടി-ശ്ലോ 94 നിൽക്കായ്‌ക പോര പുറകോട്ടിനി
ശുദ്ധവിദ്യാങ്കുരാകാരദ്വിജപങ്‌ക്തിദ്വയോജ്ജ്വലായൈ നമഃ ഓം
 1863. 163 തെറ്റുതിരുത്തൽ വായന കഴിഞ്ഞവ */ ~~~~ 2014 താൾ: 1893. തലക്കെട്ട്2
കൊണ്ടല്ലെങ്കിൽ മനസ്സു കൊണ്ടെങ്കിലും ഇന്നലെ വലിയതായ ഒരു പുണ്യകർമ്മം ചെയ്തിരിക്കണം.
കന്നിന്റെകൂട്ടത്തിൽ- 811 കണ്ടി= 812 കണ്ടി= 820 2) 3) 4) 5) 821 ആന്തം= 822 824 826
ചെയ്യുകയും ചെയ്യുന്ന പക്ഷം അത് വഴി നിനക്ക് ഓരോ ഉന്നത പദവി ലഭിക്കാതിരിക്കുകയില്ല.
വിചാരാനന്ദാസ്മിതാരൂപാനുഗമാൽ = ഊഹം, വിവേകം, ആനന്ദം, കേവലാഹന്ത ഇവയുടെ
രക്ഷിക്കുന്നതിനേക്കാൾ ആവശ്യമായ സംഗതിയായിട്ട് അവർ വിചാരിക്കുന്നു. പൗരകാര്യങ്ങളിൽ
ജീവന്മുക്ത ഉച്യതേ 23 രാഗദ്വേഷഭയാദീനാമനുരൂപം ചരന്നപി. യോഽന്തർവ്യോമവദച്ഛന്നഃ സ
പിന്നത്തെ കൊത്തിനു ഗുരിക്കളലോ * രണ്ടുമുറിയായി വീണുപോയി * ഗുരിക്കളോടൊന്നിച്ചു
പരിസ്ഥിതി മന്ത്രാലയം `പ്രോജക്‌ട്‌ എലിഫന്റ്‌' ആയി നിർണ്ണയിച്ചിട്ടുള്ള എലിഫന്റ്‌്‌
വർഗ്ഗം:കവിത വർഗ്ഗം:ഗണപതിസ്തോത്രങ്ങൾ സ്തോത്രകൃതികൾ; ഹൈന്ദവ കീർത്തനങ്ങൾ
ഉപയോക്താവ്: ഇർഷാദ് ഉപയോക്താവ്: സുനിൽ ഉപയോക്താവ്: രാരു ഉപയോക്താവ്: ഉപയോക്താവ്:
ഗ്രസിച്ചുകഴിയുന്നുവെല്ലോ! രാമകിശോരൻ: ഞാൻ കുന്ദലതയെയും എന്റെ ഒരുമിച്ച്
വാർത്തകേട്ടമ്പോടുചൊന്നാൻഭൃഗുമുനി. ആരണശ്രേഷ്ഠരേശ്രദ്ധയാകേൾക്കുവിൻ
പതഞജലീസ്ത്രോത താൾ താൾ: 5 1906. 62 തെറ്റുതിരുത്തൽ വായന നടന്നിട്ടില്ലാത്തവ */ '
രഥത്തിനെയെന്നു നൃപനിദേശത്താൽ വരുത്തി സൂതനും രഥവരങ്ങളിലറുപതായിരം നവസഹസ്രമാം
യസ്മിൻ വിശുദ്ധേ വിഭവത്യേഷ ആത്മാ യം യം ലോകം മനസാ സംവിഭാതി വിശുദ്ധസത്ത്വഃ കാമയതേ
പഞ്ചഭിർ ആയസൈഃ വിവ്യാധാതേ ന ചാകമ്പത് കാർഷ്ണിർ മേരുർ ഇവാചലഃ 25 ദുഃശാസനസ് തു സമരേ
കർതവ്യാ കാകുർനാട്യപ്രയോക്തൃഭിഃ 119 ലല്ലേ ച മന്മനേ ചൈവ ഭയാർതേ ശീതവിപ്ലുതേ മന്ദ്രാ
വിസ്‌തീർണ്ണമുണ്ടായിരിക്കണമെന്നതാണ്‌ നിബന്ധന. എന്നാൽ പശ്ചിമഘട്ടത്തിൽ നിലവിലുള്ള
താൾ: 1936. 23 തെറ്റുതിരുത്തൽ വായന കഴിഞ്ഞവ */ താൾ: 1936. 24 താൾ: 1936. 25 സംവാദം
ഉമയമ്മറാണിയെക്കുറിച്ചുള്ള ചിത്രങ്ങളുണ്ട്. ഈ വിവരങ്ങളെ ഏറെക്കുറെ സ്ഥിരീകരിക്കുന്ന
യാദവീം സഭാം പ്രവിവേശാർജുനഃ ശൂരഃ ശോചമാനോ മഹാരഥാൻ 8 തം ആസനഗതം തത്ര സർവാഃ പ്രകൃതയസ്
കാരുണ്യമെന്നിയെചെയ്യുന്നതൊട്ടുമെ ചേരുന്നതെല്ലാംഹസിയ്കും മഹാജനം
സസ്യഹീനമായ പാറക്കൂട്ടങ്ങളോടുകൂടിയുമാണു് കാണപ്പെടുന്നതു്. മലകളെ കിടന്നു,
നാവിമുക്താത്പരമം സ്ഥാനം നാവിമുക്താത്പരമം സ്ഥാനം കാശ്യാം സ്ഥാനാനി ചത്വാരി
മനുഷ്യനും. താൾ:പ്രപഞ്ചവും മനുഷ്യനും. 23 എഴുത്ത് ഇല്ലാത്തവ */ താൾ:പ്രപഞ്ചവും
പതിപ്പ് ഫലകം: ഫലകം: എന്നതിൽ നിന്ന് 2 പതിപ്പുകൾ ഫലകം:സഹായസൂചിക സഹായം:മലയാളം
തച്ചുടയ കയ്മളും തമിഴകവും ദ്രാവിഡമാഹാത്മ്യവും(ചട്ടമ്പിസ്വാമികൾ) തമിഴകവും
പ്രയാത്യേതദ്വൈ തമസോ രൂപം തത്തമഃ ഖല്വീരിതം തമസഃ സമ്പ്രാസ്രവത്യേതദ്വൈ സത്ത്വസ്യ
നിറം പ്രാപിക്കും മുമ്പ് അവയെ വിൽപ്പന നടത്തുന്നതിന് നബി(സ) വിരോധിച്ചിരിക്കുന്നു.
ലഭിക്കും) 5) മിഖ്ദാദ്(റ) സുദീർഘമായ ഹദീസിലൂടെ നിവേദനം ചെയ്യുന്നു: പാലിന്റെ ഓഹരി
വേഷാൻപ്രകൽപയേത് 157 പൂർവം തു പ്രകൃതിം സ്ഥാപ്യ പ്രയോഗഗുണസംഭവാം സ്ത്രീണാം വാ
അധ്യായം15 മഹാഭാരതം മൂലം/സ്ത്രീപർവം/അധ്യായം15 വ്യാസൻ അധ്യായം15 അധ്യായം14 അധ്യായം14
സംസ്‌ക്കരണപ്രശ്‌നങ്ങൾ 222 താൾ: 250 താൾ: 251 താൾ: 252 താൾ: 253 താൾ: 254 താൾ: 255
നിർവ്വാണഷ്ടകം ശങ്കരാചാര്യർ വർഗ്ഗം:ശങ്കരാചാര്യരുടെ കൃതികൾ വർഗ്ഗം:ഷട്കങ്ങൾ
പരിഷ്ക്കരിക്കയും ഒരു കാളേജ് സ്താപിക്കയും, പ്രാഥമിക വിദ്യാഭ്യാസത്തിനും ഉന്നത
1868. 461 1868. 462 1868. 463 1868. 464 1868. 465 1868. 466 1868. 467 1868. 468
വിചിത്രസ്വഭാവിയായ അദ്ധ്യാപകനായിരുന്നു ഭരതൻമാസ്റ്റർ. നിരവധി ബിരുദാനന്തരബിരുദങ്ങളും
അപഗതത്രപാ കാപി കാമിനീ തവ മുഖാംബുജാത്പൂഗചർവിതം പ്രതിഗൃഹയ്യ തദ്വക്ത്രപങ്കജേ നിദധതീ
തെറ്റുതിരുത്തൽ വായന നടന്നിട്ടില്ലാത്തവ */ ' ൧൫൦ ജാനകീപരിണയം ആറാമങ്കം അണിയറയിൽ സഖ
വർഗ്ഗം:മോശവത്സലം രചിച്ച കീർത്തനങ്ങൾ വർഗ്ഗം:സമ്പൂർണ്ണ ഗാനങ്ങൾ യേശുവേ യേശുവേ
കലാപവേളയിലെ ഇബാദത്ത് എന്റെ അടുത്തേക്ക് ഹിജ്റ ചെയ്യുന്നതിന്(ഫലത്തിൽ) തുല്യമാണ്.
ജാബാലോപനിഷത്സമാപ്താ വർഗ്ഗം:ഉപനിഷത്തുകൾ ഉപനിഷത്തുകൾ/ജാബാല്യുപനിഷദ് ജാബാല്യുപനിഷത്
പരിസ്ഥിതി സൗഹൃപരമായ ഒരു വികസന പന്ഥാവിലേക്ക്‌ പ്രവേശിക്കുന്നതിന്‌ രാജ്യത്തെ വളരെ
വിലാപകാവ്യങ്ങളും നിർമ്മിക്കപ്പെടാറുണ്ട്. മഹാനായ ഒരു വ്യക്തിയുടെ വിയോഗം കവിയെ
സച്ചിദാനന്ദസ്വരൂപമായ ബ്രഹ്മത്തെ ലക്ഷീകരിക്കുന്നവയാണെന്നു ഗ്രഹിക്കേണ്ടതാകുന്നു.
സ്വൽപൈരഹോഭിഃ കലശീം ച കൂപം വാപീം സരശ്ചാനശിഷേ വിഭോ ത്വം 32.4 യോഗപ്രഭാവാദ്ഭവദാജ്ഞയൈവ
നിന്റെ സഹോദരനുമായി മുഖപ്രസന്നതയോടെ കണ്ടുമുട്ടുക എന്നതാണെങ്കിലും. (മുസ്ലിം) 55)
വരുന്നവരെല്ലാം തനിക്കു വഴിയൊഴിഞ്ഞു തരണമെന്നും താൻ മറ്റൊരാൾക്കു വഴിയൊഴിഞ്ഞു
ഭവത്കുശലകാമ്യയാ സ ഖലു നന്ദഗോപസ്തദാ പ്രമോദഭരസങ്കുലേ ദ്വിജകുലായ കിം നാദദാത്‌ തഥൈവ
ദേശീയവാദചരിത്രമോ ( മാർക്സിസ്റ്റ് ചരിത്രമോ പോലും വേണ്ടത്ര പ്രാധാന്യം ഈ
രണ്ടാമതു ഉപദേശിക്കയും വേണ്ടെന്നു തള്ളിയേച്ചു കൂടുതലായി കിട്ടിയപ്പോൾ മടങ്ങി
ബോധങ്ങൾ, മതം, തത്വശാസ്ത്രം, സദാചാരമുറകൾ, കല, ശാസ്ത്രം തുടങ്ങിയ പല രൂപങ്ങളും
താളാണ്. നാമമേഖലകളെക്കുറിച്ച് മീഡിയവിക്കിയിലെ താളുകൾ വിവിധ ആയാണ്
അന്യായമായി പ്രഹരിക്കുകയോ മുഖത്തടിക്കുകയോ ചെയ്താൽ അവനെ ഇത്ഖ് ചൊല്ലലാണ് അതിന്റെ
വനേ ള പിതു സ സംഗീതരവാൽ രംഗം എട്ട്‌ ദേവലോകം-ലോമശാഗമനം ശ്ളോകം 21 ശങ്കരാഭരണം