യാതൊരുപകാരവുമില്ലാത്തതിനാൽ വെളിയ്ക്കു ത്യജിക്കപ്പെടുകയും ചെയ്യുന്നു. 2014 താൾ:
വിവാഹംചെയ്യും. മരിക്കുമുന്പ് നിലത്ത് എറക്കി കിടത്തും. തടിക്ക് തീ കൊളുത്തേണ്ടത്
പരിസ്ഥിതി ദുർബല പ്രദേശം/മേഖല എന്നിങ്ങനെ പല പദപ്രയോഗങ്ങൾ കഴിഞ്ഞ കുറേ വർഷങ്ങളായി ഈ
ദുർമ്മേദസ്സമുച്ചയലാഞ്‌ഛനങ്ങളെ കാട്ടിത്തുടങ്ങുന്നു. സിംഹപരാക്രമനായ ഹൈദരാലിഖാൻ
അധ്യായം107 1 [ലോമഷ] തേ തം ദൃഷ്ട്വാ ഹയം രാജൻ സമ്പ്രഹൃഷ്ടതനൂ രുഹാഃ അനാദൃത്യ
അധ്യായം8 അധ്യായം7 അധ്യായം7 അധ്യായം9 അധ്യായം9 1 [ൻ] കഥയിഷ്യേ സഭാം ദിവ്യാം
രാത്രിയിൽ 4 മണിക്കൂർ ഇടവിട്ട്‌ 5 - 8 തവണ കൂടുതൽ വെള്ളം ഒഴുക്കിവിടുന്നതും
4% 0% 4% 0% 5%80% 0% 4% 1% 0% 4% 0% 4% 0% 4% 0% 4%9 0% 5%8 0% 4%9 0% 4% 0% 4% 0%
വിരുദ്ധചാർജുള്ള ഒരു എതിർ ഇലക്ട്രോൺ കൂടി നിർമ്മിക്കപ്പെടേണ്ടത് അത്യാവശ്യമാണെന്ന്
196 വർഗ്ഗം:താളുകൾ - 1868 താൾ: 1911. 20 എഴുത്ത് ഇല്ലാത്തവ */ താൾ: 1870. 14
മുന്തിയ പ്രാധാന്യമുണ്ട്. ഇവിടെ പ്രസിദ്ധീകരിക്കപ്പെടുന്ന ലേഖനങ്ങളും പഠനങ്ങളും
തത്തത്സ്ഥാനേ സംയമാത്തത്തത്സിദ്ധയോ ഭവന്തി 7 അഥ പ്രത്യാഹാരഃ. സ പഞ്ചവിധഃ വിഷയേഷു
പൂന്താനം നമ്പൂതിരി കാണുമാറാകണം/രണ്ട് കാണുമാറാകണം/ഒന്ന് വർഗ്ഗം:കാണുമാറാകണം
താൾ 16012 താൾ: 1888. 154 തെറ്റുതിരുത്തൽ വായന നടന്നിട്ടില്ലാത്തവ */ ' ൧൪൮
(മലയാളം വിക്കിസംരംഭങ്ങളേയോ, മറ്റ് വിക്കിമീഡിയ സംരംഭങ്ങളേയോ നേരിട്ട്
ഉണ്ടാക്കിത്തരുന്ന പ്രവർത്തനത്തെയും ഞാൻ നിന്നോട് ചോദിക്കുന്നു. അല്ലാഹുവേ! നിന്റെ
പുള്ളിമാൻകൂട്ടങ്ങളും ആ മോഹനമായ മന്ദിരത്തിന്റെ മഹിമയെ പുകഴ്ത്തുകയോ എന്നു തോന്നും.
അധ്യായം38 മഹാഭാരതം മൂലം/കർണപർവം/അധ്യായം38 വ്യാസൻ അധ്യായം38 അധ്യായം37 അധ്യായം37
സർവകാമഫലപ്രദഃ 25 താരാദിസഹിതഃ സോഽപി ദ്വിവിധോഽഷ്ടാക്ഷരോ മതഃ. താരം രാമശ്ചതുർഥ്യതഃ
അനുകൂലിക്കുന്നില്ല. ( 2011, താൾ: 112 പശ്ചിമഘട്ട സമിതി റിപ്പോർട്ട്‌ - 2011
തീപ്പെട്ടു പോവുകയാൽ ശക്തൻ തമ്പുരാൻ തിരുമനസ്സിലേക്കു തിരുമൂപ്പു സിദ്ധിക്കുകയും
സ്വർണ്ണമയിയുടെ മുകത്തേക്കു് ഒന്നു നോക്കി,ഒന്നും പറയാതെ ഒരു ദീർഘനിശ്വാസം അയച്ചു്
ഭദ്രശ്രവോഭിരൃഷിഭിഃ പരിണൂയമാനം കൽപാന്തഗൂഢനിഗമോദ്ധരണപ്രവീണം ധ്യായാമി ദേവ ഹയശീർഷതനും
നിത്യമംഗലമന്ദിരം ചിന്മഥനാവിർഭൂതം ചിത്സാരമനന്താശ്ചര്യസാഗരമമിതതേജോരാശ്യന്തർഗത-
കുഞ്ചിക്കിട്ടിപ്പിള്ളയെ സർവ്വാധികാര്യക്കാരായി കൽപിച്ചു നിയമിച്ചു നീട്ടു
വ്യത്യാസപ്പെട്ടു പോകയില്ല. വളരെ പുരാതനകാലം മുതൽ നടപ്പിൽ ഇരിക്കുന്ന ഈ തമിഴ്ഭാഷ
അധ്യായം98 അധ്യായം98 മഹാഭാരതം മൂലം/ആദിപർവം/അധ്യായം98 വ്യാസൻ അധ്യായം 98 അധ്യായം97
രാമനോടിങ്ങിനെ ഇന്ദ്രശങ്കാശനായുള്ള രഘുവര ഇന്ദ്രൻ ശരഭംഗനാശ്രമേവന്നതു നിന്നെയും
എഴുതികൊടുത്തു വിട്ട കാവ്യശകലം.[ 20140918052115/ 3145154/2014-09-18/
ശ്രമിച്ചത്. പക്ഷേ, കേരളത്തിലെ സ്ത്രീകൾ പണ്ടുകാലത്ത് മാറുമറയ്ക്കാതിരുന്നത് അവർ
ആചാര്യ വാചസ്പതിമിശ്രൻ പറഞ്ഞിരിക്കായാൽ പ്രതിപാദ്യപ്രതിപാദകവിഷയങ്ങളിൽ
ഇരുട്ടിത്തുടങ്ങുകയായി. കുറച്ചു കഴിഞ്ഞാൽ ഉറങ്ങാൻ തുടങ്ങുമ്പോൾ നേരം
കൃത്യം. 4. ഭിത്തിക ( : ) : ഇത് ഒരു ഇടഭിത്തിപോലെ സമനിലയിലുള്ള രണ്ടു ഭാഗങ്ങളെ
ആലോചിച്ചുനോക്കൂ ഈ 'നല്ല അമ്മ'യ്ക്ക് 'സൗമ്യാധികാര'മുള്ളതുകൊണ്ട് അവരെ എല്ലാവരും
സോഽദ്വൈതപരമാനന്ദലക്ഷണം പരബ്രഹ്മ ഭവതി. ഇദം പരമതത്ത്വരഹസ്യം ന വാച്യം
രണ്ടുകൾക്കും ല പ്രക്രിയയിൽ വിവരിച്ച വിധത്തിൽ ലോപം വന്ന് അഭുവ്+അൻ=അഭുവൻ എന്നും
മലയാളം :വർഗ്ഗം: മാതൃഭാഷയായുള്ള വ്യക്തി. 2 = വർഗ്ഗം: വർഗ്ഗം: ഫലകം: ഫലകം: എന്നതിൽ
അകുർവത സഞ്ജയ 2 കൃതവർമാ കൃപശ് ചൈവ ദ്രോണാ പുത്രശ് ച വീര്യവാൻ ദുര്യോധനശ് ച മന്ദാത്മാ
നിവേദനം: ഒരിക്കൽ ഇബ്നു അബ്ബാസിന്റെ പിന്നിൽ നിന്നുകൊണ്ട് ഞാൻ മയ്യിത്ത്
തേജശ്ച ദേവാം ശ്ച മനുഷ്യാം ശ്ച പശൂം ശ്ച വയാം സി ച
റൊക്കമായിട്ടാണെങ്കിൽ തരക്കേടില്ല. അവധിക്കാണെങ്കിൽ പാടില്ല. (ബുഖാരി. 3. 34. 276)
താൾ: 18 താൾ: 19 തെറ്റുതിരുത്തൽ വായന നടന്നിട്ടില്ലാത്തവ */ താൾ: 50 തെറ്റുതിരുത്തൽ
അവൻ ശബ്ബത്തിൽ പളളിക്കു ചെന്നു ഉപദേശിച്ചു; 22 അവന്റെ ഉപദേശം നിമിത്തം അവർ
ഗ്രന്ഥങ്ങളിലേയും ആമുഖവും മറ്റും എഴുത്തിയത് ഇപ്പോൾ ജീവിച്ചിരിക്കുന്ന വ്യക്തികളിൽ
ഉമാകേരളത്തിലെ ഉമയമ്മയ്ക്ക് ചരിത്രരേഖകളിൽ പ്രത്യക്ഷപ്പെടുന്ന ഉമയമ്മറാണിയുമായി വലിയ
സദാകാലമെ ഞാൻ വരുന്നു ക്രൂശിങ്കൽ പുറത്തേക്കുള്ള കണ്ണികൾ വർഗ്ഗം:റവ. ടി. കോശി രചിച്ച
രചയിതാവ്:സി.വിരാമൻപിള്ള സി.വി. രാമൻപിള്ള 1918-ൽ രചിച്ച ചരിത്രാഖ്യായിക.
ഉർവ(റ)യിൽ നിന്ന് നിവേദനം: ഒരിക്കൽ നബി(സ) യുടെ സന്നിധിയിൽ ത്വിയറത്തിനെ (ശകുനത്തെ)
 കണ്ടു. (ബുഖാരി. 1630) 61) അബ്ദുൽ അസീസ്പയുന്നു: അസർ നമസ്കാരത്തിനുശേഷം ഇബ്നു
ഹ്യബുദ്ധിഃ വ്യോമേവ പൂർണോ സ്മി വിനിർമലോ സ്മി സദൈകരൂപോ സ്മി ചിദേവ കേവലഃ 842 ഇതി
സാ ജ്ഞേയാ തുര്യഗാ ഗതിഃ 10 ശുഭേച്ഛാദിത്രയം ഭൂമിഭേദാഭേദയുതം സ്മൃതം. യഥാവദ്വേദ
കിരീടീ നേദം ചിരാത് ക്ഷിപ്രം ഇദം ഭവിഷ്യത്യ്; ആവർതതേ ഽസാവ് അഭിയാമി ചൈനം 101 ഏതച്
കാർമ്മുകശരധാരികളെന്നുള്ളൊരു ദുർമ്മദമേറിയ നിങ്ങളെയൊക്കെ നിർമ്മഥനം ചെയ്യാനായ്‌ സംഗര
കാലൈകവാദിനാം. യത്സർവശാസ്ത്രസിദ്ധാന്തം യത്സർവഹൃദയാനുഗം 21 യത്സർവം സർവഗം വസ്തു
നിയന്ത്രിച്ചുകൊണ്ടിരിക്കുന്നവനെ ത്തന്നെയാണെ, നിങ്ങൾ പാപംചെയ്യുന്നില്ലെങ്കിൽ ഈ
രുഷോത്ഥിതാൻ സമ്പേതതുർ അഭീതൗ തൗ ഗജൗ പ്രതിഗജാൻ ഇവ 6 ഊചുശ് ച വാചഃ പരുഷാസ് തേ രാജാനോ
വൈലക്ഷണ്യമചേഷ്ടിതവിഭൂമികത്വം സ്മൃതിപ്രമോഷശ്ച അന്യവചനം ച കാവ്യം തഥാർതനാദോ
കട്ടി-ശ്ലോ പുഷ്പിതാഗ്ര 28 മുഖാരവിന്ദേ മകരന്ദബിന്ദു- നിഷ്യന്ദലീലാമുരളീനിനാദേ
 കലാകാരനായിരുന്നു രാഘവൻ പിള്ള. ഈ കുറിപ്പ് എഴുതുന്ന ആൾ ദ്ദേഹത്തിന്റെ 'തുഷാരഹാരം'
പ്രതിനിധാനം ചെയ്യുന്ന വർഷത്തിലും നീളമുള്ള ആവർത്തനപച്ചപ്പ്‌ ആ പ്രദേശത്തിന്റെ
ഞാനുണ്ടതിനു തുണ തവ സുതനോ, മാനഹാനി തവ വരുത്തുവാനോ? ഹസ്തഗതം തവ വിദ്ധി മനീഷിത-
തലസ്ഥാനനഗരത്തിൽനിന്ന് ഏതാനും നാഴിക തെക്ക് ഒരു പയോഷ്ണീതീരത്തിൽ എത്തിയപ്പോൾ പുത്രി
ബാലോന്മത്തപിശാചവദനുന്മത്തോന്മത്ത- വദാചരംസ്ത്രിദണ്ഡം ശിക്യം പാത്രം കമണ്ഡലും
മൂന്നു സന്യാസിമാർ മാധ്യംദിനസ്നാനമാചരിച്ചഞ്ജസാ വന്നു വണിക്കിന്റെ