സൂക്ഷിച്ചു വയ്ക്കുകയും വേണം എന്നു പറയുകയാൽ രായർ ഭാര്യയോടുകൂടി ചെങ്ങന്നൂർ എത്തി
തട്ടാതെ അവ പുഷ്ടിപിടിക്കുകയില്ല. മേൽ കാണിച്ചതിൽനിന്നു കാൎബൺ, ( ഓക്സിജൻ, (
പഞ്ചായത്ത്/ഫലകം:വിക്കിപീഡിയ പഞ്ചായത്ത് എന്ന താൾ ഫലകം:വിക്കിഗ്രന്ഥശാ 7; 0.5 2.5%
ഭക്തിവിശേഷംകൊണ്ട്, വാ = (സമാധി) ഉണ്ടാവാം. സൂത്രം 24.
നിരീഹോഽസ്മി നിരംശോഽസ്മി നിരീപ്സിതഃ. സ്വച്ഛതോർജിതതാ സത്താ ഹൃദ്യതാ സത്യതാ ജ്ഞതാ 56
അശുദ്ധം കാമസങ്കൽപം ശുദ്ധം കാമവിവർജിതം 6 ലയവിക്ഷേപരഹിതം മനഃ കൃത്വാ സുനിശ്ചലം. യദാ
കോപമെല്ലാ, ശശിമുകി, വെഎറുതേ ഞാൻ പിഴ താൾ 32057 താൾ: 1942. 237 തെറ്റുതിരുത്തൽ വായന
നിധാനം ചെയ്യപ്പെട്ടത്. അർഘ്യം - പൂജാജലം. ഉരരീകരിക്കുക - സ്വീകരിക്ക. ഭാവം - അലയോ
സ്തുതിച്ചു തുടങ്ങിനാൾ. [രാമായണം 2. നാനമ്മോനം, ഉ ചെങ്കൊൽ നടത്തിയാളാ നിന്റെയാണ്ടു
അംഗീകുരു. അന്വയാർത്ഥം - അല്ലയോ മാതാവേ, ഭവതി ബാലാർക്ക
പ്രവേശിപ്പിക്കയും ചെയ്തു. മാധവിഅമ്മ പുത്രാഭ്യുദയാർത്ഥം സ്വദേഹദേഹികളെ സന്ധാനം
കൊണ്ട് അതും സ്വീകാര്യമല്ല. അതിനാൽ ലക്ഷണാ (നിർവ്വചനാ)ർഹങ്ങളായ അധിഷ്ഠാനത്തിനും
അധ്യായം ഈ പതിപ്പിൽനിന്ന് ഒഴിവാക്കിയിരിക്കുന്നു. പുസ്തകത്തിന്റെ പൊതുഘടനയെ അത്
പറഞ്ഞിട്ടുണ്ട്. ഇങ്ങനെ പറയേണ്ടിവന്ന സന്ദർഭങ്ങളൊക്കെയും, മി. ആചാരിയുടെ
സച്ഛിന്നധന്വാ സമരേ ഖഡ്ഗം ഉദ്യമ്യ നാനദൻ വൈഡൂര്യോത്പല വർണാഭം ഹസ്തിദന്ത മയ ത്സരും 28
പുറത്തിറങ്ങി നടക്കുവാൻ തുടങ്ങി. അപ്പോൾ ഹസ്സൻ കുട്ടികളുടെ കൂടെ കളിക്കുന്നത്
പാർവ്വതി. മണിമക്തൗികനിർമിതം - മണിമക്തൗികങ്ങളാൽ നിർമിക്കപ്പെട്ടത്. മണിമക്തൗികങ്ങൾ
വരുന്ന താളിൽ എന്നതിനു നേരെ കാണുന്നതാണ്‌ താങ്കൾ മലയാളം വിക്കിഗ്രന്ഥശാലയിൽ അംഗമായ
നിശി മരുത്പുരനാഥ പായാഃ നാരായണീയം/ദശകം എഴുപത്തിമൂന്ന് ൌ - ൗ മേല്പത്തൂർ
കൊടുങ്കാറ്റിലും കുന്നിളകുമോ? രാജാവ് : തോഴരേ. നിരാകരണകാലത്തിൽ കുഴങ്ങിവശമായപ്പോൾ
 കട്ടി-ശ്ല ൪൬ വസന്തതിലകം-൧൪ വണ്ടാറണിക്കുഴലിമാരണിമൗലിമാലേ!രണ്ടാദിനാല
ജനങ്ങളും വന്നുകൂടി. അവരിൽ ചിലർ 'എന്നാൽ ഇവൻ ഇവിടെ കുറച്ചുദിവസം താമസിക്കട്ടെ.
15 1913. 16 1913. 17 1913. 18 1913. 19 1913. 20 1913. 21 വിക്കിഗ്രന്ഥശാല: 2014
26078 താൾ: 3 1904. 615 26078 പ്രമാണം: 1922. കേരള സാഹിത്യ അക്കാദമി ഡിജിറ്റൽ ശേഖരം
ഗമിയ്ക്കുന്നു ഞാനും വഴിയെയെന്നവൻ അരുളിച്ചെയ്തവർ നടന്നുപോകുമ്പോൾ
അങ്ങനെ ഞങ്ങൾ സാക്ഷി നിൽക്കാമെന്ന് അവർ പറയും. (ഇപ്രകാരം ഞാൻ നിങ്ങളെ
കയ്യുകൾ. ര വലയശ്രണീ - ര വലയങ്ങളുടെ ശ്രണീ. വലയങ്ങൾ - ര ക്കടകങ്ങൾ. ശ്രണീ - കൂട്ടം.
മയൂരസന്ദേശം ഇവിടെ ഉത്തരാർദ്ധത്തിൽ നീ എനിക്കുവേണ്ടി ഈ കായക്ലേശം ചെയ്യുന്നതിനു
തത്ത്വതഃ 13 [സ്] തഥൈവ പർവതാ രാജൻ സപ്താത്ര മണിഭൂഷിതാഃ രത്നാകരാസ് തഥാ നദ്യസ് തേഷാം
തുല്യമായിത്തീരട്ടെ! എന്നാകുന്നു. വേറേവിധത്തിൽ വരുന്നതിന് ഉദാഹരണം - അകാര്യബന്ധു
വർഷത്യനാരതം 146 ധാതൂംശ്ച സംഗ്രഹേദ്വഹ്നിഃ പവനേന സമന്തതഃ. നാനാ നാദാഃ പ്രവർതന്തേ
വൈശാരദ്യേപ്പദ്ധ്യാത്മപ്രസാദഃ അർത്ഥം: നിർവിചാരവൈശാരദ്യേ= നിർവിചാരസമാധിയിൽ ദൃ നിഷ്ഠ
80 തെറ്റുതിരുത്തൽ വായന നടന്നിട്ടില്ലാത്തവ */ താൾ: 81 താൾ: 82 തെറ്റുതിരുത്തൽ വായന
ദളവായും വലിയ സർവ്വാധിയും സർവ്വാധിയും! സഹിക്കേണ്ടേ പൊളി കേട്ടാൽ? ആ കേശവനെ രാവിലെ
ശരിയായ മാർഗ്ഗത്തിലാണ് നടന്നത്. എന്നാൽ വല്ലവനും നമസ്കാരത്തിനു മുമ്പ് ബലി
ചന്തമ്പെടുന്നപടിചെയ്തൊരുമേഘവായു യന്ത്രപ്രയോഗമൊഴിവാക്കിനിലച്ചുവാതം 14
ധചെമെബറെ ഞ്ജ010 ദേവീമാനസപൂജാ സ്തോത്രം ആമുഖം ശ്രീശങ്കരാചാര്യർ സംസ്കൃതഭാഷയിൽ
നേരത്തെ നമസ്കരിക്കാറുണ്ടായിരുന്നു. ജുമുഅ: ക്ക്ശേഷമാണ്‌ ഞങ്ങൾ പകളിലെ ഉറക്കം
കിം ഭവതി. ജ്ഞാനാമൃതതൃപ്തയോഗിനോ ന കിഞ്ചിത്കർതവ്യമസ്തി തദസ്തി ചേന്ന സ
കരബലവും സാമാന്യമല്ലായിരുന്നു എന്നു തീർച്ചയാക്കാമല്ലോ. സൂകരവധം കഴിച്ചതിന്റെ ശേഷം
വായന കഴിഞ്ഞവ */ താൾ: 1925. താൾ: 1908. താൾ: 1925. 30 തലക്കെട്ട്2 പുതിയ പുസ്തകങ്ങൾ
പൂർത്തീകരണം വർഗ്ഗം:നാലുപേരിലൊരുത്തൻ അഥവാ നാടകാദ്യം കവിത്വം നോവലുകൾ വർഗ്ഗം:1893-ലെ
എടുത്തു സ്ത്രോത്രം ചൊല്ലി നുറുക്കി പറഞ്ഞു (വാങ്ങിഭക്ഷിപ്പിൻ) ഇതു നിങ്ങൾക്ക്
നിങ്ങളോടു സംസാരിച്ചുകൊണ്ടിരിക്കുന്ന വിഷയത്തിലേക്ക് എൻറെ വിചാരങ്ങളെ എനിക്ക്
ഇതിനെക്കുറിച്ച് നബി(സ)യോട് ഞാൻ ചോദിക്കട്ടെ എന്ന് കഅബ്(റ) പറഞ്ഞു. അല്ലെങ്കിൽ ഈ
പദ്യകൃതികളുടെ സമാഹാരങ്ങളായി പലേ ഗ്രന്ഥങ്ങളും പ്രകാശിതമായിട്ടുണ്ടെങ്കിലും എനിക്കു
ഉസ്മാൻ(റ) പറഞ്ഞു: അല്ലയോ അബാഅബ്ദുഹ്മാൻ! നിനക്ക് ഞാനൊരു കന്യകയെ വിവാഹം
4) വന്മലയ്ക്കുള്ള ശിഖരം വൽമീകമ്പോലെയുന്നതം. 5) നീലകണ്ഠൻ ബർഹിയിവൻ
പ്രാധാന്യം, ദൌർബല്യം, വേഗം എന്നു ശരിയായ രൂപങ്ങളാണു് മിക്ക ദിക്കിലും കാണുന്നതു്.
തുടങ്ങിയവയെല്ലാം ഈ ആഘാതങ്ങളിൽ പെടും. ഈ അപകടാവസ്ഥയുടെ ഗൗരവം ഉൾക്കൊണ്ടുകൊണ്ട്‌ ഇത്‌
മധ്യമപുരുഷ ദ്വിവചനത്തിൽ ഥസ് ആദേശം വന്ന് ഥസ് എന്നതിന് തം ആദേശം വന്ന് അഭൂ+തം=അഭൂതം
ചെയ്തു. (ബുഖാരി. 2. 26. 777) 78) ഇബ്നു അബ്ബാസ്(റ) പറയുന്നു: അറവ്
നിലനിർത്തിക്കൊണ്ട്‌ പ്രകൃതിവിഭവങ്ങളുടെ സംരക്ഷണവും മാനേജ്‌മെന്റും പൂർണ്ണമായി
14 താൾ: 13 തെറ്റുതിരുത്തൽ വായന കഴിഞ്ഞവ */ താൾ: 10 താൾ: 15 തു് നിൽക്കുന്നതു്
സംഗം തഥാന്തരഹമാദിഭിഃ വിരക്ത ഏവ ശക്നോതി ത്യക്തും ബ്രഹ്മണി നിഷ്ഠിതഃ 373 വൈരാഗ്യബോധൗ
നിന്ന് ഒഴിവാകാൻ ആഗ്രഹിക്കുന്നുവെങ്കിൽ എന്ന താളിൽ പോയി എന്ന വിഭാഗത്തിലുള്ള എന്ന
ഇഷ്വസ്ത്രോത്തമഭർതാരം ദിഗ് അന്തം ചൈവ ദക്ഷിണം 11 ഹിരണ്യകവചം ദേവം ചന്ദ്ര
692 301,1242. 693 649 694 1569. 695 19. 696 19, 1698,1699. 697 1552. 698 1911.
നിർദ്ദേശിക്കുന്നവയായിരുന്നു. 'കാതുകുത്തുപോലുള്ള അനിസ്ലാമിക ദുരാചാരങ്ങളെ എതിർക്കുക
വ്യാസൻ അധ്യായം 138 അധ്യായം137 അധ്യായം137 അധ്യായം139 അധ്യായം139 മഹാഭാരതം
വിദൂഷകൻ : നിന്നെ വിട്ടേച്ചതു ഭാഗ്യമായി. ചതുരിക : ദേവിതിരുമനസ്സിലെ ഉത്തരീയം
പ്രസവിക്കുന്നതുവരെ എന്റെ ഭവനത്തിൽ താമസിക്കട്ടെ. എന്തുകൊണ്ടെന്നാൽ, അങ്ങയ്ക്ക്
നമ്പൂരിപ്പാട്ടിലെക്കുണ്ടായ സന്തോഷം സീമാതീതമായിരുന്നു. കഥകളി കഴിഞ്ഞു
പ്രേഷ്യഭൂതോ ദുരന്ത കൃത് 14 കഥം ഭീമസ്യ വാക്യാനി ശ്രോതും ശക്ഷ്യാമി സഞ്ജയ യേന