58 നാദ്വൈതവാദം കുർവീത ഗുരുണാ സഹ കുത്രചിത്. അദ്വൈതം ഭാവയേദ്ഭക്ത്യാ ഗുരോർദേവസ്യ
മാതരം സാ മാ പ്രത്യബ്രവീദ്ബഹ്വഹം ചരന്തീ പരിചരിണീ യൗവനേ ത്വാമലഭേ സാഹമേതന്ന വേദ
നാളുകളിൽ പിന്നെ അവന്റെ ഭാൎയ്യ എലീശബെത്ത് ഗൎഭം ൧൨൮ വർഗ്ഗം:താളുകൾ - 1868 താൾ: 1868.
ജഗാദവാചം പ്രണതോർജ്ജുനോഹരിം പദം 26 അർജ്ജുനൻ പല്ലവി ശ്രൃണുവചോ മേ താത ശ്രൃണുവചോ മേ
വിജയികൾക്ക്, ഈ-ബുക്ക് റീഡർ, ടാബ്ലറ്റുകൾ, പോർട്ടബിൾ സ്കാനർ തുടങ്ങിയ ആകർഷകമായ
മണ്ണാർശ്ശാലയിലെപ്പോലെ കാവും കുളവുമെല്ലാം ഉണ്ടാക്കി സർപ്പപ്രതിഷ്ഠകൾ നടത്തണമെന്നു
ഭയം കരുതിയല്ലെടോ! അയോദ്ധ്യയും വിട്ടു വനത്തിൽ പോന്നതും പരമദുഷ്ടയാം ഭരതമാതാവു
കൈവല്യാശ്രമേ വസേത് 26 പ്രാണേ ഗതേ യഥാ ദേഹഃ സുഖം ദുഃഖം ന വിന്ദതി. തഥാ
നമ്പൂരി എന്ന വാക്കിൽ ബ്രഹ്മപരമായിരിക്കുന്ന 'ന' ശബ്ദത്തിനു് വേദം എന്നർത്ഥമാകയാൽ
പറഞ്ഞിട്ടുണ്ടായിരിക്കയില്ലെന്നാണു ഞാൻ വിചാരിക്കുന്നതു്. ഇങ്ങനെ ആയാൽ
ശക്തിയുള്ളു. മൃഗത്തിനുതന്നെ തന്നെക്കുറിച്ചുള്ള അറിവില്ല. ഇന്രിയങ്ങൾ വഴിയായി
നിന്നാ൪ മ൪ക്കടന്മാരശേഷം നലമൊടഥ ഹനുമാ൯ തന്റെ തോളി ക്കരേറി- ക്കലഹമവിടെയാരംഭിച്ചു
കാലമാചരൻഭവത്പദം പ്രാപി ഭവദ്ഭടൈരസൗ 22.11 സ്വകിംഗരാവേദനശങ്കിതോ യമസ്ത്വദംഘൃഭക്തേഷു ന
കഅ്ബയെ ത്വവാഫ് ചെയ്തു. മുഹാജിറുകളും അൻസാറുകളും അപ്രകാരം തന്നെ ചെയ്യുന്നതായി ഞാൻ
കണ്ടു. എന്റെ മാതാവ് എന്നോട് പറഞ്ഞു. അവരും സഹോദരിയും സുബൈറും ഒരു സ്ത്രീയും
മറ്റൊരു സംഭവത്തിന്റെ ഫലം (കാര്യം) ആണെന്നും ഇനിയൊരു സംഭവത്തിന്
ഉപയോക്താവ്:മനോജ്‌ എമ്പ്രാന്തിരി മനോജ്‌ എമ്പ്രാന്തിരി ഉപയോക്താവ്: അർജ്ജുൻ
1868. 315 1868. 316 1868. 317 1868. 318 1868. 319 1868. 320 1868. 321 1868. 322
നിഷാദഭൂമിം ഗോശൃംഗം പർവത പ്രവരം തഥാ തരസാ വ്യജയദ് ധീമാഞ് ശ്രേണിമന്തം ച പാർഥിവം 6 നവ
വിശേഷിച്ചും [പുറത്ത്] യാത്രചെയ്തിട്ടുള്ളവർക്കിടയിൽ. വസ്ത്രം
നാരദൻ:! 'ഉവ്വ്, ഞാൻ നിന്നോട് പറയാം. നീ ഈ പുളിമരം കാണുന്നുണ്ടല്ലോ. ആ മരത്തിന്മേൽ
നേരിടേണ്ടിവന്നിരുന്നു. സമുദായപരിഷ്ക്കരണപ്രസ്ഥാനങ്ങൾ പലപ്പോഴും ഇവയെ
രാമോഽഹമസ്മീതി തത്ത്വതഃ പ്രവദന്തി യേ. ന തേ സംസാരിണോ നൂനം രാമ ഏവ ന സംശയഃ
പെടുന്നു. പിന്നെ ആ കൊതു വേറൊരുത്തനെ ചെന്നു കടിക്കുമ്പോൾ അതിന്റെ വായിലുള്ള
പോയി കുളിച്ചു പോരികയും ചെയ്തു. ചേരമാൻ പെരുമാൾ ഊണു കഴിഞ്ഞു കൈ കഴുകിയപ്പോഴാണ്
ചിച്ഛേദ മാരിഷ ഹയാംശ് ച ചതുരഃ സംഖ്യേ പ്രേഷയാം ആസ മൃത്യവേ 25 വിരഥം സാത്യകിം കൃത്വാ
ശങ്കരാചാര്യരുടെ കൃതികൾ ജീവന്മുക്താനന്ദലഹരീ ശങ്കരാചാര്യർ വർഗ്ഗം:ശങ്കരാചാര്യരുടെ
അലങ്കാരത്തിൽ പ്രസിദ്ധമായ 'ലൈരിക്സ്' ( പൂർണ്ണകവിത)മൃതഭാഷകളിൽ ഉണ്ടാവാൻ വഴിയില്ല.
പകെക്കപ്പെട്ടവരാകും; അവസാനം വരെ നിന്നവൻ രക്ഷിക്കപ്പെടും താനും 400 ൧൪ 2എന്നാൽ
മേൽപ്പറഞ്ഞ രണ്ടാളുകളിൽ ഒരാൾ ഇങ്ങനെ പറഞ്ഞു: നമുക്കു് ഏഴരശ്ശനിയാണു്. സംശയമില്ല.
സത്വരമോടുന്നതുകണ്ടുവീരനാം ദൂഷണൻ ദൂഷിച്ചു മണ്ടുന്നവർകളെ-
ബന്ധപ്പെട്ട സമാനമായ ഒരു പ്രക്രിയയാണ്. പക്ഷേ, അതു കുറേക്കൂടി സങ്കീർണ്ണമാണെന്നു
യഹോവായ്ക്ക് ഒരു കുറച്ചിൽ തന്നെ ആയിരുന്നു. അല്ലെങ്കിൽ പ്രകാശിപ്പിക്കുന്നതിലേയ്ക്കു
ഭാഗിന്യാവേവാസ്യാമശനായാപിപാസേ ഭവതഃ 5 ഇത്യൈതരേയോപനിഷദി പ്രഥമാധ്യായേ ദ്വിതീയഃ ഖണ്ഡഃ
താഴെ ചേർക്കുന്നു: മയക്കം മറിമായഞ്ച മോഷണം നാരദക്രിയ അഞ്ചാം
സുഹൃദാം ശാസനാതിഗഃ 20 ബഹുശോ വിദുര ദ്രോണ കൃപ ഗാംഗേയ സൃഞ്ജയൈഃ പാണ്ഡുഭ്യഃ പ്രോച്യമാനോ
കെൽപ്റ്റഗ്ഗഹനപരാർണ്ണവത്തിൽ നിൽക്കുക്ം നില്പമ്പോ! നിരുപമ,കാർക്കു
പദ്മാവത്യന്നപൂർണേ മാഹേശ്വരീ സ്വാഹാ. തദ്ബഹിഃ പ്രണവമാലായുക്തം വൃത്തം.
വരുന്നതോടുകൂടി തണുത്ത ഓരോ ഭാഗം വേറിട്ടു പിരിഞ്ഞു നാം ഇപ്പോൾ കാണുന്നമാതിരി
പതിപ്പുകൾ: ഫോർമാറ്റിങ്ങ് ഫലകങ്ങൾ ഫലകം: ഫലകം: ഫലകം: എന്നതിൽ നിന്ന് ഒരു പതിപ്പ്:
മിന്നാമിനുങ്ങിനു് അതിന്റെ മുഖത്തിൽനിന്നും കീഴ്പോട്ടു് ഒരു തുമ്പിക്കൈ പോലെ
ജൂലൈ 2013 ( നല്ല നിർദ്ദേശമാണു്. എന്നോടും ഒന്നു രണ്ടു പേർ പുസ്തകം സ്വതന്ത്രമാക്കി
അഭവ+അൻ=അഭവ്+അ+അൻ എന്നും രണ്ടകാരങ്ങൾക്കും കൂടി ഒരു അകാരം വന്ന് അഭവ്+അൻ=അഭവൻ എന്നും
മരിച്ചതോടുകൂടി ഒരു വിരക്തനും കൂടി ആയിത്തീർന്നു. അദ്ദേഹം തന്റെ പുത്രൻ
ഇങ്ങിനെ ഊഹിച്ചു നോക്കിയാൽ ശരീരത്തിന്റെ ഓരോ ഭാഗത്തേയും പൂർണ്ണ നിയന്ത്രണത്തിൽ
താരിൽത്തന്വീകടാക്ഷാഞ്ചല മധുപകുലാരാമ എന്നും വൈരാകരനികരതമോമണ്ഡലീ ചണ്ഡഭാനോ എന്നും
താൾ: 1922. 22 തെറ്റുതിരുത്തൽ വായന നടന്നിട്ടില്ലാത്തവ */ ' കമ്പരുടെ രാമായണകഥ താൾ
അടുത്തുവന്നപ്പോൾ നബി(സ) പ്രതികാര നടപടിക്ക് കൽപ്പിച്ചു. അനസ്ബ്നുഉമർ(റ) പറഞ്ഞു.
ലീലാലോലനായ ഒരു ബാലന്റെ ഭാവത്തിലും ധാരാളം തൊന്തരവുകൾ കാണിക്കുന്ന ഒരു
എഴുന്നേറ്റ് നിന്ന് നമസ്കാരം ആരംഭിച്ചു. ശേഷം ജനങ്ങളോട് പ്രസംഗിച്ചു. പ്രസംഗത്തിൽ
മാസങ്ങളിലും പതിനഞ്ചാം തീയതി തോറും വെളുപ്പാൻകാലത്തു മൂന്നു മണിക്ക് ഇവിടെ കൊണ്ടു
തിരുവനന്തപുരം, വയനാട്‌ കൊല്ലം, തിരുവനന്തപുരം കാസർകോട്‌, കൊല്ലം, പത്തനംതിട്ട,
ഞാൻ പരിഗ്രഹിച്ചുള്ളവളെ ത്യജിക്കണോ? പരാംഗനാസംഗകളങ്കമേൽക്കണോ? പുരോഹിതൻ:
തെക്കോട്ടുള്ള പ്രദേശത്തെ പച്ചിലക്കാടുകൾ സ്ഥായിയാണ്‌. വർഷക്കാലത്ത്‌ മലനിരകളിലൂടെ
കാലത്തുംനമസ്കാരം ചെറുപാപങ്ങളെ പൊറുപ്പിക്കാതിരിക്കുകയില്ലഅബുസുഹൈരി(റ)ൽ നിന്ന്‌
ചോദിച്ചു പോകരുതെന്നു പറയുമോ? എന്റെ മനസ്സുപോലെ ചെയ്തു. നീ ഇനി അതിനെക്കുറിച്ച്
രാജ്യകാര്യങ്ങൾ സംബന്ധിച്ചു ചില പരിഷ്കാരങ്ങൾ ചെയ്യണമെന്നുള്ള വിചാരം ശക്തൻ തമ്പുരാൻ
1868. 355 തെറ്റുതിരുത്തൽ വായന കഴിഞ്ഞവ */ താൾ: 1902. 74 1283 ചത്തുകിടക്കിലും
അദ്ദേഹം ആരും കാണാതെയും ആരോടും പറയാതെയും നേരമ്പോക്കിനായി അതെടുത്തുകൊണ്ടു പോയി
ഉപയോക്താവ്: 13 സൂചിക: ഉപയോക്താവ്: 14 സൂചിക:സുധാംഗദ. ഉപയോക്താവ്: 15
അശ്വമേധം ചിത്രതേജോചലജ്വാലാജടാലമായ് ജ താൾ താൾ: 2 17 തെറ്റുതിരുത്തൽ വായന
അർത്ഥസഹിതം/ആമുഖം ആമുഖം വിദുരനീതി അർത്ഥസഹിതം/അദ്ധ്യായം 1 അദ്ധ്യായം 1 വിദുരനീതി
കൊച്ചയ്യപ്പനെപോലെ ബുദ്ധിയും സാമർത്ഥ്യവുമുള്ള ഒരു താപ്പാന തിരുവിതാംകൂറിൽ
പ്രത്യഗ്ബ്രഹ്മവിചാരപൂർവമുഭയോരേകത്വബോധാദ്വിനാ കൈവല്യം പുരുഷസ്യ സിദ്ധ്യതി