പൊക്കിപ്പിടിച്ചുകൊണ്ടാണ് അദ്ദേഹം തുള്ളുക പതിവ്. നമ്പ്യാർക്കു തുള്ളൽ വരുന്നത് ഇന്ന
ശപിച്ചിതിന്നെയും മൃതസുതനുടെ ജലക്രിയ ചെയ്തു ഹുതാശനൻ തന്നിൽ പ്രവേശിച്ചാർ പിന്നെ
ഡാറ്റാബേസ്‌ വിപുലീകരിക്കുന്നതിന്‌ കണക്കിലെടുക്കാം. ആസ്‌ട്രേലിയയിലെ `റിവർവാച്ച്‌
ശ്രീലോദ്രേകസമീക്ഷജോന്മദഭരം ഘോഷിപ്പൂ കൂകൂരവം. ഉത്സിക്തദ്രാസലീലാരസഭരിതങ്ങളാ-
ഇടകലർത്തിയാണു താങ്കൾ ഉപയോഗിക്കുന്നതെങ്കിൽ ഇടത്തുനിന്നു വലത്തോട്ടെഴുതുന്ന ലിപി
കൈക്കൊണ്ടതും ഇല്ല. ആർ അവനെ കൈക്കൊണ്ടിട്ടും അവന്റെ നാമത്തിൽ വിശ്വ ൧൨
താൾ സൃഷ്ട താൾ: 3 1910. 79 താൾ: 2 91 തെറ്റുതിരുത്തൽ വായന നടന്നിട്ടില്ലാത്തവ */
സ്യാന്മുനിർബ്രഹ്മാ വിരാട് സ്മൃതഃ 48 ഛന്ദസ്തു ദേവതാ പ്രോക്തോ രാമോ രാക്ഷസമർദനഃ.
തെറ്റുതിരുത്തൽ വായന നടന്നിട്ടില്ലാത്തവ */ '627 കിളിപ്പാട്ട്
സ്ഥലമല്ല അതിനുത്തരവാദി. ശൂന്യവും നിബദ്ധവും ആയ സ്ഥലങ്ങൾ തമ്മിലുള്ള അന്തരം
താൾ ഫലകം: എന്ന തലക്കെട്ടിലേയ്ക്ക് തിരിച്ചുവിടല ഫലകം: ഫലകം: ഫലകം: എന്ന താൾ ഫലകം:
ത്വത്സുതൻ പാർത്ഥന്റെ ജീവിതം മജ്ജൂഷ- ഇടഇടയശ്വനദിയ്ക്കുള്ളിൽ വീഴുവോളം, രാധ
എടുക്കൂ! വിരലുകൾ വിടർത്തി കഴുകുകയും നോമ്പുകാരനല്ലെങ്കിൽ മൂക്കിൽ നല്ലവണ്ണം വെള്ളം
പശ്യാമി കൃത്സ്നാൻ ദേവഗണാംസ് തഥാ 108 ഗന്ധർവാപ്സരസോ യക്ഷാൻ ഋഷീംശ് ചൈവ മഹീപതേ
ചെയ്തുകൊണ്ടാലുമി- ക്കാടകം തന്നിലിക്കാരിയമൊക്കയും. ഇത്തരം ജാനകി ചൊല്ലിയവാക്കുകേ-
വിപ്രക്ഷേത്രിയവൈശ്യാനാം സ്ഥാനീയാ യേ ച മാനവാഃ ശുദ്ധോ വസ്ത്രവിധിസ്തേഷാം കർതവ്യോ
സംരക്ഷണത്തിൽനിന്ന് ഒഴിവാക്കിക്കൊണ്ട് നിയമം പാസ്സാക്കി. ഈ പശ്ചാത്തലത്തിൽ പ്രത്യേക
അവൾക്കൊരു മാസിക കൊടുത്തില്ലേ?അതിന്റെ പേര് എന്താണ്.മലയാളബഹളമോ?അല്ല
താൾ: 1933. 17 താൾ: 1933. 30 താൾ: 1933. താൾ: 02 05-150 താൾ: 1914. 20 താൾ: 1933. 11
അവസ്ഥാത്രയശോധനാ സമ്പ്രദായപ്രകരണം അവസ്ഥാത്രയശോധനാ സമ്പ്രദായപ്രകരണം നിജാനന്ദവിലാസം
മൂർത്തിമൂന്നിനുംതാൻ പണിയാമല്ലോ കൃഷ്ണാർജ താൾ 16057 താൾ: 1917. 129 തെറ്റുതിരുത്തൽ
പറഞ്ഞുവരുന്നതു.നമ്മുടെ പ്രാപ്യസ്ഥാനം അതാകുന്നു. എല്ലാപ്രവർത്തിക്കും
ഇത്യാദി വർണ്ണത്തെ പറയുപൊൾ സംജ്ഞയായി കാരപ്രത്യയം വെണം ര എന്നതിന്ന മാത്രം ഇഫ
അലങ്കാരമാകുന്നതല്ല. അതിനാൽ, കുയിൽ കാക്കയെ പോലെ കറുത്തതാകുന്നു എന്നുള്ള
ക്ഷേത്രമുണ്ടായ കാലത്തുതന്നെ ദേശക്കാർ ദേവസ്വം പേരിൽ സമ്പാദിച്ചുവെന്നു മുമ്പു
അരുളി: മദീനയുടെ പ്രവേശന കവാടങ്ങളിൽ മലക്കുകൾ നിൽക്കും. പ്ളേഗോ ദജ്ജാലോ അതിൽ
കുലസ്ത്രീയും ചന്തപ്പെണ്ണും ഉണ്ടായതെങ്ങനെ? താൾ: 173 എഴുത്ത് ഇല്ലാത്തവ */ പ്രമാണം:
ബ്+അ+ഭൂവ്+അ=ബഭൂവ എന്നു സിദ്ധിയ്ക്കും. ദ്വിവചനത്തിലെ തസ് എന്നതിനു അതുസ് എന്നു
ഗോത്രത്തിൽ പെട്ട ഒരു മനുഷ്യനെ നിയോഗിച്ച് ഇപ്രകാരം വിളിച്ചുപറയാൻ കൽപ്പിച്ചു.
തത്പശ്ചാത്പരേണേരിതം വിഷയത്വം പ്രയാത്യേതദ്വൈ രജസോ രൂപം തദ്രജഃ ഖല്വീരിതം വിഷമത്വം
മരത്തിന്മേൽനിന്നിറങ്ങി. കുറേനേരം അന്യോന്യം വിവരങ്ങളെല്ലാം പറഞ്ഞു. ശംകുമാരാരുടെ
താൾ 25078 താൾ: 4 1911. 211 തെറ്റുതിരുത്തൽ വായന നടന്നിട്ടില്ലാത്തവ */ '176
ഫലജിജ്ഞാസാഭേദാച്ച. അഭ്യുദയഫലം ധർമ്മജ്ഞാനം തച്ചാനു ഷ്ഠാനാപേക്ഷം നിശ്രേയസഫലന്തു
ജീവിതത്തിലുണ്ടായിട്ടില്ല; അത് ഒരു തടാകംപോലെ ശാന്തനിർമ്മലമായിരുന്നു. 1884-ൽ
ജഞാനസിദ്ധാന്തപരമായ ( പ്രശ്നങ്ങളുമായി ബദ്ധപ്പെട്ട് മാർക്സിസ്റ്റു
വിദ്യാന്നേത്യാം വിജിജ്ഞാസീതൈതാരം വിദ്യാന്ന മനോ വിജിജ്ഞാസീത മന്താരം വിദ്യാത്താ വാ
രസിക്കുമീ ഞാൻ നീരോട്ടമുള്ള പുഴയൊന്നു കടന്നുവന്നി- ട്ടാരാഞ്ഞിടുന്നു ബത, കാനൽജലം
ആര്യേ ഭവതഃ വിപരിതാലങ്കാരൈർവികൃതാചരാഭിധാനവേഷൈശ്ച വികൃതൈരർഥവിശേഷൈർഹസതീതി രസഃ സ്മൃതോ
സർവസങ്കൽപസംഭ്രമഃ. സർവാധ്യാസം സർവഗോപ്യം സർവഭോഗപ്രഭേദകം 49 സർവദോഷപ്രഭേദാച്ച
പ്രത്യഗ്ബ്രഹ്മണോർഭേദം കദാപി ബ്രഹ്മസർഗയോഃ പ്രജ്ഞയാ യോ വിജാനിതി സ ജീവന്മുക്തലക്ഷണഃ
മറ്റൊരു ബോധം വഴിയായേ വരുന്നുള്ളു. നിർജ്ജീവവും, ജ്ഞാനരഹിതവുമായ ജഡവസ്തു ഒരിക്കലും. മഹവിഷ്ണോഃ സമസ്താസാധാരണചിഹ്നചിഹ്നിതഃ. ഏവമുപാസകഃ സുദർശനപുരുഷ ധ്യാത്വാ
സ്ഥൂലോഽന്തർദ്വിതീയഃ പാദ ഉച്യതേ 10 കാമം കാമയതേ യാവദ്യത്ര സുപ്തോ ന കഞ്ചന. സ്വപ്നം
പരിണാമവാദികളുടെ അഭിപ്രായപ്രകാരം ഒരുപദാർത്ഥത്തിന്റെ അംഗങ്ങളുടെ സംയോഗവി യോഗങ്ങൾ
( 401 മുതൽ 600 വരെ താളുകൾ) വിക്കിഗ്രന്ഥശാല: 2014_ 1868. ഭാഗം 4 ( 601 മുതൽ 660 വരെ
സർക്കാർ അച്ചുക്കൂടം തിരുവനന്തപുരം 1925 സൂചിക: 1921. 2014 ഗൗരീചരിതം (ഒരു പഴയ
ഔദ്ധത്യപരിഹാരം, ആത്മരക്ഷയ്ക്കുള്ള കരുതൽ, അലങ്കാരം മുതലായതിനുവേണ്ടി ചെയ്യുന്ന
ചൊല്ലിനാൻ ലക്ഷ്മണനോടു തെളിഞ്ഞഥ- പാതകമൊക്കെയകന്നിതു ലക്ഷ്മണ!
രൂപമീയെന്റെ സമയമാം രഥത്തിൽ ഞാൻ ദൈവത്തിന്റെ ഏകപുത്രൻ കർത്താവിനെ നാം സ്തുതിക്ക എൻ
മുദ്രാ നാമ്നാ ച ഖേചരീ 42 ഛേദനചാലനദാഹൈഃ ഫലാം പരാം ജിഹ്വാം കൃത്വാ ദൃഷ്ടിം ഭ്രൂമധ്യേ
വ്യാഴശുക്രന്മാരെ പിടിച്ചുവെച്ചിട്ടുള്ളവയും രണ്ടു പള്ളകളിലും വരിവരിയായി
നാരായണൻമൂസ്സ് അവർകൾക്കു പതിനെട്ടു വയസ്സേ പ്രായമായിരുന്നുള്ളു. 2. പ്രസിദ്ധ
ആശ്രമാത് തേ മാർകണ്ഡേയാച് ഛ്രുതവന്തഃ പുരാണം; ദേവർഷീണാം ചരിതം വിസ്തരേണ 43
ശേഷം ബാക്കി വല്ലതും ഉണ്ടായിരുന്നാൽ അതു ബങ്കി അയച്ച ആൾ ഒരു കൊല്ലത്തിനകം
തുഷ്ട്യാ സത്രേ ദവൈപായനാജ്ഞയാ 19 വേദൈശ ചതുർഭിഃ സമിതാം വയാസസ്യാദ്ഭുത കർമണഃ സംഹിതാം
നിവേദനം: തിരുദൂതൻ(സ) അരുളി: ഇഹലോകം അല്ലാഹുവിങ്കൽ ഒരു കൊതുകിന്റെ ചിറകിന്റെയത്രയും
കുലസ്ത്രീയും' 'ചന്തപ്പെണ്ണും' ഉണ്ടായതെങ്ങനെ?/ആമുഖം കുലസ്ത്രീയും ചന്തപ്പെണ്ണും
മിതത്വമുണ്ടായിരുന്ന ഒരുകാര്യത്തിൽ തിടുക്കം കൂട്ടി: അതിനാൽ അവരെ സംബന്ധിച്ചു
പ്രദേശങ്ങളിൽ ഒട്ടുമിക്ക ഇടങ്ങളിലും ഇത്തരം ജീവികളെ കാണാം. ചിലയിനം കാട്ടുചേനകൾ,
വിഹിതനിരസ്തസമസ്തചിത്തദോഷാഃ ഭവസുഖവിരതാഃ പ്രശാന്തചിത്താഃ ശ്രുതിരസികാ യതയോ മുമുക്ഷവോ
കാട്ടുകില്ല ൪൬ ഒന്നല്ല ഞാനബലയൂഴിയിൽ മറ്റൊരുത്തൻ തന്നല്ല നിത്യത
ജായേത നിശ്ചിതം. യോഗാവിഘ്നകരാഹാരം വർജയേദ്യോഗവിത്തമഃ 46 ലവണം സർഷപം ചാമ്ലമുഷ്ണം
സംഖ്യേ പാലിതാഞ് ശാർമ്ഗധന്വനാ 36 യത് തു മേ കഥിതം താത മുനിഭിർ ഭാവിതാത്മഭിഃ
ആത്മന്യൈവ നൃസിംഹേ ദേവേ ബ്രഹ്മണി വർതതേ തസ്മാദയമനൽപോ ഭിന്നരൂപഃ സ്വപ്രകാശോ