പദാർത്ഥങ്ങളുടെ ഉൽപ്പത്തിയെക്കുറിച്ച് ആരാഞ്ഞിട്ടുള്ളവരെല്ലാപേരും മൃഗാത്മാവിനും
ഗുണിച്ചിട്ടുള്ളതായിട്ടിരിക്കും. ചെറിയ രാശിയും അന്തരവുമുള്ള യോഗം വലിയ
ഉണ്ടാക്കാനും, ചരിത്രം എഴുതാനും ശാസ്ത്രം പഠിപ്പിക്കാനും പദ്യ ഗധ്യങ്ങൾ രചിക്കാനും
ആ സമയം അവിടത്തെ ഒരു ചെറിയ കുഞ്ഞമ്മ കുറെചോറെടുത്തു കുഴച്ചുരുട്ടി കൊച്ചയപ്പനു
1868. 573 1868. 574 1868. 575 1868. 576 1868. 577 1868. 578 1868. 579 1868. 580
സ്വ. ഇത്യാദി പ്രയോഗിച്ചാൽ കർണകഠോരമായിരിക്കും എന്നതിന് എന്തു സന്ദേഹം? 4. ഹതവൃത്തം
സ്വഭാവത്തിനു സഹജങ്ങാളായ സാധുത, ദയ, സ്നേഹം, അധർമഭീരുത്വം, വിനയം മുതലായ
പറഞ്ഞുകൊടുത്തുള്ളു എന്നുള്ള സമാധാനം പറഞ്ഞ് സമ്മതപ്പെടുത്തുന്നതി
വാസനാതാനവം യത് 267 അഹം മമേതി യോ ഭാവോ ദേഹാക്ഷാദാവനാത്മനി അധ്യാസോ യം നിരസ്തവ്യോ
താൾ: 136 തെറ്റുതിരുത്തൽ വായന കഴിഞ്ഞവ */ താൾ: 137 തെറ്റുതിരുത്തൽ വായന കഴിഞ്ഞവ */
പടുപ്പിക്കുന്ന കർമ്മത്തിലും അദ്ദേഹംതന്നെ മേൽനോട്ടം വഹിച്ചു. തന്റെ
തെറ്റുതിരുത്തൽ വായന കഴിഞ്ഞവ */ വർഗ്ഗം:താളുകൾ - 1915 താൾ: 1915. 101 വർഗ്ഗം:താളുകൾ
ചേർന്ന്, മതവിദഗ്ദ്ധതയിൽ വലരെ പ്രസിദ്ധനായി അനേകം ഗ്രന്ഥങ്ങൾ നിർമ്മിച്ചു.
കൊടുക്കാതിരിക്കട്ടെ. (ബുഖാരി. 2. 24. 550) 51) ഹാക്കിം(റ) നിവേദനം: ഒരിക്കൽ ഞാൻ
പങ്കാളിത്ത സമീപനമാണ്‌ സമിതി ഇക്കാര്യത്തിൽ ശുപാർശ ചെയ്യുന്നത്‌. പശ്ചിമഘട്ടത്തിന്റെ
വസ്തുത നിർവിവാദമാണ്. അദ്ദേഹം രാമായണേതിവൃത്തത്തിനെ എട്ടു ദിവസങ്ങളായി
രൂപം സിദ്ധമായി. ലു ന്ധ-ഞ്ജ-11 ഭൂതാർത്ഥവൃത്തിയായിരിക്കുന്ന ധാതു വിന് അതായത് ലിട്,
മൊത്തം വിഷ്വൽസും അവരു പുതിയതായി ഉണ്ടാക്കുന്നതാണ്, അതൊന്നും പഴയകൃതിയുടെ പകർപ്പവകാശ
നാഹമദോ പ്യുഭയോരവഭാസകം പരം ശുദ്ധം ബാഹ്യാഭ്യന്തരശൂന്യം പൂർണം ബ്രഹ്മാദ്വിതീയമേവാഹം
സുഭിന്റെ രണ്ടു റൿഅത്ത്‌ഇഹലോകത്തേക്കാളും അതിലുള്ളതിനെക്കാളും ഗുണകരമായതാണ്‌.
വ്യാഖ്യാനത്തിൽ ഇപ്രകാരം സമാധാനിപ്പി ച്ചിരിക്കുന്നു. ഇത്രയും കൊണ്ട് സംസ്കൃത
6-4-ന്ധ) എന്ന സൂത്രത്താൽ അ എന്നതിനു ദീർഘം വന്നു രാമ്+ആ+നു+ആമ് എന്നും അട്കുപ്വാ
അധ്യായം15 മഹാഭാരതം മൂലം/കർണപർവം/അധ്യായം16 അധ്യായം16 മഹാഭാരതം
പുസ്തകത്തിന്റെ/ഉദ്യമത്തിന്റെ സ്കാനുകളുടെ വിശദവിവരങ്ങളാണ് സൂചികയിലുള്ളത്. സ്കാനുകൾ
സ്തോത്രം-43 സ്തോത്രങ്ങൾ/44 സ്തോത്രം-44 സ്തോത്രങ്ങൾ/45 സ്തോത്രം-45 സ്തോത്രങ്ങൾ/46
ഏ. കരേഷു - അ. പു. സ. ബ. ക്രമാൽ - അവ്യ. താടങ്കേ - അ. ന. ദ്വി തവ - യുഷ്മ. ദ. ഷ. ഏ.
വർഗ്ഗം:കൃതികൾ_രചയിതാവ്_അനുസരിച്ച് വർഗ്ഗം:1913-ലെ കൃതികൾ വർഗ്ഗം:കൃതികൾ വർഷം
വ്രതമെന്നറിക, പരിചെഴുമധർമ്മമെന്മതമേ, പരമിപ്പോൾ ദുശ്ശീലമെല്ലാം ഗതമേ, ഇനിമേൽ
മറ്റേതിങ്കന്നു കളഞ്ഞതു് അത്രച്ച വരിയിലെ ഖണ്ഡസംഖ്യയും കുറഞ്ഞുംപോയി. ഇങ്ങനെ
ചെയ്യുന്നില്ല. പള്ളിപ്പുറത്തുകാവിൽ ഭഗവതിയുടെ മാഹാത്മ്യത്തെക്കുറിച്ച് ഇനിയും
ഉർവശിരൂപ സൃഷ്ടിസാമർത്ഥ്യം ഇല്ലെന്നു ഉത്തരാദ്ധം കൊണ്ടു ഗമ്യമായ നിശ്ചയവും
ബ്രഹ്മാധിപതിർബ്രഹ്മണോഽധിപതിർബ്രഹ്മാ ശിവോ മേ അസ്തു സദാശിവോം ദ്വാവിംശോഽനുവാകഃ. നമോ
പാവനത എന്നുള്ള ധർമ്മം ഭാഗ്യജീവിതത്തിൽ അനുവർത്തിക്കുവാൻ നിർബ്ബന്ധിതമല്ലെന്നും
ദൂരെയുടൻ തുരത്തും. കിടപ്പിലായാലരികത്തിരുന്നു പടുത്വമോടെ പരിചര്യ ചെയ്‍വൻ
അതല്ല വിചാരണ ചെയ്യണം എങ്കിൽ ആ വിചാരണകൊണ്ടു മുക്തിയിൽ ഇരുന്നവരെ നരകത്തിലും
സംശയിച്ചില്ല. മഹാരാജാവും അടുത്തനാളിൽ മൌര്യനേയും അവനന്ദന്മാരേയും വരുത്തി
കാറുപോലെ, വടക്കോട്ട് പോയാ ആളെ പോലെ- 1548 തെക്കോട്ടുപോയ മഴയും, വടകോട്ടുപോയ
ചെയ്യേണ്ടിവരുന്നതുകൊണ്ട് അതിന്മേൽ സവാരി ചെയ്യാം. അപ്രകാരം തന്നെ പാൽ കറന്ന്
ആദ്ഗുണ: എന്ന സൂത്രത്താൽ അ, ഇ എന്നിവ രണ്ടിനും കൂടി ഏകാരം ഏകാദേശമായി വന്ന്
എന്തിനിനല്ല്ലതെന്നിങ്ങുചോദിക്കിലേ- ബന്ധമുള്ളു നിനക്കിങ്ങിനെ ചൊല്ലുവാൻ ബന്ധുവാം
സർവരാക്ഷസൈഃ മഹാഭാരതം മൂലം/വനപർവം/അധ്യായം160 വ്യാസൻ അധ്യായം160 അധ്യായം159
നതേഷാം ജായതേ ക്വാപി സ്വാത്മസാക്ഷാത്കൃതിർഭുവി 18 വർഗ്ഗം:ശങ്കരാചാര്യരുടെ കൃതികൾ
41. 576) 5) ജാബിർ(റ) നിവേദനം: നബി(സ) പൂർവ്വാഹ്നത്തിൽ പള്ളിയിലിരിക്കുമ്പോൾ ഞാൻ
പറഞ്ഞു വരുന്നത് അമ്മുവന്മാരെന്നുമാണ്. പയ്യന്നൂർ ഗ്രാമത്തിൽ പണ്ടു അനേകം
പിടുത്തം വിട്ടു മാതലിയും വിദൂഷകനും പ്രവേശിക്കുന്നു മാതലി : ഹരിയസുരയല്ലോ നിൻ
വയലിലെ കുടിയിൽ അപ്പനമ്മമാരോടും സഹോദരങ്ങളോടും അമ്മൂമ്മയോടുമൊത്താണ് കുട്ടിക്കാലം
രഹസ്യങ്ങൾ മാൻ - സിംഹക്കളി മാൻ - സിംഹക്കളി പാമ്പുകളി പാമ്പുകളി വർഗ്ഗം:വായിച്ചാലും
കൂടിയാലോചിച്ച് അന്നുതന്നെ മാറ്റുകയും തന്ത്രത്തിന് അവിടെ വേറെ ആളെ നിയമിക്കുകയും
എന്ന താൾ വിക്കിഗ്രന്ഥശാല:നീക്കം ചെയ്ത താളിന്റെ സം ഈ വർഗ്ഗമെന്താ
വ്യാസൻ അധ്യായം9 അധ്യായം8 അധ്യായം8 അധ്യായം10 അധ്യായം10 1 [സ്] തത് പ്രാഭഗ്നം ബലം
56307] [ 178048] 18, 2014. 20141218 00 8 00:00 08:00 ( 2014- 079816. 76773]
അമൃതത്വമാനശുഃ. പരേണ നാകം നിഹിതം ഗുഹായാം ബിഭ്രാജതേ യദ്യതയോ വിശന്തി 14
രാജകീയം, രാജത്വം, രാജ്യം, രാജന്യൻ, നാജനൃകം, രാജകം. മലം - മലിനം, മാലിന്യം. സർവ്വം
പരമപൂരുഷവരുന്നു ഞങ്ങളും ഭരതന്റെ കീഴിലിരിക്കയില്ലാരും പുരവാസീജനമറിഞ്ഞുകൊള്ളുക
ഗമിച്ചിതോസുന്ദരി സീതാതനിയെഗമിക്കയില്ലങ്ങിനെ താമരപ്പൂവിന്നുപോയിതോജാനകി
പുത്രന്മാരേയും ലഭിച്ചു. പുത്രശോകം കൊണ്ട്‌ നീ എന്നെ ശകാരിച്ചപ്പോൾ ഞാൻ
കൂടാതെ അദ്ദേഹം ഊണ് കഴിക്കും. അങ്ങനെ ഒരു നേരം മാത്രമേ അദ്ദേഹം ഊണ്
ജാഗ്രദവസ്ഥയിൽ കാണുന്ന സംഗതികളെ ശരിയാണെന്നു സ്ഥാപിപ്പാൻ വല്ല സ്വപ്നങങളോ
കാശിമാഹാത്മ്യം പ്രഥമാദ്ധ്യായം സമാപ്തം 40 40 40 താൾ: 1942. 34 16009 താൾ: 1907. 63
അതു തിന്നാൻ വേണ്ടി ഞാൻ എടുക്കും. അപ്പോൾ അതു സക്കാത്ത് വകയിൽപ്പെട്ടതാണോ എന്ന്
നിരയുടെ വീതി നിർവചിക്കാവുന്നതാണ്. ഒരു കളത്തിൽ മാത്രം നിരയുടെ വീതിയോ വരിയുടെ ഉയരമോ
സമിതി പരിഗണിക്കുന്നത്‌. പശ്ചിമഘട്ടത്തിന്റെ അതിരുകൾ നിർണ്ണയിക്കുന്നതിൽ
പരമാത്മ ചൈതന്യമായ തനതധിഷ്ഠാനചൈതന്യം തന്നെ, ഒരു സ്ഥാണു ചോരനായി തോന്നുന്നതുപോലെ,
വ്യസന ത്തോടുകൂടി ഇരിക്കവേതന്നെ രണ്ടാമതു ഉപദേശിച്ചുമിരിക്കുന്നു; ഇപ്രകാരം വരുന്നവൻ