മദാമ്മ 1877ൽ പ്രസിദ്ധീകരിച്ച ഘാതകവധം എന്ന നോവലിലും 'സ്ത്രീധനം'
വചനം യദുതാഹൃതം പരസ്ഥം വർതമാനം ച പരോക്ഷം ചൈവ തദ്ഭവേത് 68 കരിഷ്യന്തി ഗമിഷ്യന്തി
നടന്നിട്ടില്ലാത്തവ */ ' (6-ബി) മർമ്മ താൾ 16071 താൾ: 1 1908. 267 തെറ്റുതിരുത്തൽ
ഏകാന്തതയിൽ പൂക്കാരി പൂക്കാരി വർഗ്ഗം:മയൂഖമാല താൾ: 31 ബിപിൻ തെറ്റുതിരുത്തൽ വായന
മാറിത്താമസിക്കാൻ തീരുമാനിച്ച വിവരം ഞാനറിഞ്ഞിരിക്കുന്നു. അവർ പറഞ്ഞു: അതെ,
നമ്മുടെ കൂടെ വരും. നമ്മെപ്പോലുള്ള ഒട്ടേറെ രാജ്യങ്ങളുണ്ട്. ഏഷ്യയിലും ആഫ്രിക്കയിലും
 97.മാരഭ്രാന്തിൽവെളിവറ്റുവേരറുത്തമരംപോലെ പാരിൽവീണുകിടപ്പായീപാർത്ഥിപൻവീണ്ടും
അവതരിപ്പിക്കുന്നതിന്റെ അർത്ഥശൂന്യത അക്കാലത്ത് ചിലരെങ്കിലും തിരിച്ചറിഞ്ഞിരുന്നു.
(ഏണിച്ചു്) ഏതു ഖണ്ഡത്തിലും സഞ്ചരിക്കാം. മദ്ധ്യേ വേറെ കരുക്കൾ ഇരുന്നാൽ അതിനെ
ദൂഷിച്ചുമണ്ടുന്നരാക്ഷസസേനയെ നാണം കരുതി നിശാചരാധീശനും ബാണഗണങ്ങളെത്തൂകിത്തെരുതെരെ
വഹിച്ചിരുന്ന കൊച്ചി രാജാവിന്റെ ആശ്രിതനായും താമസിച്ചിരുന്നു. അക്കാലത്താണ്
ചിറകടിച്ചു, ഉറക്കെ കൂവി തന്റെ വിജയം ആഘോഷിക്കുകയായിരുന്നു. ആകാശത്തുകൂടി
അധ്യായം1 അധ്യായം2 അധ്യായം2 മഹാഭാരതം/വനപർവം/അധ്യായം2 2 വ്യാസൻ അധ്യായം2 താൾ
അലി(റ)യുടെ പിന്നിൽ നമസ്കരിച്ചിട്ടുണ്ട്. എന്റെ കൂടെ ഇംറാൻ(റ) നും ഉണ്ടായിരുന്നു.
വക്ഷോഭുവി നാമ പാദം ഭൃഗോഃ പദാഘാതകഥാം നിശമ്യ സ്വേനാപി ശക്യം തദിതീവ മോഹാത്‌ 71.4
സമൂഹത്തിന് അവശ്യം വേണ്ട പ്രവർത്തനങ്ങൾ തമ്മിലും വൈരുദ്ധ്യങ്ങൾ ഉണ്ട്. എന്നാൽ ഇവ
ഗവ.എസ്.എൻ.ഡി.പി.യു.പി.സ്കൂൾ അപ്‌ലോഡ് വാഴ പട്ടത്താനം ഗവ.എസ്.എൻ.ഡി.പി.യു.പി.സ്കൂൾ
പൊടികളെക്കൊണ്ടുനിറഞ്ഞിതാകാശം വടിവുള്ള സേനാനിനാദങ്ങൾ കൊണ്ട- ങ്ങടവിയൊക്കയും
മുറിപ്പാമ്പ് കടിക്കും- 2210 മുറിപ്പാട്ടുകൊണ്ടങ്ങു ചെന്നാൽ മുഴുവൻ പാട്ടുകേൾക്കാം
125 ആദ്യം ചതുർഥമന്ത്യം ച സപ്തമം ദശമം ഗുരു ലഘു ശേഷം ധ്രുവാപാദേ ചതുർവിംശതികേ ഭവേത്
കുതിച്ചിതേ. കട്ടി-ശ്ലോ 10 ചുവടോടു കൂടെയിളകിത്തരുക്കള- ങ്ങവനോടുകൂടെ നടകൊണ്ടു
ഗ്രഹങ്ങളിലേക്കുള്ള അകലം എപ്പോഴും വ്യത്യാസപ്പെട്ടു കൊണ്ടിരിക്കുന്നു. ചിലപ്പോൾ
തമ്പുരാൻ ഏഴാമദ്ധ്യായം ആറാമദ്ധ്യായം ആറാമദ്ധ്യായം എട്ടാമദ്ധ്യായം എട്ടാമദ്ധ്യായം
അ. ന. സ. ഏ. കോടിബാലാർക്കവർണ്ണേ - അ. ന. സ. ഏ. ഭഗവതി - ഈ. സ്ത്രീ. സം പ്ര. ഏ.
വില്ലെടുത്തീടുവാനില്ലവകാശവും വില്ലാളിവീരമുനിവൃത്തിവേണ്ടതും
പാറമേക്കാവിൽനിന്ന് എഴുന്നള്ളിച്ചുവന്നു വടക്കുന്നാഥക്ഷേത്രത്തിലെ കിഴക്കേഗോപുരത്തിൽ
യപ്രദേശത്തിങ്കലാരെയുംസുന്ദരി കാണാതെകാനനമാത്രം വിഷണ്ണയായ് വീണാനിനാദിനികണ്ടാൾ
രൂപീകരിച്ചതായി ദീപിക റിപ്പോർട്ടുചെയ്തു (22 ഓഗസ്റ്റ് 1959 സെപ്തംബറിൽ ഈ സംഘടന
ഉപവിഭാഗങ്ങൾക്കും വ്യത്യസ്ഥ ഇടനാഴികളാണ്‌ കാണപ്പെടാറുള്ളത്‌. അതിനാൽതന്നെ ഇടനാഴികളെ
സ്ത്രീണാമീർഷ്യാകൃതം ഭവതി 13 സ്ത്രീനീചപ്രകൃതിഷ്വേഷ ശോകോ വ്യസനസംഭവഃ
സൃ ഷ്ടിയെന്നു പറയു ന്നതേ ചേരുകയില്ല. സ്ഥാവരങ്ങളെയും മനുഷ്യശരീരത്തെയും
( റാണ പ്രതാപ്‌ മാർഗ്‌ അസ്സസ്‌മെന്റ്‌ ആന്റ്‌ കൺസർവേഷൻ. ഉത്തർപ്രദേശ്‌ 33. എ. സുന്ദര
എന്നു നമ്മൾ പൊതുവെ പറയുന്നുണ്ടെങ്കിലും കേരളത്തിന്റെ പലഭാഗത്തും പല രീതിയിലുള്ള
വിക്കിയിലാക്കാൻ ബാക്കി നിൽക്കുന്നത് ഇവയാണ്. ശ്രീബുദ്ധചരിതം 0% 4% 6% 0% 5%8 0% 4%
മന്ത്രഗുപ്തിയും സിദ്ധിക്കും. അങ്ങനെയല്ലെന്നാണു കൌടില്യമതം. അപ്രകാരം ചെയ്താൽ
സ്പെക്ട്രത്തിലെ വയലറ്റുവർണ്ണം മുതല്ക്കാണത് ആരംഭിക്കുന്നത്. വയലറ്റിനെ
വിഹരൻബ്രഹ്മവിദ്വരിഷ്ഠോ ഭവതി. തത്രൈതേ ശ്ലോകാ ഭവന്തി. ജ്ഞാനഭൂമിഃ ശുഭേച്ഛാ
പ്രപഞ്ചത്തെ പലതത്വങ്ങളായി വിഭജിച്ചു വച്ചിരിക്കുന്നു. മനുഷ്യന്റെ ആത്മാവ് (പുരുഷൻ)
ഗംഗയും താനേചെന്നു സാദരം സമുദ്രത്തെ സ്സംഗിച്ചു സേവിച്ചീടുന്നില്ലയോ കാകേശ്വരാ!
തെറ്റുതിരുത്തൽ വായന കഴിഞ്ഞവ */ താൾ:വൃത്താന്തപത്രപ്രവർത്തനം. 35 തെറ്റുതിരുത്തൽ
നിമിഷത്തേക്ക് 5 നിമിഷത്തേക്ക് നാൾവഴി ശരിയാക്കാൻ വേണ്ടി അരമണിക്കൂർ നാൾവഴി
പരിചിതമായിക്കഴിഞ്ഞിരുന്നു. വൈക്കം സത്യാഗ്രഹത്തിൽ പങ്കെടുത്ത ചുരുക്കം
ഉപരോധങ്ങളും ഭവനഭേദനസാഹസങ്ങളും രാജ്യവിസ്തൃതിയെ വർദ്ധിപ്പിച്ച സമരങ്ങൾ കേവലം
പല്ലവി ആരെന്നു നീ പറഞ്ഞീടേണമെന്നോടു പോരിനായ്‌ വന്നതും ചാരുകളേബര ചരണം മാരനോ
വിണ്ടലരായുള്ള രാക്ഷസർ ചൊല്ലിയും ഗാന്ധർവ്വമസ്ത്രമയച്ചതുകണ്ടതിൽ സാന്ദ്രമായുള്ള
നടന്നിട്ടില്ലാത്തവ */ താൾ:അമൃതവീചി. 13 ബിപിൻ തെറ്റുതിരുത്തൽ വായന
ശേതേ ലോകേ നാശം ഉപാഗതേ 85 തപസാ ചിന്തയംശ് ചാപി തം ശിശും നോപലക്ഷയേ ഭൂതം ഭവ്യം
ചാന്യോ സ്മി ബ്രഹ്മൈവാഹം ന ശോകഭാക് സച്ചിദാനന്ദരൂപോ ഹം നിത്യമുക്തസ്വഭാവവാൻ 7
ലഭ്യമാകുന്ന വിധത്തിൽ ഡിജിറ്റൈസ് ചെയ്ത് എത്തിക്കുക എന്നതാണ് ഇതിന്റെ ലക്ഷ്യം.
കർഷകവത്ഫലമനുഭവതി. കർമമർമജ്ഞാതാ കർമ കരോതി. കർമമർമ ജ്ഞാത്വാ കർമ കുര്യാത്. കോ
എന്നാക്കി മാറ്റിയിരിക്കുന്നു അനുമതി വർഗ്ഗം:കേരള സാഹിത്യ അക്കാദമി ഡിജിറ്റൽ ശേഖരം
10 1867. 11 1867. 12 1867. 13 1867. 14 1867. 15 1867. 16 1867. 17 1867. 18 1867.
ഒത്തുചേർത്തണമെന്ന് ആഗ്രഹിക്കുന്നു. ഏപ്രിൽ 5 ആണ് വേദി അനുവദിച്ച്
'ഏകമേവാദ്വിതീയം ബ്രഹ്മ' എന്ന രണ്ടാം വാക്യം വ്യക്തമാക്കുന്നത്. ഏകമേവാദ്വിതീയം
കാര്യോത്താദകശക്തിയുംകൂടി അടങ്ങിയിട്ടുണ്ടെന്ന് ഊഹിക്കാമല്ലോ. ഇങ്ങനെ
കൊച്ചുണ്ണിത്തമ്പുരാന്റെ ബാണയുദ്ധം എന്നീ ചമ്പുക്കളും ഈ അവസരത്തിൽ
വിക്കിഗ്രന്ഥശാലാ സമൂഹം നിരവധി സർക്കാർ സ്ഥാപനങ്ങളോടും സന്നദ്ധ സംഘടനകളോടും ഒപ്പം
അധ്യായം160 അധ്യായം162 അധ്യായം162 മഹാഭാരതം മൂലം/ആദിപർവം/അധ്യായം162 വ്യാസൻ അധ്യായം
കോമൺസ് തുറക്കുക. അവിടെ : ചിത്രങ്ങൾ ഉൾപ്പെടുത്താൻ വേണ്ട നിർദ്ദേശങ്ങൾ
യോധാസ് ത്വരിതാഃ പര്യവാരയൻ 28 അഭിസൃത്യ പരീപ്സാർഥം തതസ് തേ ധൃതവർമണഃ പരിവവ്രുർ
താനേയനുജനോടിങ്ങിനെചൊല്ലിനാൻ കാൺകെടോ! ലക്ഷ്മണ! പൊന്മയമായോരു സാരമാമീമൃഗം സർവ്വ
സത്യവസുസഞ്ജ്ഞകാന്വിശ്വാന്ദേവാന്ദേവശ്രാദ്ധേ ബ്രഹ്മവിഷ്ണുമഹേശ്വരാനൃഷിശ്രാദ്ധേ
സുരംഗാഖനകാദീനാം സന്ധികാരാശ്വരക്ഷതാം വ്യസനേ നായകാനാം ചാപ്യാത്മരക്ഷാസു മാഗധീ 56 ന
തിരുത്തൽപെട്ടിയിൽ എത്തിച്ചേരാം. കൂടുതൽ മനസ്സിലാക്കാനായി സഹായം:എഡിറ്റിംഗ്‌