മദ്രരാജസ്യ പൗരുഷം യദ് ഏനം സഹിതാഃ പാർഥാ നാഭ്യവർതന്ത സംയുഗേ 28 അഥാന്യം രഥം ആസ്ഥായ
മുഖ്യതരം വനങ്ങളായി തിരിക്കാം. 0 മുതൽ 850 മീറ്റർ വരെ ഉയരത്തിലുള്ളവയും 650 മുതൽ
രാമരാജാബഹദൂർ തിരിച്ചുവിടുക രാമരാജാബഹദൂർ താൾ: 13 ക്രിസ്തുമതനിരൂപണം/കൃത്യനിമിത്തം
താൾ:ജ്യോതിഷവും ജ്യോതിശ്ശാസ്ത്രവും. 130 24മണിക്കൂർ ഖഗോള മധ്യരേഖയിൽ നിന്ന് ഒരു
ദ്വാരകാമാപ പാർത്ഥഃ മൈത്ര്യാ തത്രോഷിതോ സൗ നവമസുതമൃതൗ വിപ്രവര്യപ്രരോദം ശ്രുത്വാ
കുലടാസ്മി ദൈത്യാ ഇത്യാലപന്നപി സുവിശ്വസിതാനതാനീഃ 29.4 മോദാത്സുധാകലശമേഷു ദദത്സു സാ
ഏകവസനം നഗ്നം ഉന്മത്തം ഗതചേതസം അനുവ്രജന്തീ ബഹുലാ ന സ്വപാമി നിശാഃ സദാ 32 തതോ
അനുമതി 2.5- വർഗ്ഗം: കുലസ്ത്രീയും ചന്തപ്പെണ്ണും ഉണ്ടായതെങ്ങനെ? അനുമതി 2.5-
പകൽ എടയുള്ള സമയം എല്ലാം രാമൻമേനോന്റെയും ശങ്കരനെയും ദുഷിക്കുകയാണ് ഇവന്റെ
ഉപയോക്താവ്: അർജുൻ പൂർത്തിയായി 2 മുഹ്‌യുദീൻ മാല റിയാദ് പുരോഗമിക്കുന്നു 3
ഉത്സവങ്ങളോ മറ്റു വലിയ കാഴ്ചകളോ ഉള്ള ഇടങ്ങളിലെല്ലാം ഈ നമ്പൂതിരിയെ കാണാതെ
405) 52) ഇബ്നു അബ്ബാസ്(റ) നിവേദനം: രാത്രിയിൽ ഖബറടക്കപ്പെട്ട ഒരു ഖബറിന്റെ
ത്വാ വയം സാമ്രാ33333 ഹു3ം ആ33 ജ്യാ3യോ3ആ 32111 ഇതി 2. 24. 13 അഥ ജുഹോതി നമ
കലാതാലലയാന്വിതഃ കർതവ്യഃ പൂർവരംഗസ്തു ത്ര്യശ്രോ പ്യുത്ഥാപനാദികഃ 140 ആദ്യം ചതുർഥം
വ്യാകരണകർത്താക്കന്മാർക്കു തീരെ വിട്ടുകൊടുക്കുന്നതുകൊണ്ടു ചിലപ്പോൾ ഭാഷയുടെ ഗതിക്കു
പ്രവരവപുസ്സൊടുമുല്ലസിച്ചു വാണാർ 67 ഒരു മകനരളവായ്വരേണമെന്നാ- നരപതിയാം
1917. തെറ്റുതിരുത്തൽ വായന നടന്നിട്ടില്ലാത്തവ */ ' താൾ 16057 1917 താൾ: 1927. 19
ആദരിച്ചുകൊണ്ട് പരസ്പരം സ്നേഹിക്കുന്നവർക്ക് നാളെ പ്രകാശത്താലുള്ള
സംബന്ധിച്ച്‌ കർക്കശമായ യാതൊരു നിയന്ത്രണവുമുണ്ടാകില്ലെന്ന്‌ അവർക്ക്‌
പരിഭ്രമത്തോടേ അറിഞ്ഞതില്ലഞാൻ തവശോകമൂലം പറഞ്ഞാലും കോപമിയന്നതെന്തയ്യോ കളകളഖേദം
വർഗ്ഗം:ഐതിഹ്യമാല ഐതിഹ്യമാല/പൂന്താനത്തു നമ്പൂരി കൊട്ടാരത്തിൽ_ശങ്കുണ്ണി പൂന്താനത്തു
ജംഘനാഡി അമർത്തേണ്ടും വിധം:_ ജാനുനാഡി മുട്ടി ന്റെ താഴെ അതിന്റെ പിൻഭാഗത്തു കൂടെ
സംന്യസ്യ ജാതരൂപധരോ ഭവതി സ ജ്ഞാനവൈരാഗ്യസംന്യാസീ. ബ്രഹ്മചര്യം സമാപ്യ ഗൃഹീ ഭൂത്വാ
താൾ: 1903. 67 താൾ: 1919. 13 താൾ: 1903. 68 ശ്രീ ലളിതാസഹസ്രനാമം" / ശ്രീ
നൂറ്റാണ്ടിൽ തിമൂർ ലെങു് (അഥവാ ടാമർലെയ്ൻ) എന്ന മംഗോളിയൻ ചക്രവർത്തിയുടെ കീഴിൽ അവിടം
ണാംശതത്ത്വവാചകവാച്യസ്ഥാനഭേദവിഷയദേവതാകോശ- ഭേദവിഭാഗാ ഭവന്തി.
72. 748) 10) അബൂഹുറൈറ(റ) നിവേദനം: നബി(സ)സ്വർണ്ണത്തിന്റെ മോതിരം
എന്നു മാത്രമെ ശങ്കിക്കേണ്ടതുളളൂ. ലൌകിങ്ങളായ വ്യംഗ്യങ്ങളെ വ്യാഖ്യാതാക്കന്മാർ
ഫ്രഞ്ച് തത്വചിന്തകനായ യുടെ എന്ന കൃതിയിൽനിന്നാണ് പലരും തുടങ്ങുക. ചരിത്രരചനയുടെ
ഗദ്യകൃതികളുണ്ടായിരുന്നതിൽ വിവരമില്ലാത്ത എഴുത്തുകാർ ഇച്ഛപോലെ ഭംഗിനോക്കി രണ്ടു
പണ്ടുപണ്ടേ മമ ബന്ധുവാകും ഭവാൻ കണ്ടുബോധിക്കുമി മൂഷികന്റെ ഗുണം. എന്നതുകേട്ടു
മാറ്റിയിരിക്കുന്നു 4,500,000+ ഫലകം: ഫലകം: വിവരണം" / എന്ന ഉപയോക്താവ് ഫലകം: എന്ന
രചയിതാവ്:ഫ്രെഡറിൿ ഏങ്ഗൽസ് രചയിതാവ്:ഫ്രെഡറിക്ക് എംഗൽസ്" / രചയിതാവ്:ഫ്രെഡറിക്ക്
വായിച്ചാലും തീരാത്ത പുസ്തകം/വായിച്ചാലും വായിച്ചാലും തീരാത് 2 വായിച്ചാലും
പ്രഹരമാണ് ഏൽപ്പിച്ചത്. 5000 രൂപയ്ക്കപ്പുറം കുടുംബസ്വത്തിൽ സ്ത്രീക്ക്
നേർന്നതു സൗഖ്യംവന്നാൽ മറക്കും- 2496 സത്യത്തിനു കാലുനാലുണ്ട്- 2497 സത്യത്തിനെന്നും
പ്രവൃത്തിരേവ ന ജായതേ. തത്സ്വരൂപജ്ഞാനാഭാവാത്. തത്കിമിതി ന വിദ്യതേ. കഥം ബന്ധഃ
അങ്ങനെയെങ്കിൽ ഈ താളിൻറെ പേര് കുമാരനാശാൻ എന്ന് നല്കുന്നതല്ലേ ഉചിതം. ഉപയോക്താവ്:
ഉപനിഷത്തു് (4ാം പ്രപാഠം, സംവർഗ്ഗവിദ്യ, ജാനശ്രുത്യൗപാഖ്യാനം) 1. തദുഹ ജാനശ്രുതിഃ
ഒഴുകിക്കൊണ്ടിരുന്നു. എല്ലാ ഭാഗങ്ങളിൽ നിന്നു വന്നവരുംമഴയുടെ സമൃദ്ധിയെക്കുറിച്ച്‌
(അബൂദാവൂദ്) 75) അംറ്ഇബ്നു ഷുഅയ്ബു(റ) തന്റെ പിതാമഹനെ പ്രമാണമാക്കി നിവേദനം ചെയ്തു:
ആന്തരിക തലത്തിലുള്ളത് അധികപക്ഷവും ഇരുമ്പായിരിക്കാനാണു സാധ്യത. അവിടെ
'സൗന്ദര്യ'ത്തിന്റെ പേരിൽ പട്ടിണികിടക്കുകയും ശരീരത്തിൽ പച്ചകുത്താൻവേണ്ടി
ചാന്ദ്രമാസങ്ങളും 1830 സൗരദിനങ്ങളും 1635 നാക്ഷത്ര ദിനങ്ങളും (23മ. 56മി വീതം) 135
മുത്തുമണിപോലെ മനോഹരവും ആകുന്നു. സംസ്ക്കൃതഭാഷയിൽ ശബ്ദങ്ങൾ അന്യാദൃശമായ വൈചിത്ര്യവും
മാറിക്കൊള്ളണമെന്നില്ലെന്ന് താൾ: 25 തെറ്റുതിരുത്തൽ വായന കഴിഞ്ഞവ */ താൾ: 26
സത്ത് ആണു താൻ എന്നും, അതു ശരീരമോ, മനസ്സോ അല്ലെന്നും അവയ്‌കെല്ലാറ്റിനും
വിവാഹംചെയ്യും. മരിക്കുമുന്പ് നിലത്ത് എറക്കി കിടത്തും. തടിക്ക് തീ കൊളുത്തേണ്ടത്
നടേപറഞ്ഞപ്രകാരം നുമാഗമവും മിത്സ്യാദന്ത്യസ്വരാദൂ ർദ്ധ്വം എന്നു പറഞ്ഞിരിക്കയാൽ അതു
താൾ:ശ്രീമൂലരാജവിജയം. 10 സാധൂകരിച്ചവ */ താൾ:ജ്യോതിഷവും ജ്യോതിശ്ശാസ്ത്രവും.
ആ മുക്തി എന്നു കൂടിയെങ്കിലും അഴിയുമെന്നല്ലാതെ നിത്യയാകയില്ലാ. ഇങ്ങനെ
നിന്നെ മതി ഞാൻ പാലിപ്പൻ പുറപ്പെടുകനി ഝടിതിഭൂഷണം കൊടുത്തു ബ്രാഹ്മണർക്കതിമുദിതയായ്
കേടുമുഴുത്തുപോയീടും അവണ്ണം ദേഹവും ജരാനരകൊണ്ടു പഴകുമ്പോൾ വീണു പഴുത്തുപോയീടും-
കരപാരിജാതകം കണികണ്ടവർക്കു കനിവുള്ള കല്പക- ത്തണലിന്നു നട്ട തരുവൃന്ദമല്ലയോ? ശ്ലോ 59
ബ്രുവാണസ്തിരോദധാ ബർഹിഷി വിശ്വമൂർത്തേ 20.3 നാഭിപ്രിയായാമഥ മേരുദേവ്യാം ത്വമംശതോ
മൂത്തനായരെ അനുഗ്രഹിച്ചിട്ട് ആഭരണങ്ങളും കൊണ്ട് മഠത്തിലേക്ക് പോയി. ആ പൊതി
ഇനമാണിത്‌. 3. വികസന പദ്ധതികൾ പഞ്ചഗണി, മഹാബലേശ്വർ, ടൗൺഷിപ്പ്‌ അടക്കമുള്ള വികസന
ത്വത്കൃതം തദ്വിദന്തസ്ത്വാമാലിംഗൻ ദൃഷ്ടനാനാപ്രഭാവാഃ 54.8 ഗാവശ്ചൈവം ലബ്ധജീവാഃ
സന്ന മൃദോ വിഭിദ്യതേ 683 അന്തർബഹിശ്ചാപി മൃദേവ ദൃശ്യതേ മൃദോ ന ഭിന്നം കലശാദി കിഞ്ചന
പ്രത്യയത്തിലുള്ള ഇകാരത്തിനു ലോപം വന്ന് അഭ്+അവ്+ഇ+ഷ്യ+ത്=അഭവിഷ്യത് എന്നും രൂപം
പൊട്ടിത്തെറിച്ചുപോം സംശയമില്ലതി- ലൊട്ടും മനസിജ സുന്ദര! കേട്ടിതോ വറ്റുകാണാതവൾ
പോയി ശകുന പരീക്ഷ ചെയ്യും. അല്ലെങ്കിൽ ഒരു അ വർഗ്ഗം:താളുകൾ - 1915 താൾ: 1915. 258
വാസനാമാത്രശേഷമായത്, അന്യഃ = മറ്റേ അസംപ്രജ്ഞാത സമാധി) ആകുന്നു. ഇതാണു പൂർണ്ണമായ
ഉല്ലേഖിക്കുക മുതലായതിൽ യുക്തികൾക്കു് എത്രതന്നെ പ്രാബല്യമിരുന്നാലും