തോന്നുന്നില്ല. ശരിയായി പുല്ലും മുതിരയും മറ്റും കൊടുത്താൽ ഇവ ഇങ്ങനെ
അല്പതകാട്ടിയപരാധമെന്തിനു നല്പ്രഭുരാമനിൽച്ചെയ്യുന്നതിങ്ങിനേ? ചണ്ഡിയാം ശൂർപ്പണഖ
ഭാവ്യം ഹി നൂനം കാര്യേണ തത്ത്വതഃ യഥാ ഹ്യ് അസ്യേദൃശീ നിഷ്ഠാ കൃതേ കാര്യേ ഽപി ദുഷ്കരേ
സ്വവീര്യേണാനല ദ്യുതിഃ സമന്തപഞ്ചകേ പഞ്ച ചകാര രുധിരഹ്രദാൻ 5 സ തേഷു രുധിരാംഭഃസു
ദ്രാവിഡവൃത്തങ്ങളും ദശാപരിണാമങ്ങളും ആകെ താളുകൾ: 173 ഈ ഭാഗം: താളുകൾ 1 മുതൽ 173 വരെ)
ജ്യാമിതിരൂപങ്ങൾ, വ്യാപ്തം, നിഴൽഘടികാരം, വിവിധതരം ഗണിതശ്രേണികൾ ( പലിശ, ഗണിത
വിഭോ സിദ്ധയോഗീ പ്രബുദ്ധഃ 91.10 ദുഃഖാന്യാലോക്യ ജന്തുഷ്വലമുദിതവിവേകോ ഹമാചാര്യവര്യാ-
നടന്നിട്ടില്ലാത്തവ */ 'തകാമണീയോടു ചോദിച്ചപ്പോൾ അന്യായമാക്കി തടവിൽ താൾ 24004 താൾ:
മറ്റുചിലപ്പോൾ ഒരു വിമർശകനും, ചില സന്ദർഭങ്ങളിൽ ഒരു ശാസ്ത്രജ്ഞനുമാകാൻ വെമ്പലോടെ
2013 ( ഒരു ചെറിയ തിരുത്ത്, ഇന്ദുലേഖയല്ല കുന്ദലതയാണ് ചേർത്ത പുസ്തകം. ചർച്ചകൾ
പുനരുജ്ജീവനശേഷി വളരെ കുറവുള്ള സ്ഥലങ്ങൾ 9) കാവുകൾ 10) സീമാവനങ്ങൾ ഭൗമസ്വഭാവ
ത്തീരുന്നു. ഞാൻ അതറിയുന്നു, കാണുന്നു, സ്പർശിക്കുന്നു. എനിക്ക് അതിനെ എളുപ്പത്തിൽ
06:18:05 തെറ്റുതിരുത്തൽ വായന കഴിഞ്ഞവ */ താൾ: 1896. 31 താൾ: 1868. 393
സംസ്കൃതനാമരൂപങ്ങൾ ദീർഘാന്തങ്ങൾ ഹ്റസ്വവും ആകാം' എന്നു് പട്ടികയിൽ
നടന്നിട്ടില്ലാത്തവ*/ താൾ:വടക്കൻ പാട്ടുകൾ. തെറ്റുതിരുത്തൽ വായന
നിനക്കു നൾകാൻ തന്നാണു രാമാദികൾ വന്നതിപ്പോൾ. 45 തരം പിഴച്ചാലതു കണ്ടു മിണ്ടാ-
ലൈസൻസിൽ ആക്കിയതിനു ശേഷം വികിബുക്സിൽ കയറ്റുന്നതായിരിക്കും നല്ലത്.
വെയ്ക്കുവാനും വേണ്ടി ഞാൻ വാങ്ങിയതാണിത്. നബി(സ)അരുളി: തീർച്ചയായും ഈ ചിത്രങ്ങൾ
ഭാഷാപോഷണത്തിന് മാതൃകാപരമായ ഒരു ആനുകാലിക പ്രസിദ്ധീകരണം ആവശ്യമാണെന്നു കണ്ട്
തിരുവാഭരണവും കിട്ടി. മറവർ പ്രദക്ഷിണം വെച്ച വൃക്ഷത്തിന്റെ ചുവട്ടിൽ
(ബുഖാരി. 1. 12764) സാബിത്(റ) നിവേദനം: അനസ്(റ) ഞങ്ങൾക്ക് നബി(സ)യുടെ നമസ്കാരം
ചേർക്കുന്നത് നന്നായിരിക്കും.നിങ്ങളുടെ വോട്ടും അഭിപ്രായവും രേഖപ്പെടുത്തുക.
1916. 96 തെറ്റുതിരുത്തൽ വായന കഴിഞ്ഞവ */ 2014 താൾ: 1871. 31 2014 താൾ: 1916. 81
പ്രയോജനകരമായിരിക്കും. മാത്രവുമല്ല ഉന്നതതല സമിതിക്ക്‌ പരിസ്ഥിതി വനം
സൃഷ്ടിച്ചിരിക്കുന്നു 40 3; 64 43 1.25 000;! 1000000) 0 /100 0) - 1000000) 0
വിക്കിഗ്രന്ഥശാലയുടെ ആദ്യത്തെ സി.ഡി. പതിപ്പു് പുറത്തിറക്കുന്നതിൽ സഹകരിച്ച
ദിശശ്ചതസ്ര ഉപദിശഃ സംസ്ഥാ അയമർവാഗഗ്നിഃ പരത ഏതൗ പ്രാണാദിത്യാവേതാവുപാസീതോമിത്യക്ഷരേണ
സമ്പ്രീതിമക്ഷ്ണോർവദനപ്രസാദ- മാനന്ദമന്തഃകരണസ്യ സദ്യഃ വിലോകനം ബ്രഹ്മവിദസ്തനോതി
ഉപയോക്താവിന്റെ സംവാദം: സംവാദം 18:54, 3 ജനുവരി 2013 ( ഇത് [ 1989/02/1. ബോധധാര
വടിയുമായിത്തലക്കെട്ടു മായി നടന്നുപോകുന്ന ജനസംഘത്താലും സമ്പൂർണ്ണങ്ങളായിരിക്കുന്നു.
മെക്കാളിയുടെ വാചകരീതിയിൽ വളരെ ഭ്രമം ഉണ്ടായിരുന്നു. അതിനാൽ ആദ്യകാലങ്ങളിൽ തന്നാൽ
പ്രദേശത്ത്‌ എന്ത്‌ സംഭവിക്കുന്നു അതിലേതാണാ അഭികാമ്യം എന്നതിനെ സംബന്ധിച്ച
രാമകിശോരനെ ഒരുമിച്ചുകൊണ്ടുനടക്കും. പല സംഗതികളെക്കുറിച്ചും സംസാരിക്കുമ്പോൾ
അപഗ്രഥനത്തിന്റെ പിൻബലത്തിലും പരിസ്ഥിതി ക്ലിയറൻസിനുമുളള വ്യവസ്ഥകൾ കാറ്റിൽ
അധികാരമില്ലായ്‌മയും മൂലം കടുത്ത പ്രതിസന്ധിയിലായി. മഹാബലേശ്വർ ഉന്നതതല സമിതിയുമായും
തിരിയെവന്നാലി- ദ്ധരണിയെയുടൻ കൊടുക്കയും ചെയ്തു പുരമയോദ്ധ്യയിലഭിഷേകം ചെയ്ത-
1927 2014 2014 വർഗ്ഗം: 2014 009 സൂചിക: 1931. 2014 ഭാരതീവിലാസം പി. കൃഷ്ണൻ
വന്ദനമകൃത്വാ ന നമസ്കാരോ ന സ്വാഹാകാരോ ന സ്വധാകാരോ ന നിന്ദാസ്തുതിര്യാദൃച്ഛികോ
തൊഴിലാളികളുടെ സമ്രമാണ്. തൊഴിലാളികൾ സമരം ചെയ്തു എന്ന കാര്യത്തിന്റെ കാരണമെന്താണ്?
പ്രമാണപ്പെടുത്തുകകൊണ്ട് പ്രപഞ്ചത്തിന്നന്യമായും, സാക്ഷിയാൽ മാത്രം പ്രകാശിക്കയാൽ
ദിഗ്വാതാർകപ്രചേതോഽശ്വിവഹ്നീന്ദ്രോപേന്ദ്രമൃത്യുകാഃ. ചന്ദ്രോ വിഷ്ണുശ്ചതുർവക്ത്രഃ
മൈക്കണ്ണിയോർക്കുന്നുവോ? - ഉത്തരരാമചരിതം എന്നുള്ള ചിന്താമൂലകസ്മൃതിയും മറ്റും
ഐതിഹ്യമാല/ഉത്രം തിരുനാൾ തിരുമനസ്സുകൊണ്ടും കഥകളിയോഗവും കൊട്ടാരത്തിൽ_ശങ്കുണ്ണി
തത്പ്രാപ്തൗ സർവത്ര ചേതഃ സ്ഥാപനം. മിതാഹാരോ നാമ ചതുർഥാംശാവശേഷകസുസ്നിഗ്ധമധുരാഹാരഃ.
ചൊല്ലിനാൻ രഘുപ്രവീരനോടിതിങ്ങിനെതദാ രമണീയഗുണധരണിജാതന്നെ
2014 താൾ: 1927. 17 താൾ: 1911. 109 2014 താൾ: 1927. 18 താൾ: 3 1910. 87
നിദ്രാധീനന്മാരാകയും ഇടയ്ക്കിടെ ചേങ്ങലദണ്ഡത്താൽ പ്രോത്സാഹിക്കപ്പെടുമ്പോൾ
വികസിതം ഹൃത്പദ്മം തത്ര സംസ്ഥിതം 15 ദിവ്യധ്വജാതപത്രൈസ്തു ചിഹ്നിതം ചരണദ്വയം.
എഴുത്തിനെ പേരിട്ടുവിളിക്കാൻ വിമർശകർക്കുണ്ടായിരുന്ന അധികാരമാണ്
ശരീരശാസ്ത്രജ്ഞൻ തൻറെ ജ്ഞാനത്തെ അതിൻറെ പൂർണ്ണതയിലേക്കു നയിക്കുമ്പോൾ അത്
കൊണ്ടുവരണം എന്നു കല്പിക്കുകയും അഴകപ്പാപിള്ള കേശവനെ ഉടനെ കരമനയാറ്റിൽ കൊണ്ടുപോയി
ദൂരദർശിനി യും, ഭൂതക്കണ്ണാടിയുംകൊണ്ട് നമ്മുടെ ദർശനവ്യാപ്തിയെ നമുക്കു
ചിത്തിരനാളിലാണ്. വിചാരിച്ചിരിക്കാതെ പെട്ടന്നുണ്ടായ ഈ കഷ്ടസംഭവം നിമിത്തം അപ്പോൾ
നൂനം. മറി. വാർഷ ണേ യനും ഋതു പർണ്ണനും പ്രവേ ശി ക്കുന്നു ഋതു പർണ്ണ നോട്‌: പ്രക ടി
ഒത്തുചേർന്നിരുന്നു. മദ്ധ്യതിരുവിതാംകൂറിൽ ഓണക്കാലത്ത് അരങ്ങേറിയിരുന്ന
പക്ഷെ, അനാചാരാദികളുടെ ഉന്മൂലനം ഭാവികാലത്തെ സംഭവങ്ങളായി സംഭാവനം
വിവാഹമാണ് അവളെ സംബന്ധിച്ചിടത്തോളം ജീവിതവിജയത്തിലേക്കുള്ള മാർഗ്ഗമെന്ന സന്ദേശം
കഴിഞ്ഞവ */ താൾ: 1927. മനസ്സുകൊണ്ടും,അവിടത്തെ അനുജനും മിടുക്കൻ തമ്പുരാനെന്നു
1935. 352 തെറ്റുതിരുത്തൽ വായന നടന്നിട്ടില്ലാത്തവ */ ' ൩൪൧ എഴുപത്തിമൂന്നാം പ്രകരണം
വല്ലവനും അനുസരിച്ചാൽ അവൻ അല്ലാഹുവിനെ അനുസരിച്ചു. മുഹമ്മദിന്റെ കൽപന ലംഘിച്ചു.
ആകെ വിസ്‌തീർണ്ണത്തിന്റെ 25%ത്തോളം ആയിരിക്കണം. പശ്ചിമഘട്ടത്തിലെ സംരക്ഷിത
മഹാമനാഃ 4 അഥൈനം ഭാർഗവോ രാജന്ന് ഉവാച പരിസാന്ത്വയൻ യാജയിഷ്യാമി രാജംസ് ത്വാം സംഭാരാൻ
ഞങ്ങളും ഗുരുജനം പറഞ്ഞതുമറിഞ്ഞാലും സകലരും കൂടിയനുഗമിയ്ക്കുന്നു
സ്വപ്നാനപേക്ഷാപി ച തത്സുഷുപ്തം ഇത്യാത്മ സദ്ഭാവ ഉദീര്യതേ ത്ര ശ്രുത്യാപി