ചിന്താപ്രശ്നമായിത്തീരും. ധനത്തിന്റെ ഉടമസ്ഥൻ അന്നു മറ്റുള്ളവരുടെ മുന്നിൽ ധനം
ലബ്ധമാകുന്നില്ല. ലോകം തിമിരനിബിഡവും ജീവിതം അസിധാരാതരണവും അനുഭവം തിക്തരസഭൂയിഷ്ഠവും
127.0.0.1 ഫലകം: ഫലകം: എന്നതിൽ നിന്ന് 51 പതിപ്പുകൾ 1 1[ 127.0.0.1 1 1 127.0.0.1
കഴിഞ്ഞവ */ താൾ:പ്രപഞ്ചവും മനുഷ്യനും. 162 താൾ:പ്രപഞ്ചവും മനുഷ്യനും. 163
തിരിച്ചറിവാൻ പ്രയാസമില്ല. പക്ഷെ മിക്ക അവസരങ്ങളിലും നമുക്കു് ഈ സ്ഥിതിയിൽ
അബ്ദുർറഹ്മാൻ കടന്നുവന്നു. ഞാൻ നബി(സ)യെ താങ്ങിയിരിക്കുകയായിരുന്നു. നബി(സ) അബ്ദുർ
പുറപ്പെട്ടിരുന്നത്.അവൻ വലിയ ധനവാനും അന്തസുകാരനുമായിരുന്നു.തന്റെ നേർക്കു
ശിലാമണ്ഡപവുമായിരിക്കും, ഇതുകൾ കാണുന്ന സമയ വും ഇവിടെ മുഖ്യമായ കാഴ്ച ഇതുകൾ
പക്ഷെ തനിക്കു ഒരു സൂക്ഷ്മശരീരമുണ്ടെന്നു അയാൾക്കു വിചാരിക്കേണ്ടി വരും. ഈ അവസ്ഥയിൽ
യഥാഭാവം യഥാരസം 96 അഥവ ദേശകാലൗ ച ന പരീക്ഷ്യൗ പ്രയോക്തൃഭിഃ യഥൈവാജ്ഞാപയേദ്ഭർതാ തദാ
 നമ്മുടെ ഇന്ത്യാസ്റ്റേറ്റ് സെക്രട്ടരിയുടെയും കൌൺസിലിൻ െയും അനുമതിയോടുകൂടി ക്രമേണ
ക്രമേണ ഷണ്മാസം നിത്യോദ്യുക്തഃ സമാചരേത്. ഷണ്മാസാദ്രസനാമൂലം സിരാബദ്ധം പ്രണശ്യതി 31
ഒപ്പിടുന്നത് ഇപ്രകാരമാണ് : വലത്തു നിന്ന് ഇടത്തോട്ടെഴുതുന്ന ലിപികൾ ഉപയോഗിക്കുന്ന
മനുഷ്യനും. 387 തെറ്റുതിരുത്തൽ വായന കഴിഞ്ഞവ */ താൾ: 39 53 തെറ്റുതിരുത്തൽ വായന
വികസിപ്പിക്കാനുള്ള എല്ലാ സാധ്യതകളുമുണ്ട്‌. മനുഷ്യനും വന്യമൃഗങ്ങളും തമ്മിലുള്ള
പാർവതിഅമ്മയുടെ കണ്ണിൽനിന്നു താനെ വെള്ളം പുറപ്പെട്ടു. ഉൽകൃഷ്ടകുലത്തിൽ ജ നിച്ച എരു
അപഖ്യാതി അപഗതം ഗം) അഭയാകുലം 5. പഗത അപഗമിക്ക അപചയം അപചിതം അപചാരം അപചിക്കുരു പച്)
മൂലം/അശ്വമേധികപർവം/അധ്യായം14 വ്യാസൻ അധ്യായം14 അധ്യായം13 അധ്യായം13 അധ്യായം15
അദ്ദേഹത്തെ തേൻ കുടിപ്പിക്കുകയെന്ന് നബി(സ) അരുളി: വീണ്ടും അയാൾ വന്നുപറഞ്ഞു;
ഗ്രന്ഥത്തിൽ ( ഉപയോഗിച്ചിട്ടുള്ളവ തന്നെയാണ് (പൗലീശ സിദ്ധാന്തം എന്ന് വരാഹൻ
1892. 1892. 10 1892. 11 1892. 12 1892. 13 1892. 14 1892. 15 1892. 16 1892. 17
ലഭിക്കാനില്ല. (ബുഖാരി. 2. 24. 548) 49) അബൂഹുറൈറ(റ) പറയുന്നു. നബി(സ) അരുളി: എന്റെ
താൾ:പ്രപഞ്ചവും മനുഷ്യനും. 313 തെറ്റുതിരുത്തൽ വായന കഴിഞ്ഞവ */ താൾ:പ്രപഞ്ചവും
ബ്രഹ്മ സമശ്നുതേ 14 യഥാ സർവേ പ്രഭിദ്യന്തേ ഹൃദയസ്യേഹ ഗ്രന്ഥയഃ. അഥ മർത്യോഽമൃതോ
തെറ്റുതിരുത്തൽ വായന നടന്നിട്ടില്ലാത്തവ*/ പ്രമാണം:ആദ്യകാല ടെലെസ്കോപ്.
വൃദ്ധന്മാരെയപേക്ഷിച്ച് വളരെയധികമാണെന്നും ഇദ്ദേഹം അവകാശപ്പെടുന്നു. ( 2007
അവിടെതന്നെ താമസിക്കുകയും ചെയ്തു. ബ്രാഹ്മണന് അഭ്യംഗത്തിനും അത്താഴത്തിനും
വാങ്ങിക്കളയുമെന്ന് അയാൾക്ക് ഒരു ആത്മജ്ഞാനോദയം ഉണ്ടായി. സാവിത്രിയുടെ കർണ്ണങ്ങളിൽ
 നടക്കണം, മുത്താഴമെങ്കിൽ മുള്ളേലും ശയിക്കണം- 75 അ ്യാഗ്രഹാദികൾ ആപദാമാസ്പദം- 76
അന്തരാളൻ അന്തരാളൻ പ്രാചീനമലയാളം 2 പ്രാചീനമലയാളം 2/അന്തരാളൻ വർഗ്ഗം:പ്രാചീനമലയാളം 2
ഹൃത്പുണ്ഡരീകമധ്യസ്ഥം ചൈതന്യജ്യോതിരവ്യയം 155 കദംബഗോലകാകാരം തുര്യാതീതം പരാത്പരം.
ലേഭേ തസ്മിന്ന് ഉന്മജ്ജ്യ ചന്ദ്രമാഃ 78 തതസ് തു ചമസോദ്ഭേദം അച്യുതസ് ത്വ് അഗമദ് ബലീ
രുദ്രാക്ഷം ലോകത്തിലെ അവതാരപുരുഷന്മാരുടെ ഇടയിൽ അങ്ങയുടെ സ്ഥാനത്തെ
ന്യൂ അലിപോർ, കൽക്കട്ട+91 9088039540 7. ആർ.ജെ.രഞ്‌ജിത്‌ ദാനിയേൽസ്‌ ഇക്കോളജിക്കലി
ബ്രഹ്മചര്യമേവ തദ്ബ്രഹ്മചര്യേണ ഹ്യേവ യോ ജ്ഞാതാ തം വിന്ദതേഽഥ യദിഷ്ടമിത്യാചക്ഷതേ
ചെയ്യുന്നതു്? സന്ധ്യാസമയത്തെ അന്തരീക്ഷത്തിന്റെ ആഡംബരത്തെ സംവീക്ഷണം ചെയ്കയാണോ?
മുമുക്ഷുത്വഞ്ച. തേഷു, ഹി സത്സു പ്രാഗപി ധർമ്മ ജിജ്ഞാസായാ ഊർദ്ധ്വഞ്ച ശക്യതേ ബ്രഹ്മ
ആ സ്ഥലം അധികമധികം പുണ്യസ്ഥലമായും തീരുന്നു. സത്വഗുണം അധികമില്ലാത്ത മനുഷ്യൻ അവിടെ
പ്രത്യേകിച്ച് പുതുമുഖങ്ങളെ ഒപ്പിനെ കുറിച്ച് പറഞ്ഞുകൊടുക്കുന്നതു നല്ലതാണ്. സംവാദം
താസാം തു ചൈവ കർതവ്യം പീതവസ്ത്രപരിച്ഛദം പദ്മരാഗമണിപ്രായം ഗന്ധർവീണാം വിഭൂഷണം 61
സഹോദരന്മാരായവർക്ക് ൨ (എഴുതുന്നതു നമ്മുടെ പിതാവായ ദൈവത്തിൽ നിന്നും(കർത്താ വായ
പറഞ്ഞു: ഞാൻ ചോദിച്ചു. പിന്നീട് ആ തിന്മക്കുശേഷം വല്ല നന്മയുമുണ്ടാകുമോ? അതെ, നബി(സ)
ശ്രീമഹാഭാഗവതം-ചതുർത്ഥസ്കന്ധം ശ്രീമഹാഭാഗവതം/ചതുർത്ഥസ്കന്ധം ചതുർത്ഥസ്കന്ധം
ഒക്കവെജയ്ക്കുന്നൂകേളിയാലഹർന്നിശം നിഷ് ക്ക്യപംകുഴക്കുന്നൂവമ്പന്മാരെയുമിട്ടു
ചെന്നു പുലർന്നുകൊണ്ടീടുക ധീരത്വമുണ്ടെന്നു ഭാവിച്ചിരിയ്ക്കിലോ പോരിൽ തലയാളി രാമൻ
അങ്ങനെ തോന്നുന്ന പ്രപഞ്ചവും ബ്രഹ്മസ്വരൂപമാണെന്ന് 'പ്രപഞ്ചസ്വരൂപം ബ്രഹ്മ' എന്ന
അവ്യക്തമാത്രം ഭവതി സ്വരൂപതഃ സാഭാസമവ്യക്തമിദം സ്വയം ച 688 തദപ്യപഞ്ചീകൃതഭൂതജാതം
മാറ്റിയിരിക്കുന്നു 4,500,000+ ഫലകം: ഫലകം: വിവരണം" / എന്ന ഉപയോക്താവ് ഫലകം: എന്ന
ഉണ്ടായിരിക്കുന്നത്. അങ്ങിനെയെങ്കിൽ, അവയുടെ പോഷണദ്രവ്യങ്ങളും ഈ നാലുധാതുക്കളും
വർഷാണ്യുവാസ താന്യേകശതം സമ്പേദുരേതത്തദ്യദാഹുരേകശതം ഹ വൈ വർഷാണി മഘവാൻപ്രജാപതൗ
കാണുന്നില്ല. 8. അതിശയനീയം: അതിശയിക്കുക എന്ന ക്രിയയ്ക്കു വിസ്മയിക്ക എന്നു
ദധാതു. അയുതാരം ജ്വലന്തമയുതാരസമഷ്ട്യാകരം നിരതിശയവിക്രമവിലാസമനന്ത-
മിതെല്ലോ നമ്മുടെ കുലധർമ്മമെന്ന- ങ്ങറിഞ്ഞുനന്നായി നടന്നുകൊള്ളുക പറഞ്ഞതൊന്നുമേ
ഭൂരിശ്രവാ ബലീ ത്വയാ നിസൃഷ്ടേന ഹതഃ ശൈനേയേന ദുരാത്മനാ 35 കുർവാണശ് ചോത്തമം കർമ കർണഃ
ഉണ്ടായിത്തീർന്നു. അതിന് അവർക്ക് ആജീവനാന്തം സ്വൽപംപോലും വ്യത്യാസം വരികയും
നമ്പൂരി കിളിരൂർകുന്നിന്മേൽ ഭഗവതി കിളിരൂർകുന്നിന്മേൽ ഭഗവതി ആലത്തൂർ നമ്പി ആലത്തൂർ
ചിലരെ കുരുടന്മാരായിട്ടും, ചിലരെ ചെകിടന്മാരായിട്ടും, ചിലരെ മുടന്തന്മാരായിട്ടും,
പരാമർശിക്കുന്ന ഭാഗം - തികച്ചും വ്യക്തമാക്കുന്നുണ്ടു്. റഷ്യയുടേയും,
നിരീക്ഷണത്തിനും പുതിയ ജ്യോതിഷം പ്രചോദനമേകി. ധാരാളം പുതിയ നിരീക്ഷണ ഉപകരണങ്ങൾ
ശാസ്ത്രജ്ഞൻ സൂചിപ്പിക്കുന്ന നാഡീകോശപ്രവർത്തനവുമായി ബന്ധമുണ്ടെങ്കിലും,
സകലേശ്വരം ത്വാം ധ്യാനം ച നിഷ്കളമസൗ പ്രണവേ ഖലൂക്ത്വാ ത്വാമേവ തത്ര സകലം നിജഗാദ
ഇട്ടിരാരിച്ച മേനോന്റെ കൃതികൾ വർഗ്ഗം:കൃതികൾ_രചയിതാവ്_അനുസരിച്ച് താൾ
പറഞ്ഞുസൂതന്മാർ സ്തിതിച്ചുരാജാവെവദിച്ചു മാഗധർ എടുത്തുവേത്രവും നടിച്ചു ഭാവവും
സുതോ ബലാത് 14 തദ് അലം സാധു യുദ്ധേന നിവർതസ്വ ജനാർദന ദ്വാരകാം ഏവ രക്ഷസ്വ കാര്യം ഏതൻ