ശാസ്ത്രവും തമ്മിലുള്ള ബന്ധം, പ്രകൃതിയും മനുഷ്യനും തമ്മിലുള്ള ബന്ധം തുടങ്ങിയ ചില
പറഞ്ഞവ ബോധിച്ചതും ഇല്ല. അവർ യറിഹോവിലേക്ക് അടുക്കുമ്പോൾ, ഒരു കുരുടൻ വഴിയരികെ
ഭൂതസഞ്ചയത്തിൽ പലരുടേയും പല അവയവങ്ങളെയും തകർത്തുകൊണ്ട് വട വടക്കോട്ട് താൾ: 315
സ്വാർത്ഥപര താൾ താൾ: 1913. 118 തെറ്റുതിരുത്തൽ വായന നടന്നിട്ടില്ലാത്തവ */ '
തൊട്ടടുത്തുള്ള ഗോളങ്ങളുമായി അതിലോലങ്ങളായ സ്പ്രിങ്ങുകൾകൊണ്ട്
മന്ത്രാലയം കഴിവതും വേഗം ഈ രേഖകൾ പ്രസിദ്ധീകരിക്കണം. രത്‌നഗിരി ജില്ലയുടെ ഭൂപടം
നോത്തിഷ്ഠേന്മഥനം വിനാ 14 വിനാ ചാഭ്യാസയോഗേന ജ്ഞാനദീപസ്തഥാ ന ഹി. ഘടമധ്യഗതോ ദീപോ
ഗാനങ്ങൾ പൂന്താനത്തിന്റെ സ്തോത്രകൃതികൾ പൂന്താനത്തിന്റെ സ്തോത്രകൃതികൾ പൂന്താനം
ഭദ്രശ്രവോഭിരൃഷിഭിഃ പരിണൂയമാനം കൽപാന്തഗൂഢനിഗമോദ്ധരണപ്രവീണം ധ്യായാമി ദേവ ഹയശീർഷതനും
ജടയീന്നിറങ്ങി മെല്ലെ- ക്കൊടിയ തപസ്സിയലുന്ന ജഹ്നുവോടും വിടയതു വഴിപോലെ വാങ്ങി
സ്ത്രീകളുടേയും ആവശ്യമാണല്ലോ. സ്ത്രീകളിൽ ഒരു വലിയവിഭാഗത്തിനുള്ള ഈ അസ്വാതന്ത്ര്യം
അ'ത്തോട് ഒക്കുമല്ലോ അപൂപം അപൂർവ്വം അകർവ്വം. അപേക്ഷ അപ+ഈക്ഷ) 1. 2. തരുവാൻ
കണക്ഷനും ലഭ്യമായ ലാബ് ലഭ്യമാക്കിയതിനാൽ ഒരു പ്രായോഗിക പരിശീലനം മാതൃകയിൽ മലയാളം
തന്നിലതിസക്തിയുള്ളോൻ ദ്വിജദേവദ്വേഷി അതിലുബ്ധന്മാര- ആരികിലുള്ളവർ ഇണങ്ങരൊക്കയും
മാറ്റിവെച്ചു. അപഗ്രഥന റിപ്പോർട്ട്‌ മറാത്തിഭാഷയിൽ ലഭ്യമാക്കിയശേഷം 11-10-2008
നോമ്പ് അവൻ പൂർത്തിയാക്കട്ടെ. അല്ലാഹുവാണ് അവനെ തീറ്റിക്കുകയും കുടിപ്പിക്കുകയും
പിറന്നീലാനീയ്യെന്നിരുന്നാലിന്നുണ്ടോ പിരിയുന്നു പീഡയിനിയ്ക്കു ബാലക! ചതിച്ചുപോകിൽ
ദിവാകരൻമൂസ്സും. നീലകണ്ഠൻമൂസ്സും വൈദ്യ ശാസ്ത്രം വേണ്ടതുപോലെ പഠിച്ചിരുന്നു.
ഇല്ലത്ത് ഒരു മൂസ്സും അവിടുത്തെ അമ്മയും അവിടുന്നു വിവാഹം കഴിച്ചിട്ടുള്ള
മാമരം കെട്ടിപ്പിടിച്ചാളവിരളം കോമളമായലതയെന്നപോലവേ അപ്പോളതുകണ്ടുജാനകീദേവിയോ-
നിനക്കു യോഗ്യം. ഭീഷിത. ശ്ളോ. ഏവം ശ്രുത്വാ ഭാരതീം നാരദീയാം പൂർവ്വം തസ്യാം
1871. 39 1871. 40 1871. 41 1871. 42 1871. 43 1871. 44 1871. 45 1871. 46 1871. 47
ഭാഷ്യാർത്ഥം: മനുഷ്യർക്കു വിദ്യാധികാരമുണ്ടെന്നു സിദ്ധാന്തിച്ചും വച്ച് ഏതുപ്രകാരം
അല്ലാതെ അപ്രകാരം പറയപ്പെടുന്ന പുസ്തകം മാത്രമല്ല എന്നു പ്രപഞ്ചവേദികൾ
ഒരിക്കൽ ഈ രാജധാനിയിൽ ചെന്നിരുന്നു. അപ്പോൾ സോളന്റെ അവസ്ഥയ്ക്കനുരൂപമായ
ഭിക്ഷുർനാവസഥേ വസേത്. പരാർഥം ന പ്രതിഗ്രാഹ്യം ന ദദ്യാച്ച കഥഞ്ചന 93 ദൈന്യഭാവാത്തു
അർഹതയില്ലെന്നു തെളിഞ്ഞി രിക്കുന്നു. ഇനിയും വർണ്ണവ്യത്യാസം
എന്ന താളിലേക്ക് തിരിച്ചുവിടുന്നു ഒരു_സിംഹപ്രസവം വർഗ്ഗം:1922-ലെ കൃതികൾ
തോന്നിക്കൊള്ളും. യാതൊരവസ്ഥാഭേദങ്ങളെക്കൊണ്ടും നിന്റെ ദൈവഭക്തിക്ക് അണുമാത്രവും
സന്തതിഃ ന ശക്യാഃ പരിസംഖ്യാതും യേ ദീപ്തം പാവകം ഗതാഃ 20 സപ്ത ശീർഷാ ദ്വിശീർഷാശ് ച
അതനുസരിച്ച് ശിവൻ സർവ്വജ്ഞനും, സർവ്വവ്യാപിയും സ്വതന്ത്രനുമായ പരമതത്വമാണ്. ഈ
അല്പദിവസങ്ങൾക്കുള്ളിൽ തങ്ങളുടെ ഗുരുവായ ഋഷി വിചാരിച്ച അർത്ഥം ഇതായിരിപ്പാൻ
ഭ്രാതാ അഖണ്ഡൈകരസഃ പതിഃ 13 അഖണ്ഡൈകരസം സൂത്രമഖണ്ഡൈകരസോ വിരാട്. അഖണ്ഡൈകരസം
അതിരളവും ചേർക്കുന്നതിൽ യാതൊരു ശ്രദ്ധയും ചെയ്യാതെ ഏതെങ്കിലും പഴയ ഒരു രേഖയെ നോക്കി
ശക്തിയുപയോഗിച്ച് വെളിക്കു സ്പ ഷ്ടമായ വിധത്തിൽ വിടാതെ ഉള്ളടക്കമാക്കി അമർത്തു
പേരിലാണു ഇദ്ദേഹം പരക്കെ അറിയപ്പെട്ടിരുന്നത്. യുസ്തൂസ് യോസഫ് കീർത്തനങ്ങൾ യുസ്തൂസ്
തിരച്ചിൽ പെട്ടിയിൽ കൃതിയുടെ പേര് കൊടുത്ത് തിരയുക. പുതിയ താൾ ആയതിനാൽ അതേ പേരിൽ ഒരു
മാർഗ്ഗമുള്ളു. ഖണ്ഡികകളുടെ പൂർവ്വോത്തരസംബന്ധം സൂക്ഷിച്ചാൽ സന്ധാനം ശരിയായിരിക്കും.
പ്രദദൗ കാർത്തികേയായ വായുർ ഭരതസത്തമ 41 ഘസം ചാതിഘസം ചൈവ തിമിവക്ത്രൗ മഹാബലൗ പ്രദദൗ
അധ്യായം6 മഹാഭാരതം മൂലം/കർണപർവം/അധ്യായം7 അധ്യായം7 മഹാഭാരതം മൂലം/കർണപർവം/അധ്യായം8
അസാമാന്യമായ കഴിവ് ആദ്യകാലങ്ങളിൽ അവർക്കുണ്ടായിരുന്നു. 1948ലെ തിരുവിതാംകൂറിലെ
ശിശുമേവാപ്യേതി യഃ ശിശുമേവാസ്തമേതി ശ്യേനമേവാപ്യേതി യഃ ശ്യേനമേവാസ്തമേതി
ലേലിഹാനോപസർപതി 6 [വൈ] ഏവം ഉക്തോ ഭ്രാതൃഭിസ് തു ജരിതാരിർ ബിഭാവസും തുഷ്ടാവ
26044 താൾ: 6 1913. 451 തെറ്റുതിരുത്തൽ വായന നടന്നിട്ടില്ലാത്തവ */ 'ഉള്ളാടന്മാർ'
മേൽപറഞ്ഞ വിഷയത്തേക്കുറിച്ചുള്ള ഉത്തമോപന്യാസത്തിന്നു ഞങ്ങൾ ചുരുങ്ങിയ ഒരു സമ്മാനം
നയിച്ചാളിമാർ നോക്കിനിൽക്കേ മേലാലീവണ്ണ മെന്നങ്ങിടറിയരുളിയാഗസ്സിനെസ്സൂചയിത്വാ
ആപത്കരമാണെന്ന് അവർക്കും അറിയാം. അതേസ അതേസമയം താൾ: 120 താൾ: 102 തെറ്റുതിരുത്തൽ
പശ്ചിമഘട്ടപ്രദേശങ്ങളുടെ പരിസ്ഥിതി വിലോലത വിലയിരുത്തേണ്ടതു സംബന്ധിച്ചാണെങ്കിൽ
സർവ്വകാല ത്തും ബ്രഹ്മാനുഭവമുണ്ടായിരിക്കേണ്ടതല്ലേ, എന്നാണെങ്കിൽ, അനുഭവത്തെ
ഗവാമയം നിഷ്കോഽയമശ്വതരീരഥോഽനു മ ഏതാം ഭഗവോ ദേവതാം ശാധി യാം ദേവതാമുപാസ്സ ഇതി 4. 2. 2
അസഖ്യം 2 6) 7. അത്താറ്); 8. താൾ: 98 ആ അദ്ധ്യായം അടയ്ക്കും. പിന്നെ ആ
ഇന്ദ്രപ്രസ്ഥം എന്നാൽ ഡില്ലി ൯൯ താൾ സൃഷ 19026 താൾ: 1921. 292 തെറ്റുതിരുത്തൽ വായന
തെളിവു വേണം? അന്ന് അദ്ദേഹത്തോടുകൂടി സഞ്ചരിച്ച്, കൊലചെയ്ത രാക്ഷസൻ ഇതാ കാര്യസ്ഥനായി
ഭാവിക്കുന്ന സ്ഥിതിക്ക് എന്റെ മകൾ എന്തു ചെയ്യും? ശാർങ്ഗരവൻ: കോപത്തോടെ
എനിക്ക് അല്ലാഹുവിനോട് നിങ്ങൾ വസീലത്ത് ആവശ്യപ്പെടണം. സ്വർഗ്ഗത്തിലുള്ള ഒരുന്നത
വിവാഹമണ്ഡപത്തിലിരുന്ന അനേകം ചിത്രങ്ങളുടെ കൂട്ടത്തിൽ രാവണന്റെ ചിത്രപടം കണ്ടിട്ടു
ദ്വാരത്തിൽകൂടി കുറെ പച്ചവെള്ളം കുടിക്കുന്നത് തലവേദനകൾക്ക് വളരെ ഗുണമുള്ളതാണെന്ന്
പരിശോധനാൎത്ഥം ഉപയോഗിച്ചു നോക്കേണ്ടതാണ്. ഇതുകൂടാതെ, ഉപ്പുനിലങ്ങളിൽ വിളയുന്നതായ
ഗ്ലിംപ്‌സസ്‌ ഓഫ്‌ ദി ഹിസ്റ്റോറിക്‌ `കാർത്തികേയ' 1 ഫ്‌ളോർ ആന്റ്‌ ദി ശാരദ നഗര. അസ്നേഹോ ഗുരുശുശ്രൂഷാ ശ്രദ്ധാ ക്ഷാന്തിർദമഃ ശമഃ 11 ഉപേക്ഷാ ധൈര്യമാധുര്യേ തിതിക്ഷാ
ഒപ്പം അമാവാസി, പൗർണ്ണമി, ദിനബലികളുടെ വിശദാംശങ്ങൾ, ചാതുർമാസ്യ ബലികൾ, ഋതുക്കൾ,
രാമകൃഷ്ണപിള്ള വിമർശനം വർണ്ണനം വർണ്ണനം സംവാദം കഥയെഴുത്ത് സംവാദം കഥയെഴുത്ത്
പറയുന്നു. അതായതു (സൂരൻ) പ്രകാശം, വർണ്ണം, ഉഷ്ണം ഈ മൂന്നും ഒന്നായിരിക്കുന്നതുപോലെ ഈ
ആനന്ദകോശഹീനാത്മാ പഞ്ചകോശവിവർജിതഃ. നിർവികൽപസ്വരൂപാത്മാ സവികൽപവിവർജിതഃ 75