രാജഗോപാലാചാൎയ്യവർകൾ ഈ വിഷയത്തിൽ ഇങ്ങിനെ പറഞ്ഞിരിക്കുന്നു: 'തറവാട്ടിൽ മൂത്ത മകൻ
വ്യശേമ ദേവഹിതം യദായുഃ. സ്വസ്തി ന ഇന്ദ്രോ വൃദ്ധശ്രവാഃ. സ്വസ്തി നഃ പൂഷാ
ഗീതങ്ങൾ മായ്ക്കുക/ പരിഷത്ത് ഗീതങ്ങളുടെ പകർപ്പാവകാശം ആർക്കാണ് ? പരിഷത്തിനാണെങ്കിൽ
! വികാസം ! വികാസം ! വികാസം ! ഉദ്ബോധനം ഉദ്ബോധനം വർഗ്ഗം:അമൃതവീചി അമൃതവീചി/ഉദ്ബോധനം
പ്രകൃതനാടകത്തിൽ നായികാനായകന്മാരുടെ പരസ്പരരതി പരിപോഷത്തെ ക്രമേണ വർണ്ണിച്ച് ഈ
വല്ലാത്തൊരനിശ്ചിതത്വമുണ്ടായിരുന്നു. ഒരുവശത്ത് സ്ത്രീകളെ 'ഉദ്ധരിക്കാനു'ള്ള
പ്രായോഗികമായിരിക്കുന്നു. സഹതേ സഹിക്കുന്നു എന്നർത്ഥം പ്രാകൃതത്തിൽ സഹയി സഹയേ എന്ന
ച്ചതിനുശേഷം ഇങ്ങ് ഇത്താകയാൽ ലോപിച്ചു പോയി ഭു+ല് എന്നുമാത്രമുണ്ട്. ല് എന്നതിനു തി
പൂർണ്ണമായും, തനിക്കു കാരണമായി മുമ്പും കാര്യമായി പിമ്പും ഒരു വസ്തുവും
വില 8 ണ.കർപ്പൂരാരിഷ്ടം,വിഷൂചികം, അതിസാരം വയറ്റിൽകടി,ദഹനക്കുറവ്,ചെവിക്കുന്നിയുടെ
സംശയമുളവാകുകയും ജനങ്ങളറിയുന്നത് നിനക്കിഷ്ടമില്ലാതിരിക്കുകയും ചെയ്യുന്നതേതോ അതാണ്
64 1903. 65 1903. 66 1903. 67 1903. 68 1903. 69 1903. 70 1903. 71 1903. 72 1903.
സോമ്യ യജൂം ഷി സാമാനീതി സ ഹോവാച ന വൈ മാ പ്രതിഭാന്തി ഭോ ഇതി 6. 7. 2 തം ഹോവാച യഥാ
കണ്ടിട്ടില്ലായിരുന്നു. ഈ വർത്തമാനം കേട്ട് ആ കുട്ടിക്കൊമ്പനെ കുഴിയിൽനിന്നു
കണക്കിനെയും പറയുമ്പൊൾ ഇയർപ്പേരാകും. അതിന്റെ അർത്ഥത്തിനു തക്കതായ വേറൊരു അർത്ഥത്തെ
അധ്യായം179 മഹാഭാരതം മൂലം/വനപർവം/അധ്യായം179 വ്യാസൻ അധ്യായം179 അധ്യായം178
വിക്കിഗ്രന്ഥശാല:ഒഴിവാക്കൽ നയം" / വിക്കിഗ്രന്ഥശാല:ഒഴിവാക്കൽ നയം എന്ന താളിലേക്ക്
അദ്ധ്യാത്മതത്ത്വത്തിന്റെ സ്ഥൂലമായ സ്വരൂപജ്ഞാനത്തെ ഉണ്ടാക്കുവാനുതകുന്നുവെന്നെ
തീരുമാനത്തിലാണ് അവസാനം ഡർബാർ എത്തിച്ചേർന്നത്. പ്രസ്സ് കമ്മ്യൂണിക്കേകൾ
ഫലകം:കുന്ദലത കുന്ദലത കുന്ദലത/അനുരാഗവ്യക്തി താളിലെ വിവരങ്ങൾ അപ്പു നെടുങ്ങാട
യഥാകാര്യം പ്രയോക്തൃഭിഃ സിതനീലസമായോഗേ കാരണ്ഡവ ഇതി സ്മൃതഃ 80
ഭാസ്വരാമലാ സാംനിധ്യാദാത്മവദ്ഭാതി സൂര്യവത്സ്ഫടികോ യഥാ 482 ആത്മാഭാസം തതോ
പട്ടിക 6 ൽ ഇത്‌ സംഗ്രഹിച്ചിരിക്കുന്നു. പട്ടിക 6 : മേഖലാതലത്തിലുള്ള നിർദ്ദിഷ്‌ട
ഒരു പ്രത്യേക പ്രദേശ ത്തിന്റെ കിടപ്പ്‌, ഉന്നതി, തത്‌പ്രദേശത്തെ സവിശേഷ കാലാവസ്ഥ
അർത്ഥമുള്ള ഒറ്റ വാക്കാകുന്നു. ഞാലം, മൺ മുതലായവ ഏകാർത്ഥവാചിയായ വാക്കുകളിൽ
തിരുമേനി(സ) ഇഷ്ടപ്പെട്ടിരുന്നത്‌. (ബുഖാരി. 1.10.564) ആയിശ:(റ) നിവേദനം: അവർ
അർധഗോളത്തിലുള്ളവർക്ക് ദിക്കു കാണിച്ചുതരാൻ തെക്കൻ കരിശുണ്ട്. ഭാരതീയർ ആ ഗണത്തെ
സൂക്ഷ്മതരം മഹതോ മഹത്തരമപരിമിതാനന്ദവിശേഷം
പൂവത്തെണ്ണ, മരോട്ടിയെണ്ണ മുതലായവ)യും മണ്ണാത്തി മാറ്റും അശകിൻ പൂവും വേണമെന്നു
ചെന്നേനവരോടുമൊന്നിച്ചുമുവ്വരും മന്നവൻ തന്നോടണഞ്ഞതുകണ്ടവൻ
ജഗത്സ സഭൂതം സ ഭവ്യം ജിജ്ഞാസക്ലൃപ്ത ഋതജാ രയിഷ്ഠാഃ ശ്രദ്ധാ സത്യോ
അദ്ദേഹം (അബൂമൂസ) അൻസാരികളുടെ സദസ്സിലേക്ക് പുറപ്പെട്ടു. ഞങ്ങളുടെ കൂട്ടത്തിൽ
കുത്തൊഴുക്കിൽപ്പെട്ട്‌ പശ്ചിമഘട്ടത്തിലെ പ്രകൃതിദത്ത മൂല ധനം ഒലിച്ചുപോയി ഇത്‌
പ്രതിബദ്ധബോധവിഭവസ്തേനൈവ ദേവഃ സ്വയം മായാം സ്വാമവലംബ്യ നിശ്ചലതയാ സ്വച്ഛന്ദവൃത്തിഃ
തരുണിമാരോടു പറയാമോയെന്നു നരപതി കേട്ടു വരദൻ ചൊല്ലിനാൻ പരമദുഷ്ടയെ കളകയല്ലാതെ
ലോകോഽഥ യ ഏഷ ഏതസ്മിന്മണ്ഡലേഽർചിർദീപ്യതേ താനി സാമാനി സ സാമ്നാം ലോകോഽഥ യ ഏഷ
321ലെ ഒരു ശിലാലേഖനത്തിൽ ഒരു വേണാട്ടറുനൂറിനെ 'ക്ഷേത്രാധികാരി'കളുടെ നിലയിൽ
നേത്രമണികളുടെ പിംഗളതയും കണക്കാക്കുമ്പോൾ ഗൗണ്ഡൻ ചിലമ്പനഴിയത്തുനിന്ന് ഒരു രാത്രി
താളിലേക്ക് തിരിച്ചുവിടുന്നു രചയിതാവ്:കൊടുങ്ങല്ലൂർ_കുഞ്ഞിക്കുട്ടൻ_തമ്പുരാൻ
മൂലാഗ്നാവഗ്നിരൂപം പ്രണവം സന്ദധ്യാത്സപ്താത്മാനം ചതുരാത്മാനമകാരം രുദ്രം ഭ്രൂമധ്യേ
പൂർവ്വഭാഗം എന്ന താൾ രാജയോഗം (കുമാരനാശാൻ)/പൂർവ്വഭാഗ തിരിച്ചുവിടുക രാജയോഗം
സുരാദികൾ ദുഷ്ടമൃഗാകുലമായവനമതി- ലൊട്ടും കൃശോദരി! ഭീതികളെന്നിയേ എങ്ങിനെ വന്നു
2445. 283 234. താൾ: 1915. 115 വർഗ്ഗം:താളുകൾ - 1915 താൾ: 1772. 221 വർഗ്ഗം:താളുകൾ -
ചിലപ്പോൾ മറ്റുള്ളവർക്ക് താങ്കളോട് ആശയവിനിമയം നടത്തുക കൂടുതൽ
കുശലൈഃ യൂപാഗ്നിചയനദർഭസ്ത്രഗ്ഭാണ്ഡപരിഗ്രഹാന്മുക്ത്വാ 38 സിദ്ധ്യാ മിശ്രോ
85 1907. 86 1907. 87 1907. 88 1907. 89 1907. 90 1907. 91 1907. 92 1907. 93 1907.
സമാധാ നിക്കുക തന്നെ. നമുക്കു വേറെ ഒരു ദിക്കിലേ കഥ അന്വേഷിക്കാം. കൊച്ചപ്പന്റെ
നാരായണാദ്ധിരണ്യഗർഭോ ജായതേ. നാരായണാദണ്ഡവിരാട്സ്വരൂപോ ജായതേ.
എന്ത്‌ നടപടിസ്വീകരിക്കാനും 1986ലെ പരിസ്ഥിതി (സംരക്ഷണ) നിയമത്തിലെ 3-ാം വകുപ്പ്‌
ചാനിലമാരോപ്യ രേഫാക്ഷരസമുജ്ജ്വലം. ത്രിയക്ഷം വരദം രുദ്രം തരുണാദിത്യസംനിഭം 92
പ്രത്യേകിച്ചും അഭിസംബോധന ചെയ്തു. ബനൂ അബ്ദുശംസേ, ബനൂ കഅ്ബേ! നരകാഗ്നിയിൽ നിന്ന്
അവഗീതോഽപി ഹീനോഽപി സ്യാദുദാത്താവഭാസകഃ യത്ര ശബ്ദാർഥസമ്പത്തിസ്തദോജഃ പരികീർതിതം 107
നോക്കപ്പെട്ടാൽ അപ്രകാരം ഉദയമായ അനുഭൂതിവൃത്തിയുടെ ഗുണത്തിൽ നിന്നു വേറില്ലാത്തതായും
പ്രാചീനദ്രാവിഡഭാഷയായിരുന്നു ലോകത്തിലെ ആദിഭാഷ എന്നും അതുതന്നെയാണ് മറ്റെല്ലാ
ആര്യന്മാരായ ബ്രാഹ്മണരുടെ കൂട്ടത്തിൽ ദുരിതരൂപികളായ വംശക്കാർ ധാരാള
വിടാത്തതായ ലക്ഷണ, ലക്ഷ്യമായി അർത്ഥത്തെ അറിയിക്കുന്ന ന്ധ7 ഉദ്ഭിദ്എന്ന് ഒരു
മാഹിഷ്മത്യാം കുരൂദ്വഹ ബഭൂവുർ അനഭിഗ്രാഹ്യാ യോഷിതശ് ഛന്ദതഃ കില 24 ഏവം അഗ്നിർ വരം
പല സ്ഥലങ്ങളിൽ നിന്നും ജനങ്ങൾ മണ്ടക്കാട്ടു വന്നുകൂടിത്തുടങ്ങും. എങ്കിലും കൊല്ലത്തു
അഭിപ്രായം പറയേണ്ട ചുമതല പത്രക്കാരനുള്ളതാണെന്നിരുന്നാലും, പുസ്തകം ഒന്നോ രണ്ടോ
രണ്ടുവാക്ക് സംസാരിക്കുവാനായി യോഗം ഭാരവാഹികളുടെ അനുപേക്ഷണീയമായ നിർബന്ധംമൂലം
അന്തരിക്ഷേ മഹാരാജ വിനദന്തോ ഽവതസ്ഥിരേ 46 ബ്രഹ്മാ ബ്രഹ്മർഷിഭിഃ സാർധം പ്രജാപതിഭിർ ഏവ
വിശ്വതൈജസപ്രാജ്ഞതടസ്ഥഭേദൈരേക ഏവ ഏകോ ദേവഃ സാക്ഷീ നിർഗുണശ്ച തദ്ബ്രഹ്മാഹമിതി
നാഥനില്ലാതാകുമെന്ന് തീർച്ച. തടഞ്ഞേ മതിയാകൂ. ത്രിമൂർത്തികൾ ഇടയ്ക്കു കയറി നിന്നു
ഭൈമി അമ്മയുടെ അനുമതികയോടുകൂടെ ബാഹുകനെ ആളയച്ചു വരുത്തി സ്വയമേവ ചോദ്യങ്ങൾചെയ്തു