വിദ്ധ്വാ സ്വർണപുംഖൈഃ ശിലാശിതൈഃ നനാദ ബലവൻ നാദം തിഷ്ഠ തിഷ്ഠേതി ചാബ്രവീത് 24 സ
കണ്ഠാക്രോശങ്ങളെന്നപോലെ, കാഹളധ്വനികൾ ടിപ്പുവിന്റെ പാളയത്തിൽനിന്നു കേൾക്കുന്നുണ്ട്.
നാസാപുടമധരവും പരദാരങ്ങൾങ്ങു ദരമരുളുന്ന ഗളേഹാരാവലിഭുജയുഗളവും കരകമലവുമുദരവും നല്ല
രമിതവല്ലവീലോചനം പുനഃപുനരുപാസ്മഹേ ഭുവനലോഭനീയം മഹഃ കട്ടി-ശ്ലോ പൃത്ഥ്വി 36 സ കോപി
പ്രവാചകരേ! എന്നാണ് അവന്റെ സൽക്കാരം എന്ന് ചോദിക്കപ്പെട്ടു. നബി(സ) അരുളി: ഒരുപകലും
വിക്കിഗ്രന്ഥശാല: 1.0 വിക്കിഗ്രന്ഥശാല:സിഡി പതിപ്പ് 1.0" / വിക്കിഗ്രന്ഥശാല:സിഡി
തലെയുമങ്ങെടു- ത്തടുപ്പിച്ചുകൊണ്ടങ്ങിരുന്നു കേഴുമ്പോൾ ഭരതമാതാവും വരുന്നതുകണ്ടു
പിംഗലാ ചോർധ്വഗാ യാമ്യനാസാന്തം ഭവതി. പിംഗലായാഃ പൃഷ്ഠതോ യാമ്യനേത്രാനതം പൂഷാ ഭവതി.
വർഗ്ഗം:താളുകൾ - 1915 താൾ: 1915. 215 2014 വർഗ്ഗം:താളുകൾ - 1915 താൾ: 1915. 216 2014
ബിപിൻ തെറ്റുതിരുത്തൽ വായന കഴിഞ്ഞവ */ താൾ: 31 ബിപിൻ തെറ്റുതിരുത്തൽ വായന കഴിഞ്ഞവ */
കൊണ്ടുവരാനും പറ്റുമെങ്കിൽ നല്ലതാണു്. ദേവികയോടും വേണുവേട്ടനോടും വേണമെങ്കിൽ ഞാൻ
കൊടുക്കാറുണ്ടായിരുന്നു. പറയെടുത്തു കഴിഞ്ഞാലും അവകൂടെ കിട്ടാതെ ആ സ്ഥലങ്ങളീൽ നിന്ന്
കാരണമായി പറവാൻ കാണുന്നുള്ളൂ. നിങ്ങളുടെ സ്വന്തശരീരത്തിൽ തന്നെ ചിലപ്പോൾ പ്രാണന്റെ
ചെയ്തു. അതിന്റെ ശേഷം കുറഞ്ഞൊരു ദിവസം കഴിഞ്ഞപ്പോൾ അന്നു നാടുവാണിരുന്ന
പുൽക്കൊടിയുടെ പ്രേമഗാനം ലീലാങ്കണം/വസന്താവസാനം വസന്താവസാനം ലീലാങ്കണം/അഞ്ജലി അഞ്ജലി
ബ്രാഹ്മണ ഇതി തർഹി ജ്ഞാനം ബ്രാഹ്മണ ഇതി ചേത് തന്ന ക്ഷത്രിയാദയോഽപി
കണക്കിനെയും പറയുമ്പൊൾ ഇയർപ്പേരാകും. അതിന്റെ അർത്ഥത്തിനു തക്കതായ വേറൊരു അർത്ഥത്തെ
താൾ: 1896. 85 2014 താൾ: 1868. 529 തെറ്റുതിരുത്തൽ വായന കഴിഞ്ഞവ */ താൾ: 1915. 15
തന്നെയാണു് ഇയാളുടെ മിഴികൾ നിൽക്കുമാറു്. ശരീരം കൃശമായി അകത്തോട്ടു വളഞ്ഞു
വർഗ്ഗം:കൃതികൾ_വർഷം_അനുസരിച്ച് വർഗ്ഗം:1889-ലെ കൃതികൾ വർഗ്ഗം:കൃതികൾ_വർഷം_അനുസരിച്ച്
സഹായം:സൂത്രവാക്യങ്ങൾ ഗണിതം മധുരം 1, 2, 32694 32694 2} 2} 1- 2} 1- 2} 1- 3} 1- 3}
ആസ്ഥിതഃ 27 തതഃ പ്രസാദയാം ആസ ശ്വശുരം സാ പുനഃ പുനഃ ന മേ പുത്രോ ഭവേദ് ഈദൃക് കാമം
സ്മൃത്വാപ്യേതസ്യ ജന്തോർനിധനമസുയുതിം ഭാഷതേ തേന സാകം സത്യേവം ഭാതി ഭൂയോ
വർഗ്ഗം:ദേവീമാനസപൂജാസ്തോത്രം ദേവീമാനസപൂജാസ്തോത്രം/സ്തോത്രങ്ങൾ/42
ഇല്ലാത്തതായും. തന്നിൽ ആധേയമായി മറ്റൊരു വസ്തു വില്ലാതെയും യാതൊന്നു ശോഭിക്കുന്നുവോ
പതികൌസല്യയ്ക്കും നൃപനെല്ലാവർക്കും അവണ്ണമുള്ളവൻ പറഞ്ഞവാക്കിനെ അതിക്രമിയ്ക്കുമ്പോൾ
താൾ: 1935. 393 തെറ്റുതിരുത്തൽ വായന നടന്നിട്ടില്ലാത്തവ */ ' ൩൮൨ കണ്ടകശോധനം താൾ
പറയരുതെന്നു അർത്ഥം) ഭാഷകളാണെന്നു സംസ്കൃത പക്ഷപാതികൾ പറയുന്നു. ഈ അഭിപ്രായം
നിലയെക്കുറിച്ചും വിലപ്പെട്ട ഉൾക്കാഴ്ചയും വിവരങ്ങളും നൽകുന്ന ലേഖനങ്ങൾ അവർ
സർവവേദാന്തസിദ്ധം ബ്രവീമി ശ്ലോ 10 വർഗ്ഗം:ശങ്കരാചാര്യരുടെ കൃതികൾ വർഗ്ഗം:സംസ്കൃതം
റിപ്പോർട്ടുകളും കണക്കുകളും സ്വഹസ്തലിഖിതമായിത്തന്നെ ചാരന്മാർമുഖേന ദ്രുതതരമായി
തേരു ലേശം പോലും ഇളകിയില്ല. എന്നു മാത്രമല്ല ദേവിയെ നിന്ദിച്ചു പറഞ്ഞ ആ പട്ടർക്കും
സുസന്ത്യക്തം സ ജീവന്മുക്ത ഉച്യതേ 56 ഉദ്വേഗാനന്ദരഹിതഃ സമയാ സ്വച്ഛയാ ധിയാ. ന ശോചതേ
ഛേത്തുമർഹസീതി. സ ഹോവാചാഥർവാ സത്യം ശാണ്ഡില്യ പരംബ്രഹ്മ നിഷ്ക്രിയമക്ഷരമിതി.
രാജയോഗം (കുമാരനാശാൻ)/അനുബന്ധങ്ങൾ/സാംഖ്യസൂത്രങ്ങൾ താൾ:സുധാംഗദ. നാലു കൊല്ലങ്ങൾക്കു
ദ്വാദശാന്തസ്ഥിതജ്ഞാനാത്മാനമേകീകൃത്യ പഞ്ചോപചാരൈരഭ്യർച്യ പുനഃ സോഽഹമിതി മന്ത്രേണ
001. 8 108203] [ 137535] 31834] [ 99792/] [ 99793/] 63509] [ 125941/] 65433]
കീര്യമാണസ് തു ബാണസംഘൈർ മഹാത്മഭിഃ ന ചചാല മഹാരാജ സർവസൈന്യസ്യ പശ്യതഃ 15 ലാഘവം
വന്ദിച്ചുപിന്നെയുംചോദിച്ചിതുനൃപൻ. അഹമഖ്‌ലജഗദധിപഹരചരണപങ്കജ-
അതിന്റെ പോരായ്മകളെക്കുറിച്ച് ഏറെക്കുറെ നിശ്ശബ്ദമായിരുന്നു. 2003ലെ പരിഷ്ക്കരിച്ച
സമിദ്രശ്മയോ ധൂമോഽഹരർചിശ്ചന്ദ്രമാ അംഗാരാ നക്ഷത്രാണി വിസ്ഫുലിംഗാഃ 5. 4. 1
സമാഹരിക്കാൻ ഉദ്ദ്യേശിക്കുന്നത്. വളരെയധികം അധ്വാനഭാരമുള്ള ഈ ഉദ്യമത്തിലേക്ക്
സാരയുംപാലുംതേനുംകദളീപക്വങ്ങളും. പാരാതെഭുജിച്ചുനിന്നാലസ്യംതീർത്തുകൊണ്ടു
പിന്നെ അയാൾ അതുകൊണ്ടു മുറയ്ക്കു കൊപ്രകച്ചവടം ചെയ്തുകൊണ്ടിരുന്നു. എന്തിനു
പ്രാദേശിക ജനതയെ പങ്കാളികളാക്കുകയും ബോധവൽക്കരണം പ്രോത്സാഹിപ്പിക്കുകയും വേണം.
മംഗളമായി ഭവിക്കുന്നു. തുടർന്ന് കാണുന്ന രംഗം ബ്രാഹ്മണന്റെ ഗൃഹം ആണ്‌. അവിടെ
ഭാര്യാം യൈഷാ ദ്രൗപദീ ദിവ്യരൂപാ 34 കഥം ഹി സ്ത്രീ കർമണോ ഽന്തേ മഹീതലാത്;
 വരി വരി താഴെ കാണുന്ന രൂപം നൽകുന്നു: (രണ്ടാം വരി കാണില്ലന്നതു ശ്രദ്ധിക്കുക) വരി
അവൻ വരിക്കുക. (ബുഖാരി. 9. 88. 176) 2) ഇബ്നുഅബ്ബാസ്(റ) പറയുന്നു: നബി(സ) അരുളി:
പ്രത്യക്ഷേപ്രിയവാദിനം- വജ്ജേൽതാദ്രുശമ്മിത്രംവിഷകംഭപയോമുഖം. കാണുമ്പോൾ ഭംഗിപറയുകയും
സ ഇഷ്ട്വാ പാപീയാൻഭവതി 4. 16. 3 അഥ യത്രോപാകൃതേ പ്രാതരനുവാകേ ന പുരാ പരിധാനീയായാ
നാനാശിൽപപ്രയോജിതം ഭ്രൂഗുച്ഛോപരിഗുച്ഛശ്ച കുസുമാനുകൃതിസ്തഥാ 24 കർണികാ കർണവലയം തഥാ
മറ്റൊരു ബോധം വഴിയായേ വരുന്നുള്ളു. നിർജ്ജീവവും, ജ്ഞാനരഹിതവുമായ ജഡവസ്തു ഒരിക്കലും
ഒരു അപ്രതിരോദ്ധ്യപ്രാകാരമെന്നപോലെ ആ ശ്രമത്തെ നിരോധിച്ചു. ഇതിനിടയിൽ ഒരു
ദശായാം പാശി' എന്നായിരുന്നു. പനസം എന്നു പറഞ്ഞാൽ ചക്ക എന്നും ദശ എന്നു പറഞ്ഞാൽ പത്ത്
കാർത്തികതിരുനാൾ കാർത്തികതിരുനാൾ രാമവർമ്മമഹാരാജാവു തിരുമനസ്സുകൊണ്ട് ഈ
ആരംഭിക്കുകയേ ഉള്ളു. ശബ്ദശ്രവണം ഉണ്ടാകയില്ല. അടുത്തിരിക്കുന്ന വേറൊരാൾക്ക്
ശരിയായചിഹ്നമാക്കുന്നു ദേവീമാനസപൂജാസ്തോത്രം ചട്ടമ്പിസ്വാമികൾ സ്തോത്രം-22 21
സൈനികാഃ വിവിധായുധസമ്പന്നാശ് ചിത്രാഭരണ വർമിണഃ 52 ശങ്കുകർണോ നികുംഭശ് ച പദ്മഃ കുമുദ
വ്യാഖ്യാനതല്പരനായ്‌വസിക്കുന്നോരു വിഖ്യാതനാംവ്യാസനെക്കണ്ടനന്തരം.
എതിർക്കുന്നവരെ അദ്ദേഹം നല്ല പാഠം പഠിപ്പിക്കാതെ വിടാറുമില്ല. ഒരു ദിവസം കേളുമേനോൻ
(ബുഖാരി. 8. 73. 64) 22) അബ്ദുല്ല(റ) നിവേദനം: ഒരു മുസ്ലീമിനെ ചീത്തപറയൽ
തമ്പ്രാക്കൾക്ക് തിരികെപ്പോകാറായപ്പോൾ തോണിക്കടവു മേനോന്മാർ തന്നെ തോണിയും
അധ്യായം5 അധ്യായം5 അധ്യായം7 അധ്യായം7 മഹാഭാരതം മൂലം/ആശ്രമവാസികപർവം/അധ്യായം5 വ്യാസൻ