തദേവ കമിതി പ്രാണം ച ഹാസ്മൈ തദാകാശം ചോചുഃ 4. 10. 5 ഇതി ദശമഃ ഖണ്ഡഃ ഏകാദശഃ ഖണ്ഡഃ അഥ
അദ്ധ്യാത്മരാമായണം കിളിപ്പാട്ട്/അയോദ്ധ്യാകാണ്ഡം തിരഞ്ഞെടുത്ത ഹദീസുകൾ/ഭയം
ബോർഡുകളുടെ മെമ്പർ സെക്രട്ടറികൾ അതോറിട്ടിയുടെ അധികാരങ്ങൾ 1. ഇതൊരു
സമരങ്ങളുടെ മുൻനിരയിൽ ധാരാളം സ്ത്രീകളുണ്ടായിരുന്നുവെന്നതിൽ യാതൊരു സംശയവുമില്ല.
ഉൾപ്പെടുത്തിയിരിക്കുന്ന കോമ്പാക്റ്റ് ഡിസ്ക്, അല്ലെങ്കിൽ മറ്റെന്തെങ്കിലും
കാർയ്യങ്ങളിൽ വൈമനസ്യം കാണിക്കുന്നതാണ് എല്ലാത്തരം മടികളിലും വെച്ചു വലിയ മടി! ഒരു
ളനുനയത്തോടുമനുജഞ്ചൊല്ലിനാൻ ജനനിയ്ക്കെന്തൊരു കുറവിതിലുള്ളു മനുവരനാം കോസലപതിയും
താൾ: 24 ബിപിൻ തെറ്റുതിരുത്തൽ വായന കഴിഞ്ഞവ */ താൾ: 25 താൾ: 26 ബിപിൻ തെറ്റുതിരുത്തൽ
നാമസമാനത.ാലന്ന്യോന്ന്യസമാനാങ്ഗ൧൦ബഹുളതാമൂലംതാനുംകേവല ൧
ചോദിച്ചു പോകരുതെന്നു പറയുമോ? എന്റെ മനസ്സുപോലെ ചെയ്തു. നീ ഇനി അതിനെക്കുറിച്ച്
പ്രാദേശികമായ പരിസ്ഥിതി-സാമൂഹ്യപശ്ചാത്തലവും കണക്കിലെടുത്തുകൊണ്ട്‌ വിവിധ ഗ്രേഡുകൾ
ന്ധ-16) ജഡത്തിൽ വെളിപ്പെട്ട ദൈവം, (1 യോഹ. 5-ഞ്ജ0) സത്യദൈവം, (എശായ 9-6) ശക്തിയുള്ള. സ തേഷാം സത്ത്വാംശം ചതുർധാ കൃത്വാ ഭാഗത്രയസമഷ്ടിതഃ
പുനർ വദ 2 [സ്] ശൃണു ബ്രഹ്മൻ യഥാ പൃഷ്ടാ മന്ത്രിണോ നൃപതേസ് തദാ ആഖ്യാതവന്തസ് തേ സർവേ
യോഗ്യനും ധൎമ്മബുദ്ധിയും ആയിരുന്ന പഴയ-ഈ ബ്രഹ്മണന്റെ സഹായംകൊണ്ടു് ആശാന്റെ
അർഹതയില്ലെന്നു തെളിഞ്ഞി രിക്കുന്നു. ഇനിയും വർണ്ണവ്യത്യാസം
സ്വപ്നരാജ്യം സസകലവിഭവോ ജാഗരം പ്രാപ്യ ഭൂയോ രാജ്യഭ്രഷ്ടോ ഹമിത്ഥം ന ഭജതി വിഷമം
അക്ഷരങ്ങൾ എല്ലാം ഒരു ശിശു വിന്റെ പ്രകൃതി തന്നെ പ്രദാനം ചെയ്യുന്നു. ഇനിയുള്ളത്
പറഞ്ഞു തുടങ്ങുകയും ആ പേരുതന്നെ ക്രമേണ സ്ഥിരപ്പെടുകയും അതിനാൽ അദ്ദേഹത്തിന്റെ
വിക്കിഗ്രന്ഥശാല ഉപയോക്തൃസമൂഹം 2013 ഒക്ടോബർ 14
ഏതാസാം ചൈവ വക്ഷ്യാമി കാമതന്ത്രമനേകധാ 221 ചിന്താനിഃശ്വാസഖേദേന ഹൃദ്ദാഹാഭിനയേന ച
സുകൃതികൃതപദം കിശോരഭാവേ സുകൃതിമനഃ പ്രണിധാനപാത്രമോജഃ കട്ടി-ശ്ലോ പുഷ്പിതാഗ്ര 44
തിരിച്ചുകളയൂ. (മുസ്ലിം) 51) ഉമ്മുസൽമ(റ)യിൽ നിന്ന് നിവേദനം: മൈമൂന(റ)യുടെ
ചെന്നെത്തുന്ന കാര്യം ദുഷ്കക്കരമായിത്തീരുകയാൽ അവർ ഇന്നിന്ന ദേശങ്ങളിൽ ഇന്നയിന്ന
വായന കഴിഞ്ഞവ */ താൾ: 02 04-150 35 ക്ക് അശേഷം രസിക്കാത്തതായ പല സംഗതികളും
സ്കാനുകളുടെ സ്റ്റാറ്റസും നടക്കുന്ന ഇവന്റുകളുമെല്ലാം ഉൾക്കൊള്ളിക്കുന്ന ഒരു നല്ലൊരു
പ്രശ്ലേഷത്തിന്റെ ശരിയായ ചിഹ്നം താൾ: 23 താൾ: 24 താൾ: 31 താൾ: 32 താൾ: 33 ബിപിൻ
ആകെ 1 2 7 3 1 2 0 1 1 അവലംബം: ഡാനിയേൽസ്‌, 2010, പട്ടിക 3, പേജ്‌ 8. 7 ഭൂപ്രകൃതി
മഹാപുരോഹിതരും, പ്രമാണികളും, അവനെ മരണവിധിയിൽ ഏല്പിച്ചു. ക്രൂശിച്ച് ൨൧ പ്രകാരവും
അതിലേക്ക് യാതൊരു പ്രതിഫലവും അവൻ ആഗ്രഹിക്കുകയും അവന് ആരും യാതൊന്നും
നിർജ്ജിതം - തോ ിക്കപ്പെട്ടത്. ലോല ഭൃംഗമാലാ - ലോലങ്ങളായിരിക്കുന്ന ഭൃംഗങ്ങളുടെ
പ്രത്യേകം:സമീപകാലമാറ്റങ്ങൾ സമീപകാല മാറ്റങ്ങൾ പരിശോധിക്കാവുന്നതാണ്. താളിൽ
പറഞ്ഞു. മുതകബ്ബിറൂൻ എന്നാണ് അതുകൊണ്ടുള്ള വിവക്ഷ. (തിർമിദി) 46) ഇബ്നു അബ്ബാസി(റ)ൽ
അങ്ങു പോയാലല്ലാതെ വരാൻ ഇടയില്ലെന്നും പറയപ്പെട്ടിരിക്കുന്ന പവിത്രാത്മാവ്
തല്ലിത്തകരുന്ന നേരം പൊങ്ങുന്ന വെള്ളച്ചഴുയിൽക്കിടന്ന് മുങ്ങിക്കളിക്കും ജലജന്തൂജാതം
ഒരുദാഹരണമല്ലേ, ഇത്? പുരുഷന്മാരുടെ കാര്യത്തിൽ ഇത് ശരിയായിരിക്കാം - പഠിച്ചവൻ
പൂണ്ടൊക്കയെഴുനീറ്റുവീരന- ത്തിക്കനകാണിച്ചു താരാപഥത്തെയും തെക്കുനോക്കിത്തന്നെ പാരം
അധ്യായം27 അധ്യായം27 1 [ദുർ] അയം തേ കർണ സാരഥ്യം മദ്രരാജഃ കരിഷ്യതി കൃഷ്ണാദ്
യുക്തികൊണ്ടും ബുദ്ധികൊണ്ടും ചില വാക്കുകൾ സൃഷ്ടിച്ചാണ് സംസാരിച്ചത്. അത് 'പനസി
പുറപ്പാടു പുസ്തകം 03_ 27 3 ലേവ്യ പുസ്തകം 04_ 27 4 സംഘ്യാപുസ്തകം 05_ 27 5 ആവർത്തന
ഉണർത്തുന്നതിനുമാണ് അഴിവോടു കൂടിയ ഭൂമിയിൽ പാപികൾക്കു അധിവാസം നിയമിക്കപ്പെട്ടത്.
പരാത്മേതി ജ്ഞാതം ചേന്നിർഭയോ ഭവേത് 27 ആത്മാവഭാസയത്യേകോ ബുദ്ധ്യാദീനീന്ദ്രിയാണ്യപി
പോരുവാനുള്ളൊരു സംഗതിയെന്തെന്നുരചെയ്ക മൂഷികാ! ചൊന്നാൻ ഹിരണ്യകൻ കൂർമ്മരാജൻ ഭവാ-
കേരളോല്പത്തി മറ്റെ മൂന്നു സ്വരൂപങ്ങളുടെ അവസ്ഥ പറങ്കി വന്നിട്ട് കുറുമ്പിയാതിരി
ഇത്രത്തോളം പോലും ന്യായം ഞാൻ കാണുന്നില്ല. ശ്രീമാൻ വൈലോപ്പിള്ളി ശ്രീധരമേനവൻ ബി.എ.
കൊണ്ടും അഭിഷ്ടവസ്തുക്കൾ കൊടുത്തതുകൊണ്ടും ശിശുക്കൾ വൃദ്ധന്മാരിവരെയെല്ലാംനിൻ
പറയുന്നതിന്നു ലക്ഷ്യം പോര. വാസം മരങ്ങളിൽ തന്നെ. ഭക്ഷണം ഫലങ്ങളും. പ്രസവിച്ചു
പൈങ്കിളിമൊഴി വക്ത്രമെന്നു വാക്കുകളാൽ. - സ്വ ചിലേടത്ത് സന്ദേഹത്തിന്റെ കോടികൾ കവി
പരിമോദിയ്ക്കേണം സുരാസുരന്മാരും അരിയായുള്ളൊരു പിതാവിനെയിപ്പോൾ പൊരുതൊടുക്കുവൻ
ഹാലസമാഹാത്മ്യം കേരളഭാഷാഗദ്യം താൾ 17075 താൾ: 1933. 183 തെറ്റുതിരുത്തൽ വായന
ഉപയോക്തൃതാളിലോ പൊതു അറിയിപ്പിടങ്ങളിലോ അറിയിപ്പുകൊടുക്കേണ്ട സന്ദർഭങ്ങളിൽ
ഏകാം അഗ്നിഷ്ടോമ ഫലം ലഭേത് 58 തതോ ഗച്ഛേത രാജേന്ദ്ര ബ്രഹ്മണഃ സ്ഥാനം ഉത്തമം
സ്വപ്രകാശപദേ സ്ഥിതഃ. കദോപശാന്തമനനോ ധരണീധരകന്ദരേ 52 സമേഷ്യാമി ശിലാസാമ്യം
കഴിഞ്ഞവ */ താൾ: 215 തെറ്റുതിരുത്തൽ വായന കഴിഞ്ഞവ */ താൾ: 216 തെറ്റുതിരുത്തൽ വായന
സന്തോഷമാണെന്നും എന്നെ ഇപ്പോൾത്തന്നെ അങ്ങോട്ടുകൂട്ടിക്കൊണ്ടു ചെല്ലണമെന്നും
ധാതാ സമ്രാഡിന്ദ്ര ഇന്ദുരിതി യ ഏഷ തപത്യഗ്നിനാ പിഹിതഃ സഹസ്രാക്ഷേണ
വിദുരനിലയനേ മാതരം സന്നിധായ കർത്തും തീർത്ഥപ്രചാരം പ്രകടിത വനവാസാപദേശേന പത്ന്യാ
ഗായത്രിമന്ത്രം/സൂര്യഗായത്രി ഗണേശഗായത്രി ഗായത്രിമന്ത്രം/ഗണേശഗായത്രി" / തലക്കെട്ടു
അടുപ്പമില്ലന്നു ള്ളതിനെ കാണിക്കുന്നു. കൂടാതെ തമിഴിൽ മുൻ കാണിച്ച പ്രകാരം അൻ, ആൻ,
മനുഉപയോക്താവിന്റെ സംവാദം: 30 താൾ:മണിമഞ്ജുഷ. 41 തെറ്റുതിരുത്തൽ വായന കഴിഞ്ഞവ */
എൻമകനെ കണ്ടോ എൻമകനെ കണ്ട താൾ സൃഷ്ടിച്ചിരിക്കുന്നു വർഗ്ഗം:പരിചമുട്ടുകളിപ്പാട്ടുകൾ
കഴിയും. ഇത് എന്തിനെ കാണിക്കുന്നു? നമ്മുടെ ബോധ സ്ഥാനത്തിനു താഴെയുള്ളവകളും നമ്മാൽ
അദ്ദേഹം തന്റെകൊട്ടാരത്തിൽ പ്രവേശിച്ചപ്പോൾ എന്റടുത്ത്‌ ആളെ പറഞ്ഞയച്ചുകൊണ്ട്‌
ക്ഷമാ ച ധർമശ് ച സത്യം ചാപി പ്രതിഷ്ഠിതം ത്വയാ കൃതാർഥഃ സഗരഃ പുത്ര വാംശ് ച ത്വയാ