18133 താൾ: 1914. 51 2014 താൾ: 1 1918. 69 രഘുവംശചരിത്രം _49_18133_ 18133 താൾ:
ദേവാസസ്ഥാനമായവാരാണസീ. കൈവല്യദാത്രീവിളങ്ങുന്നിതുമഹീ ദേവർഷിരത്നമേസർവ്വാർത്ഥദായിനീ.
ചൂഡാമണി/യാത്രാമൊഴി യാത്രാമൊഴി ചൂഡാമണി/നൈരാശ്യത്തിൽ നിന്ന് നൈരാശ്യത്തിൽ നിന്ന്
വേണ്ടി ഉപയോഗിക്കുന്നു. പശ്ചിമഘട്ട മേഖലയുടെ ഏകദേശം 30 ശതമാനം വനങ്ങളാണ്‌.
1911. 327 താൾ: 1917. 94 തെറ്റുതിരുത്തൽ വായന നടന്നിട്ടില്ലാത്തവ */ ' 77
അഥവാ അയഞ്ഞ ബന്ധങ്ങൾ മാത്രമുള്ളതോ ആയ പ്രവിശ്യകളെ ബൂർഷ്വാസി ഒരൊറ്റ ഗവണ്മെന്റും,
ഹന്യതേ തത് കുര്യാദ്ധീമാന്ദമമനലസശ്ചിത്തശാന്ത്യൈ പ്രയത്നാത് 135 സർവേന്ദ്രിയാണാം
ഇന്നാളുമായിട്ട് ചാർച്ചയോ,വേഴ്ചയോ ഉണ്ടു്, വീടിന്റെ പടി ഇന്ന ഭാഗത്തേക്കാണു്,ഇത്ര
അനിച്ഛാനാഡീവ്യവസ്ഥകളാണല്ലോ. കേന്ദ്രനാ താൾ:ജ്യോതിഷവും ജ്യോതിശ്ശാസ്ത്രവും. 120
29 മുതൽ 31 വരെ നിർദ്ദിഷ്‌ടഗുണ്ഡിയ ജലവൈദ്യുത പദ്ധതിപ്രദേശം സന്ദർശിച്ചു.
ന്ധത്തിന്റെയും, ലവംഗത്തിന്റെയും ഗന്ധത്തോടു യുക്തം. ജാതീഫലം - ജാതിക്ക, ലവംഗം -
ചരിത്രത്തിന്റെ ഗതിനിർണ്ണയിക്കുന്നതെന്ന് മാർക്സിസ്റ്റ് ചരിത്രരചന അവകാശപ്പെടുന്നു.
തേ വിപതിഷ്യതീതി 1. 10. 10 ഏവമേവ പ്രതിഹർതാരമുവാച പ്രതിഹർതര്യാ ദേവതാ
ഉള്ളതു തന്നെയായിരിക്കും [ 3. 401/ കാണുക. എന്നിരുന്നാലും എന്നോ ഉപയോഗിക്കുക. ഒരു
ദൈത്യസൈന്യാർണ്ണവം നിസ്തരിപ്പാനഹം നൽത്തറിക്കൊത്തിടും ശക്രാത്മജ) നിവാതകവചൻ: അംബുധി
വ്യായാമമണ്ഡലം 55 പാദൈസ്തു ഭൂമിസംയുക്തൈഃ സൂചീവിദ്ധൈസ്തഥൈവ ച ഏഡകാക്രീഡിതൈശ്ചൈവ
അവയുടെ താടിയുടെയും പല്ലുകളുടെയും ഘടനയിൽ നിന്നു ഭക്ഷണം കഴിക്കുന്നതിന് അവ
പട്ടണമായി പ്രശോഭിക്കുന്ന 'നാഗരുകോവിൽ' എന്ന സ്ഥലത്തു വന്നപ്പോൾ വഴിക്കടുത്തുള്ള
ഗോതമ്പിന്റെ ആഹാരം തുടർച്ചയായി മൂന്നു ദിവസം വയറുനിറയെ കഴിച്ചിട്ടില്ല. (ബുഖാരി. 7.
ശേഷിച്ചിരിപ്പുണ്ടോ? ആയിശ(റ) പറഞ്ഞു. അതിന്റെ തോളല്ലാതെ മറ്റൊന്നും മിച്ചമില്ല.
പരിഷ്ക്കരണവാദത്തിന്റെ വിശാലചക്രവാളംതന്നെയായിരുന്നു അതിന്റേതും സാഹിത്യവും
തന്നിൽ ശരഭംഗനെന്നുണ്ടൊരുമുനി ചെന്നുകണ്ടീടുകയെന്നാലതുകൊണ്ടു വന്നിടും നിങ്ങൾക്കു
ശിവരാത്രിവ്രതത്തെ പ്രത്യേക ശ്രദ്ധയോടും, ശിവപുരാണപ്രോക്തമായുള്ള മാർഗ്ഗത്തെ
സ്വസ്തികഗോമുഖപദ്മവീരസിംഹഭദ്രമുക്തമയൂരാഖ്യാന്യാസനാന്യഷ്ടൗ. സ്വസ്തികം
ദിവസക്കാലം പാരീസ് കമ്മ്യൂൺ നിലനിന്നു. -6. 4 ഇവിടെ പരാമർശിക്കുന്ന പതിപ്പു്
ബ്രഹ്മതത്ത്വാർത്ഥത്തെ വെളിപ്പെടുത്തു വാൻ വേണ്ടിയുള്ളതാകുന്നു. പ്രതിപാദ്യമായ വിഷയം
ചൊൽവകുപ്പിലും ഒരർത്ഥം കാട്ടുന്ന പല ചൊൽവകുപ്പിലും ചേർന്നിരിക്കയാൽ തിരിച്ചൊല്ലിന്റെ
നക്കാപ്പിച്ചാ, വല്ല കരുവാട്ടുത്തല ചുട്ടെങ്കിലും അടിക്കണമെന്ന്. വൃദ്ധയുടെ മനസ്സ്
വിജാനാതി മത്വൈവ വിജാനാതി മതിസ്ത്വേവ വിജിജ്ഞാസിതവ്യേതി മതിം ഭഗവോ വിജിജ്ഞാസ ഇതി 7.
സമനുവർതന്തേ യഥാ ഭാവാ യുഗേ യുഗേ ബലവർഷ്മ പ്രഭാവാ ഹി പ്രഹീയന്ത്യ് ഉദ്ഭവന്തി ച 8 തദ്
ഉപേക്ഷിച്ചതുകളായിരിക്കാം. വസ്ത്രങ്ങളുടെ സ്ഥിതി ഇപ്രകാരമാണെങ്കിലും, അതുകളെ
ബാഹ്യചിന്താ ന കർതവ്യാ തഥൈവാന്തരചിന്തികാ. സർവചിന്താം സമുത്സൃജ്യ സ്വസ്ഥോ ഭവ സദാ
പാദമഥൈകസ്മിന്വിന്യസ്യോരുണി സംസ്ഥിതഃ. ഇതരസ്മിംസ്തഥാ ചോരൂം വീരാസനമുദീരിതം 4
സൈമൺ രചിച്ച കീർത്തനങ്ങൾ വർഗ്ഗം:സമ്പൂർണ്ണ ഗാനങ്ങൾ ക്രിസ്തുവിൻ നാമത്തെ സ്തുതിക്ക
ഞ്ജ8 ദേവീമാനസപൂജാ സ്തോത്രം സവൗീരാഞ്ജനമിദമംബ!ചക്ഷുഷോസ്തേ വിന്യസ്തം കനകശലാകയാമയാ യൽ
അഭ്യാശോ ഹ യത്തേ കപൂയാം യോനിമാപദ്യേരഞ്ശ്വയോനിം വാ സൂകരയോനിം വാ ചണ്ഡാലയോനിം വാ 5.
ആരുതാൻ പ്രബുദ്ധനായ്ത്തീരാത്തോൻ ജഗത്തിങ്കൽ താൾ:ഭക്തിദീപിക. 23
ജാതിയിൽ കൂട്ടുകയല്ലെ താൾ: 1917. 140 തെറ്റുതിരുത്തൽ വായന നടന്നിട്ടില്ലാത്തവ */ '
വേദാന്നാനുഭവസ്യശാനാഥ മേ വിജ്ഞാസ്യസീതി 6. 7. 3 സ ഹശാഥ ഹൈനമുപസസാദ തം ഹ യത്കിഞ്ച
അവയിൽ ചില പ്രത്യേകപുസ്തകങ്ങളെക്കുറിച്ചുമാത്രമെ ഇവിടെ പറയുന്നുള്ളൂ. അതുകൊണ്ട് ഈ
ഗ്രന്ഥശാലയിൽ നിന്നുള്ള ഇ-പുസ്തകം വായിക്കാൻ വിവിധ സ്മാർട്ട് ഫോണുകളിൽ ചെയ്യേണ്ട
പ്രവേശിക്കും. അപ്പോൾ നരകക്കാർ എന്ന് സ്വർഗ്ഗവാസികൾ അവരെ വിളിക്കും. (ബുഖാരി. 8. 76.
പറയപ്പെട്ടതായ ചിത്രമെഴുത്തിൽ തന്നാൽ പ്രോത്സാഹിക്കപ്പെട്ട യുവാക്കന്മാർ
പോലെ ഏതാനും അവയവങ്ങളിൽ രൂപണം അർത്ഥസിദ്ധമായിരുന്നാൽ ഏകദേശവിവർത്തി എന്നു്
യത്കിഞ്ച പൃഥിവീ ചാഗ്നിശ്ചാധിതിഷ്ഠതസ്തത്തൃപ്യതി തസ്യാനു തൃപ്തിം തൃപ്യതി പ്രജയാ
പുരുഷോത്തമ 114 തതസ് തസ്യൈവ ശാഖായാം ന്യഗ്രോഘസ്യ വിശാം പതേ ആസ്തേ മനുജശാർദൂല
ഇവയും, മറ്റു ശാസ്ത്രാപകരണങ്ങളും നാൾക്കുനാൾ പരിഷ്രിക്കപ്പെടാൻ ഇടയുണ്ടല്ലൊ. ചില
തദ്ബ്രഹ്മ. യസ്മാദേവം തസ്മാത് 10 മൂർതിതാരകാമൂർതിതാരകയോശ്ച
20% 26 47 19 ഇടത്തുംവലത്തും താൾ:ശ്രീമൂലരാജവിജയം. സാധൂകരിച്ചവ */
തരണംചെയ്ത വനതടിനികളിലെ ജലം കലങ്ങിച്ചുവന്നു പ്രവഹിച്ചുകൊണ്ടിരുന്നു എങ്കിലും ആ
തമ്മിലുള്ള ഭേദം, ഇവ അഞ്ചുംകൂടി അനാദിയാകുന്നു. എന്നാൽ ബ്രഹ്മസാക്ഷാത് ക്കാരത്തിൽ,
ഇരിക്കുന്നതു കൊള്ളാം. പദങ്ങൾ ചുരുങ്ങിയ വാക്യത്തിനു് പിരിമുറുകിയ ചരടുപോലെ ബലം
പിൻകുടുംമ ഒന്നൊരണ്ടൊ ആൾ പിടിച്ചതൂങ്ങും. ചെകിടത്ത അടിക്കും. മുൻപറഞ്ഞ ദൂതനേകൊണ്ട
യത്പ്രാണോ ബ്രഹ്മ കം ച തു ഖം ച ന വിജാനാമീതി തേ ഹോചുര്യദ്വാവ കം തദേവ ഖം യദേവ ഖം
നമ്പി ആലത്തൂർ നമ്പി രാമപുരത്തു വാര്യർ രാമപുരത്തു വാര്യർ വർഗ്ഗം:ഐതിഹ്യമാല
അപ്പൻ തമ്പുരാൻ ഗദ്യം ഗദ്യമാലിക (3 ഭാഗങ്ങൾ) മംഗളമാല (5 ഭാഗങ്ങൾ) സംഘക്കളി
തേച്ച് കുളിക്കണം. താലികെട്ടുക ഭൎത്താവാണ്. ജാതിയിലെ തലവനായ മൂപ്പൻ എന്ന പറയുന്നവൻ
കോയ്മകൾ സ്ഥാപിച്ചു അതിൽ പ്രധാനമായത് ചരിത്ര പ്രസിദ്ധമായ വിജയനഗരമാഹാരാജ്യമാണ്.
പതിപ്പ് ഫലകം: ഫലകം: എന്നതിൽ നിന്ന് ഒരു പതിപ്പ് ഫലകം: ഫലകം: എന്നതിൽ നിന്ന് ഒരു
സൗമ്യാ സപ്തമീ ഭൂമികാ ഭവേത് 85 തുര്യാതീതാ തു യാവസ്ഥാ പരാ നിർവാണരൂപിണീ. സപ്തമീ സാ
വ്യാമോഹം അഗമച് ഛോകവ്യാകുലിതേന്ദ്രിയഃ 108 മുഹ്യമാനോ ഽബ്രവീച് ചാപി മുഹൂർതം തിഷ്ഠ
ദൈവസാമീപ്യം പ്രാപിക്കാൻ ശ്രദ്ധിക്കുക. നിങ്ങൾ മനസ്സിലാക്കുക. തീർച്ചയായും
തിഷ്ഠത്യനിമിഷദൃഷ്ടിർദീർഘം നിഃശ്വസിതി ഗച്ഛതി ധ്യാനം രോദിതി വിഹാരകാലേ നാട്യമിദം
സ്വാദ്ധ്വ്യായപാഠത്തിലത്യന്തനിഷ്ഠനായ് നിത്യംഗുരുപരിചർയ്യാനിരതനായ്.