വയോധികയായ പ്രിയമാതാവിനെ അവർതന്നെ വണ്ടിയിൽ ഇരുത്തി വണ്ടി വലിച്ചുകൊണ്ടുപോയി.
സംവ്യത്തവാർത്താമ്യതം ഉലാസത്തോടു കൊമ്ടുവന്ന സുമനാ സോമത്തിനെലാം കൊടു
( ഒരു പ്രദേശത്തിന്റെ ജൈവവൈവിദ്ധ്യം (വകുപ്പ്‌ ആ പ്രദേശത്തിന്റെ പരമാവധി അനുവദനീയമായ
വരാഹമിഹിരൻ നൽകിയ തത്സമയ പരിഭാഷയമാണ് ദ്രേക്കാണം. ബാബിലോണിയർ എന്താണതിനെ
താൾ: 90 താൾ: 91 താൾ: 92 താൾ: 93 നിജാനന്ദവിലാസം (ചട്ടമ്പിസ്വാമികൾ)/ആവരണവിക്ഷേപ
അവിടെതാമസിക്കുന്ന അവസരത്തിൽ ഒരു ദിവസം അവളെമാത്രം വീട്ടിൽ താമസിപ്പിച്ചുംവെച്ചു്
ത്വതിതരസുലഭം തേന ചാതീന്ദ്രിയം ഹി സുഖം സർവോത്തമം സ്യാത്
2014 താൾ: 24 1926. 91 താൾ: 1871. 18 2014 താൾ: 1896. 168 2014 താൾ: 1896. 171 2014
ഏവാന്യഥാ ഭവേത് 1 അഹമേവ പരം ബ്രഹ്മ നിശ്ചിതം ചിത്ത ചിന്ത്യതാം
നിർത്തലാക്കി. ഇതൊന്നുകൊണ്ടും അവിടെ അമ്മന്റെ ചൈതന്യവും ശക്തിയും കുറഞ്ഞിട്ടില്ല. അവ
കൈവല്യോപനിഷത്ത് ഉപനിഷത്തുകൾ/ക്ഷുരികോപനിഷദ് ക്ഷുരികോപനിഷത്ത്" / എന്ന ഉപയോക്താവ്
ഉത്തമപുരുഷനിൽ മൂന്നു പേർ ചെയ്യുന്നതിനെ കുറിക്കുമ്പോൾ ല് എന്നതിൻ മസ് എന്നു ഓരാദേശം
ചട്ടമ്പിസ്വാമികൾ ഈ കൃതി തമിഴി ലാണ് രചിച്ചതെന്നും, സ്വാമികളുടെ ശിഷ്യനും
വ്യവസ്ഥകൾ ഫലപ്രദമായി നടപ്പാക്കാനാവശ്യമായ നടപടികൾ നിർദ്ദേശിക്കുക. ബന്ധപ്പെട്ട
മാക്രാന്ത പൊസിലോ ന്യൂറോൺ ഇൻഡിക്കം + പലാക്കിയം എലിപ്‌റ്റിക്കം - ഹോപിയ പൊങ്ങ
- 1868 താൾ: 1902. 12 കഞ്ഞിവാര്ൎത്തുണ്ണുന്നതു നെഞ്ഞറിയും- 31 അടക്കമില്ലപ്പെണ്ടി
തേഷു ദലേഷു വാസുദേവദ്വാദശാക്ഷരോ മന്ത്രഃ. തദ്ദലകപോലേഷ്വാദിക്ഷാന്താൻ. തതോ വൃത്തം.
പി.ഇ. ഉഷ തന്നെക്കുറിച്ച് പ്രകാശൻ എന്ന സഹപ്രവർത്തകൻ അപവാദം
അരയസമുദായനേതാവായിരുന്ന പി.കെ. ഡീവറിന്റെ ജീവചരിത്രത്തിൽ 1920കളിൽ നടന്ന ഇത്തരമൊരു
128 ഫലകം: ഫലകം: എന്നതിൽ നിന്ന് 53 പതിപ്പുകൾ 3 = 6 = 12 = 100 = 10 = 14 = 3 = 6 =
രാഘവൻ തന്നുടെ ധർമ്മപത്നിഹൃദയാകുന്നു നിർണ്ണയം ബന്ധുക്കളെപ്പിരിഞ്ഞുള്ളൊരു ഞാനിതാ
വാചാമഗോചരനിരാകാരപരബ്രഹ്മസ്വരൂപോഽഹമേവ. മദ്വ്യതിരിക്തമണുമാത്രം ന വിദ്യതേ. ഇത്യേവം
1914. 65 തെറ്റുതിരുത്തൽ വായന കഴിഞ്ഞവ */ 2014 താൾ: 1914. 66 തെറ്റുതിരുത്തൽ വായന
ആകട്ടെ ഇപ്രകാരം മേലും കീഴും രണ്ടു പങ്കുകളോടുകൂടിയതായിരിക്കും. രണ്ടു പങ്കുകളും
വന്ദിച്ചു വേഗേന ലങ്കാപുരി വിട്ടു നിർഗ്ഗമിച്ചീടിനാർ ശങ്കാസഹിതരായ്ത്തന്നേസകലരും
നിരുദ്ധാശേഷാസ്ത്രേ മുമുഹുഷി തവാസ്ത്രേണ ഗിരിശേ ദ്രുതാ ഭൂതാ ഭീതാഃ പ്രമഥകുലവീരാഃ
മാറ്റിക്കയും, ബ്രിട്ടീഷ് പാർലമെന്റ് സഭയിൽ പത്രപ്രതിനിധികൾക്കു പ്രവേശം
ഈ കഥയിൽ പ്രവേശിക്കുന്നത്. കടം വാങ്ങിയും വ്യവഹരിക്കേണമെന്നുള്ള നിശ്ചയം ദൃഢമായി
എന്നതുതന്നെ സന്തോഷകരമാണ്‌. മെച്ചപ്പെട്ട പരിസ്ഥിതിക്കുള്ള അവകാശം ഭരണഘടനാ 21-ാം
ഏവമേതാസു നാഡീഷു ധരന്തി ദശവായവഃ. ഏവം നാഡീഗതിം വായുഗതിം ജ്ഞാത്വാ വിചക്ഷണഃ 31
ക്രി.മു. 120ൽ ഹിപ്പാർക്കസ് എന്ന ഗ്രീക്കു ശാസ്ത്രജ്ഞനാണ് ആദ്യമായി ഈ ആശയം
ഖാലിദ് ആണ്. സൈന്യ നേതൃത്വം വഹിക്കാൻ അദ്ദേഹത്തെ അധികാരപ്പെടുത്തിയിരുന്നില്ല.
(ബുഖാരി. 6. 61. 522) 4) അൽഖമ:(റ) പറയുന്നു: ഞങ്ങൾ സിറിയയിലെ ഹിംസിലായിരുന്നു.
ഒരിക്കലുമില്ലെന്നുറയ്ക്കമന്നവ നൃപവരൻ നിന്റെ മകനാം രാമന- ങ്ങുപായങ്ങൾ
വിഷസമ്പൃക്തഭക്തവത് 651 ഭോഗകാലേ പി ഭോഗാന്തേ ദുഃഖമേവ പ്രയച്ഛതി സുഖമുച്ചാവചത്വേന
2014 താൾ: 1772. 29 വർഗ്ഗം:താളുകൾ - 1772 താൾ: 1907. 79 തെറ്റുതിരുത്തൽ വായന കഴിഞ്ഞവ
799) 11) അനസ്(റ) പറയുന്നു: ഒരു മനുഷ്യൻ വന്ന് നബി(സ)യോട് പറഞ്ഞു. ഒരു സ്ത്രീയെ ഞാൻ
താൽപ്പര്യവും സ്ത്രീകളുടെ സംരക്ഷണവും മേൽഗതിയും ഉറപ്പാക്കുന്ന നിയമങ്ങൾ
പൂർണമനോവിലയാഭാവേന ദൃശ്യമാനജ്യോതിഷഃ പ്രത്യഗാത്മസ്വരൂപത്വനിർണയഃ ഇദം ജ്യോതിഃ
അവശിഷ്‌ടങ്ങളും ഈ പ്രദേശത്തായിരിക്കും അടിഞ്ഞുകൂടുന്നത്‌. ഇത്തരം
മുതൽ ഉണ്ടായിട്ടില്ലാത്ത വലിപ്പത്തിൽ മഹാ ഭൂകമ്പം ജനിക്കയും ചെയ്തു. 2014 991
താൾ: 1871. 6 എന്നതിൽ നിന്ന് ഒരു പതിപ്പ് താൾ: 1871. സാധൂകരിച്ചവ */ താൾ: 1871.
അറുപതോളമായിരിക്കുന്നു. ഇനിയും സന്തതി ഉണ്ടാകാത്തപക്ഷം പിന്നെ അതിനെക്കുറിച്ച്
ദ്വിജേഭ്യശ്ച ഘൃതൗദനം ശൂദ്രസ്തംഭേ വിധിഃ കാര്യഃ സമ്യക്പൂർവോത്തരാശ്രയേ 49 നീലപ്രായം
 അനസ്(റ) നിവേദനം: ഖബറിന്റെ അടുത്തിരുന്നുകൊണ്ട് കരയുന്ന ഒരൂ സ്ത്രീയുടെ
കരഞ്ഞുകൊണ്ട് അവിടെനിന്ന് ഇറങ്ങി പ്പോയി. ഉടനെ ഒരു തോണിയിൽക്കയറി കായലിനു
അന്വശാസത് സ ധർമജ്ഞഃ പുത്രവദ് ഭരതർഷഭാൻ 24 തേ ഽനുജ്ഞാതാ മഹാത്മാനഃ പ്രയയുർ ദിശം
മടിയിൽവച്ചു. ഇതിനെത്തുടർന്ന് കിടങ്ങൂർമുണ്ടൻ എന്നയാൾ ബ്ലൗസഴിച്ച പെണ്ണുങ്ങളുടെ
വന്യമൃഗങ്ങൾക്കിടയിലായി ജീവിക്കുന്ന ഞങ്ങൾ ഈ അടുത്ത കാലത്തായി കുരങ്ങ്‌, ആന,
30 12ഉപയോക്താവ്: ബാലു ഉപയോക്താവിന്റെ സംവാദം: സംവാദം 11:44, 15 ഫെബ്രുവരി 2013 (
പ്രയോഗിച്ചും, വെളിപ്പെടുത്തണം. ലേഖനമെഴുതുന്നവർ സാഹിത്യകാരശ്രേഷ്ഠന്മാരാണെന്ന
നമ്പൂതിരിപ്പാട് 4 വടക്കനിയേടത്തു കിരാങ്ങാട്ടുമനയ്ക്കൽ ശ്രീധരൻ അനുജൻ
*/ '26 ക-മ:-സന്യാസിമാർക്ക് ഇഹലോകചിന്ത വിധിച്ചിട്ടി താൾ 28019 താൾ: 1935. 351
പള്ളിയിലേയ്ക്ക് പുറപ്പെട്ട് ഞായറാഴ്ച കാലത്തെ അവിടെ എത്തി. കുർബാനയ്ക്ക് തിരുമനസു
കടിജാനുവിവർതാച്ച ഭുജംഗത്രാസിതം ഭവേത് കുഞ്ചിതം പാദമുത്ക്ഷിപ്യ ജനുസ്തനസമം ന്യസേത്
പതിപ്പുകൾ 39990 1 38 1.25 അത്‌ തരുന്ന ഫലം വിഭാഗം:ഉപയോക്തൃപെട്ടികൾ
പറയുന്നു: നബി(സ) അരുളി: ഹിജാസിൽ നിന്ന് ഒരു അഗ്നിപുറപ്പെട്ടു. ബുസ്റാ: യിലെ
മതിനിർമലാനന്തകോടിരവിപ്രകാശൈകസ്ഫുലിംഗമന- ന്തോപനിഷദർഥസ്വരൂപമഖിലപ്രമാണാതീതം
അവയുടെ സ്വന്തരൂപത്തിൽ ചിന്തിക്കുകയും ചെയ്യുമ്പോൾ അതിനു 'നിർവിചാരം'
ഉപയോഗിക്കുന്ന ചുളുക്കുള്ള കടലാസ്സ്. (7) വീഞ്ഞുകുപ്പി പൊതിയുന്ന വൈക്കോൽ ഉറ. (8)
തതഃ കുര്യാത്കാവ്യപ്രഖ്യാപനാശ്രയാം ഉദ്ധാത്യകാദി കർതവ്യം കാവ്യോപക്ഷേപണാശ്ര്യം 166
എന്നു നിശ്ചയിക്കുകയും അന്നുതന്നെ അവിടെ ശാന്തിക്ക് ഒരിളയതിനെ നിയമിക്കുകയും
ആനന്ദം പ്രയന്ത്യഭിസംവിശന്തീതി സൈഷാ ഭാർഗവീ വാരുണീ വിദ്യാ പരമേ വ്യോമൻപ്രതിഷ്ഠിതാ സ
പുരാതനകാലങ്ങളിലെ അനുഭവങ്ങളെ ആസ്പദമാക്കി മാത്രം ഉണ്ടായിട്ടുള്ളതല്ലെന്നും, ആ