മാർഗ്ഗത്തിൽ (ജിഹാദിന്ന്) പുറപ്പെട്ടവന് അല്ലാഹു നന്മ ചെയ്യുമെന്ന് ഏറ്റിട്ടുണ്ട്.
തലക്കെട്ടു മാറ്റം: ഒരു സന്ധ്യ (കുമാരനാശാൻ വനമാല/ഒരു സന്ധ്യ തിരിച്ചുവിടുക
കൈകളുപയോഗിച്ചിരുന്നു എന്നു വ്യക്തമാണ്. അങ്ങനെ കൈകൾ സഞ്ചാരകൃത്യത്തിൽ നിന്നു
പറക്കുന്നതിനെ കണ്ട് കോഴികൾ കൊക്കരൽ ഇടുമ്പോൾ അടയാളത്തിനെ അറിഞ്ഞ് അതിന്റെ
നിയമങ്ങൾ അവസാനം എന്നു ക്രമപ്പെടുത്തിയ പട്ടിക ആസൂത്രണമായി. ഇനി സൂത്രവാക്യങ്ങൾ
നബി(സ) അരുളി: മറ്റൊരുവന്റെ മൃഗത്തെ അനുവാദമില്ലാതെ ആർക്കും കറക്കുവാൻ പാടില്ല.
ദ്രാവിഡഭാഷതന്നെ സംസ്കൃതം മുതലായ പരിഷ്കൃതഭാഷകളുടെ മൂലഭാഷയെന്നു സിദ്ധിക്കുന്നു. 156
താൾ: 1930. 14 വർഗ്ഗം:താളുകൾ - 1930 താൾ: 1915. 53 കൊടുക്കാൻ താമസിച്ചാൽ ഫലം ഉടനെ
72389] 72164] 71829] 2014- 000998. 23. 28, 29 1.25/ 51428] [ 52029] [ 71157]
ഒരത്യുൽകൃഷ്ടസ്ഥാനത്തിലാണെത്തിയിരിക്കുന്നത്. ബാഹ്യാഭ്യന്തര പരിഷ്കാരങ്ങൾ
ദൃഷ്ടിഭിഃ സമ്പ്രതിഷ്ഠിതാഃ ദൃഷ്ട്യൈവ സ്ഥാപിതോ ഹ്യർഥഃ പശ്ചാദംഗൈർവിഭാവ്യതേ 160 ഏവം
തെളിവുണ്ടാകുന്നതുപോലെ അവർക്കു് ഉത്തമ പുരുഷത്വം തെളിഞ്ഞു വരുന്നതാണു്. ഇങ്ങനെ
സകർമ്മകം, കർമ്മം ചെരാത്ത അകർമ്മകം എന്ന ഭെദം. ഉദാഃ ബാലൻ ഭക്ഷിക്കുന്നു. ഇവിടെ
നിന്നെക്കരങ്ങളാൽ മന്ദഹസിച്ചുകൊണ്ടോ;മനത്താരകൾ! നേരിന്റെ നാട്ടിൽനിന്നേകയായ് വന്നവ-
ശാഖാദർശനമാർഗഃ ശാഖാഭിനയഃ സ വിജ്ഞേയഃ 47 നാട്യായിതമുപചാരൈര്യഃ ക്രിയതേ ഭിനയസൂചയാ
ചൈക്രീഡിതാദ്യൈഃ ശബ്ദൈസ്തു കാവ്യബന്ധാ ഭവന്തി യേ വേശ്യാ ഇവ ന തേ ഭാന്തി
ചെയ്യുന്നില്ല. പള്ളിപ്പുറത്തുകാവിൽ ഭഗവതിയുടെ മാഹാത്മ്യത്തെക്കുറിച്ച് ഇനിയും
കലികളിലും,ഭക്തന്മാരിലും അദ്വിതീയനായ ആ മഹാത്മാവിന്റെ ജീവചരിത്രവും, അദ്ദേഹം
കൊണ്ടുവരപ്പെട്ട കേശവന്റെ ശബ്ദമാണ് ഇന്നു വെളുപ്പാൻകാലത്ത് ഇവിടെ കേൾക്കപ്പെട്ടത്.
ഫലകം: 0 0 ! 0 1000 100031 110031 130031 140031 150031= 1 2008 1 2004 20082004 1
രചനകൾ ഒഴിവാക്കാനായി നിർദ്ദേശിക്കപ്പെട്ടിരിക്കുകയാണ്‌ 0;
 ഭാഗനാത്മൈകഭാർയ്യാരതാകാംക്ഷകൻ എന്നറിഞ്ഞീടുകീഹംസദ്ധ വജന്നൊത്ത
വൈശ്വാനരമധ്യേതി തം ഹന്താഭ്യാഗച്ഛാമേതി തം ഹാഭ്യാജഗ്മുഃ 5. 11. 2 സ ഹ സമ്പാദയാഞ്ചകാര
അധ്യായം107 അധ്യായം107 അധ്യായം109 അധ്യായം109 മഹാഭാരതം മൂലം/വനപർവം/അധ്യായം109
താതന്റെ വലമമരുന്ന പാടും ഞാൻ യേശുവിന്നായ് പാടും പരമരക്ഷകനേശുവേ യേശുവിൻ ജനനത്തെ നാം
മന്ത്രാർണൈരംഗകൽപനാ 55 ശ്രീരാമേതി പദം ചോക്ത്വാ ജയരാമ തതഃ പരം. ജയദ്വയം
അനുഷ്ഠാനങ്ങളുമായി അതു് മാറിക്കഴിഞ്ഞിരുന്നു. ഈജിപ്തിലും സിറിയയിലും ഏഷ്യാ മൈനറിലും
തീരുന്നതുമല്ലാതെ ചിലപ്പോൾ പ്പൊരുൾ പിണങ്ങിത്തിരിയുന്നതിന്നും കൂടെ
തസ്മാദകാരേണ പരമം ബ്രഹ്മാന്വിഷ്യ മകാരേണ മന ആദ്യവിതാരം മന ആദിസാക്ഷിണ- മന്വിച്ഛേത്സ
ർഗ്ഗവും വന്നിട്ടു പ്രാഞ്ചഃ എന്നു സിദ്ധിക്കുന്നു. ദ്വിതീയൈകവച നത്തിങ്കൽ നുമാഗമം
സിദ്ധിക്കും. േഎന്നത് ചതുർത്ഥിയുടെ ഏകവചനപ്രത്യയമാകയാൽ രാമ+ േഎന്നിരി ക്കുമ്പോൾ
ചില അടിസ്ഥാനങ്ങളുണ്ട്. ബ്രാഹ്മണർ ഈശ്വരസേവചെയ്തു തൃക്കാരിയൂർ താമസിച്ചിരുന്നപ്പോൾ
കടന്ന നേരത്തു മുള്ളുകൾ വിമിപ്പൊരു മുള്ളരനെപ്പോൽ പാതം പണക്കൊതിയിലിക്ഷീതി
(വായിക്കുന്നവൻ ചിന്തിച്ചുകൊൾക!) അന്നു യഫ്രദ്യയിലുള്ളവർ മലകളിലേക്ക് മണ്ടിപോക. ൧൫
കണ്ണികൾ വർഗ്ഗം:പി.വി. തൊമ്മി രചിച്ച കീർത്തനങ്ങൾ വർഗ്ഗം:സമ്പൂർണ്ണ ഗാനങ്ങൾ യേശു
ചോദിച്ചു. അയാളുടെ ശബ്ദവും നിലകളും എല്ലാം വികൃത മായിരുന്നു. 'ഞാൻ
പരിസ്ഥിതി വിദഗ്ദ സമിതി റിപ്പോർട്ട് റിപ്പോർട്ട് മാധവ് ഗാഡ്ഗിൽ 2013 കേരള
ആശ്ചര്യോ വക്താ കുശലോഽസ്യ ലബ്ധാ ആശ്ചര്യോ ജ്ഞാതാ കുശലാനുശിഷ്ടഃ 7 ന നരേണാവരേണ
കേട്ടിട്ടുള്ള കഥകളെയും സംയോജിപ്പിച്ചു വിചിന്തനംചെയ്തപ്പോൾ- ഹാ! ജഹജ്ജയി എന്ന
വാഗിന്ദ്രിയദ്വാരാ വചനങ്ങളെയും, പാണീന്ദ്രിയദ്വാരാ ദാനങ്ങളെയും, പാദേന്ദ്രിയദ്വാരാ
ദൈവസങ്കൽപംതന്നെ എന്ന് അവർ പരമാനന്ദത്തെ കൈക്കൊണ്ടു. സ്വാമി കൽപിച്ചാൽ ആ നിധി
തീർത്ഥങ്ങളെല്ലാറ്റിലുംവെച്ചതിവേല- മുത്തമയാണെന്നറിഞ്ഞീടതുപോലെ.
ചെയ്യുന്നു. (അതിനാൽ പാടില്ല (ബുഖാരി. 3. 31. 214) 67) ആയിശ(റ)യും ഇബ്നുഉമർ(റ)യും
ഉപാഗതം തത്ത്വതഃ കാമസന്തപ്തം ചിന്തയാം ആസ ഭാമിനീ 52 അഹം സപ്തർഷിപത്നീനാം കൃത്വാ
പേർ പറയരുത്. യഥാർത്ഥത്തിൽ സത്യവിശ്വാസിയുടെ മനസ്സാണ് കറം (ഔദാര്യം (ബുഖാരി. 8. 73.
വിഘ്നൈ- ർവതൈർഹതാ പർണചയാ ഇവ ദ്രുമാത് 139 തിതിക്ഷയാ തപോദാനം യജ്ഞസ്തീർഥം വ്രതം
പരിസ്ഥിതി സംരക്ഷണ പ്രശ്‌നങ്ങളിൽ കേന്ദ്ര പരിസ്ഥിതി-വനം മന്ത്രാലയം ആവശ്യപ്പെടുന്ന
സ്വന്തം കൃതിയെന്നുള്ള നിഗമനത്തിൽ നീക്കം ചെയ്യുന്നു ഉപയോക്താവ്: അരയശ്ശേരിൽ
(സഫഫ്‌)പൂർത്തിയാക്കുക: പിന്നീട്‌, അതിനടുത്ത നിര; തികയാതെവരുന്നതേതോ, അത്‌
1918. 211 1/ 2/ താൾ: 1918. 213 1/ താൾ: 2 241 തെറ്റുതിരുത്തൽ വായന
മാർഗ്ഗമുള്ളത്? അകാരത്തിന്റെ മഹിമ എത്രമാത്രമുണ്ടെന്നുള്ളത് താഴെക്കാണിക്കുന്ന
ഗച്ഛന്തി വിമാനേഷ്വ് അപ്സരോഗണാഃ 57 തദ് ദൃഷ്ട്വാ മഹദ് ആശ്ചര്യം പ്രത്യക്ഷം
കൂടിക്കണ്ടാലുടനഴലൊഴിച്ചീടുവേനെന്നുചൊല്ലി- ത്തേടിക്കണ്ടൊരുരഗപതിയോടൂചിവാൻ
വിഭ്രഷ്ടസങ്കേതം സുവ്യക്തകരണാന്വിതം പ്രാകൃതൈർവചനൈര്യുക്തം വിദുഃ സൈന്ധവകം ബുധാഃ 131
നെടുമ്പുരകൾ പണിതുടങ്ങി, മേച്ചിൽ കഴിഞ്ഞിരുന്നു. ശത്രുവഞ്ചികൾ തന്റെ പീരങ്കികളുടെയും
പ്രിയവ്രതന്റെ ചരിത്രം ശ്രീമഹാഭാഗവതം/പഞ്ചമസ്കന്ധം/ഭരതചരിത്രം ഭരതചരിത്രം
പുത്തൻ ചെടികളിൽ പലതും പ്രാദേശിക ജൈവആവാസവ്യവ സ്ഥയ്‌ക്ക്‌ ഹാനികരമായിരുന്നു ഇതൊക്കെ
ശാദ്വലാനാം സമന്തതഃ സാരസാഃ പ്രതിദൃശ്യന്തേ ശൈലപ്രസ്രവണേഷ്വ് അപി 76 വദന്തി മധുരാ
ധ്വജാനന്തശാർമ്ഗഗദാശംഖനന്ദകമന്ത്രാഃ പ്രണവാദി- നമഓന്താശ്ചതുർഥ്യന്താഃ ക്രമേണ. ഓം
പ്രതിഷ്ഠാഗേഹവും ഇടഞ്ഞുതകർന്നു ബാഹ്യഭൂമിയുടെ നിരപ്പിൽ കിടക്കുന്നു. ആ ക്ഷേത്രത്തെ
മുടക്കംവിട്ടതന്യർക്കോ-മൂന്നും മൂന്നുവിധത്തിലാം ഗോവിന്റെപാൽ
കിം പ്രാപ്തശ്ചാരഃപക്ഷിവത്ഖേ തതഃ കിം യേനസ്വാത്മാ നൈവ സാക്ഷാത്കൃതോ ഭൂത് 10
ശങ്കരാചാര്യർ ഈ സ്തോത്രം രചിച്ചിട്ടുള്ളത്. ആസനം, സ്വാഗതം, പാദ്യം, അർഘ്യം, ആചമനീയം,
ഉപദേശിക്കുവാൻ അടിയൻ ധൈര്യപ്പെടുന്നു. 'സ്വദേശാഭിമാനി'യുടെ ആക്രമണങ്ങൾ