താൾ: 3 1904. 358 തെറ്റുതിരുത്തൽ വായന നടന്നിട്ടില്ലാത്തവ */
 5 = : 6 = 6 = : ഫലകം:കോമൺസിലേക്കു-മാറ്റുക/ ഫലകം:കോമൺസിലേക്കു-മാറ്റുക/ എന്നതിൽ
01-150 63 02 01-150 64 02 01-150 65 02 01-150 66 02 01-150 67 02 01-150 68 02
പിന്തിപ്പിച്ചുകിട്ടുവാനും (ദീർഘായുസ്സ് ലഭിക്കുവാനും)ആഗ്രഹിക്കുന്നുവെങ്കിൽ അവൻ
ചെയ്യുന്നത്? സ്വാമിദ്രാഹീ! നിന്നോടു ചോദിച്ചാൽ മതിയോ? നിന്റെ ദുഷ്പ്രവൃത്തിക്കുള്ള
കേശവനു കൊടുക്കാനുള്ള പഴക്കുലകൾ, ശർക്കര, നാളികേരം, കരിമ്പ് മുതലായവയെല്ലാം അവിടെ
ചെയ്‌തത്‌. നടപടിക്രമം പുന പരിശോധിക്കാൻ വിദ്യുച്ഛക്തി ബോർഡ്‌സിനോടും നേരത്തെ നൽകിയ
 താൾ:കിരണാവലി. 69 താൾ:കിരണാവലി. 68 താൾ:കിരണാവലി. 67 വരും ണം പോകുമതൊന്നിലല്ലീ
(6)സംഘടിതഭംഗം: ഇ തിൽ പൊട്ടിയ എല്ലിന്റ താൾ 19088 താൾ: 1926. 247 തെറ്റുതിരുത്തൽ
ധനത്തിൽ നിന്ന് നിനക്ക് വല്ലതും നേടാൻ കഴിയുമോ? (മുസ്ലിം) 13)
സമയാസീത്തദനുഗ്രഹേച്ഛയാ 60.4 നിയമാവസിതൗ നിജാംബരം തടസീമന്യവമുച്യ താസ്തദാ
1868 താൾ: 1930. 109 2014 വർഗ്ഗം:താളുകൾ - 1930 താൾ: 1868. 317 വർഗ്ഗം:താളുകൾ - 1868
പ്രത്യുപകാരം ചെയ്തവരായി നന്ദിപൂർവ്വം ഗണിക്കപ്പെടുന്നതാണു്. മറുഭാഷയിൽ
ജനസന്നാഹം, ധനസന്നാഹം, ആയുധസന്നാഹം എന്നിവയെക്കുറിച്ചു ഗൗരവമായുള്ള ശീഘ്രാലോചനകൾ
താൾ: 1922. 53 താൾ: 02 03-150 34 താൾ: 1922. 11 ഫലകം: ാം' താൾ സൃഷ്ടിച്ചിരിക്കുന്നു
 ഇഷ്ടവധദർശനാദ്വാ വിപ്രിയവചനസ്യ സംശ്രവാദ്വാപി ഏഭിർഭാവവിശേഷൈഃ കരുണോ നാമ സംഭവതി 62
കണ്ടതിനും അതിൽ വല്ലതും കണ്ടുകിട്ടും എന്നുവച്ച് അതിനരികെ ചെന്നതു ജറുസാലമ്യരിൽ
മനുഷ്യനോട് ചോദിക്കും. നിങ്ങൾക്ക് ഞാൻ ധനം നൽകിയിരുന്നില്ലേ? അവർ പറയും: അതെ
അങ്ങനെ ഒന്നാമതായി ഉണ്ടാകുന്ന ഭാഷ ശേഷിച്ചവയുടെ മാതൃഭാഷയും ആയിരിക്കും. അപ്പോൾ
റംസാൻ വരെയുമുള്ള പാപങ്ങളെ പൊറുപ്പിക്കുന്നതാകുന്നു. (മുസ്ലിം) 12) ജാബിർ (റ)
1912. 56 2014 താൾ: 1911. 108 2014 താൾ: 1912. 57 നമ്മുടെ ഗവർണ്ണർജനറലും കൌൺസിലുമായി
* പുഴിക്കടവിനടിക്കും ഞാനൊ * നോക്കിനല്ലോണം തടുത്തോളണം * പറഞ്ഞുതിരും മുമ്പെ
ധനുർ ഹസ്താവാപം ച മാരിഷ ചിച്ഛേദ തരസാ യുദ്ധേ തത ഉച്ചുക്രുശുർ ജനാഃ 33 അഥാന്യദ് ധനുർ
പറഞ്ഞു മടങ്ങിപ്പോയി. പണ്ടുണ്ടായിരുന്ന വെള്ളാടു നമ്പൂരിമാർ ചികിത്സ സംബന്ധമായി
അന്തരീക്ഷവുമായി അതിനു പൊരുത്തമുണ്ടോ എന്നെല്ലാമുള്ള പ്രശ്നങ്ങൾ
കാനനേ പുഷ്പഫലങ്ങൾ താൻ കൊണ്ടരാൻ പോയിതോ പുഷ്കരത്തിങ്കലും പോയോനദീതടേ
പ്രവേശിപ്പിക്കാതിരിക്കുകയില്ല. അവൻ അവർക്ക് ചെയ്ത കാരുണ്യത്തിന്റെ ശ്രേഷ്ഠത കാരണം.
ആരാധിക്കുന്ന പല സമുദായപരിഷ്കർത്താക്കളായ മഹാന്മാരും വച്ചുപുലർത്തിയിരുന്നു.
രണ്ടു ഭൂതങ്ങൾ ആ പുകയുടെ പിന്നാലെ ഞങ്ങൾക്കഭിമുഖമായി വരുന്നതും കണ്ടൂ. ഈ ഘോരസത്വത്തെ
അഹങ്കാരധർമ്മങ്ങളായ കർത്തൃത്വം, ഭോക്തൃത്വം, സുഖിത്വം, ദുഃഖിത്വം മുതലായവയെ താൻ
നിശാന്ധകാരത്തോടു സന്ധിച്ചു. മേഘങ്ങൾ വിസർജ്ജിക്കുന്ന വർഷധാരകൾ സാധ്വിയായ തന്റെ
സമ്യക് 8 യത്പ്രീത്യാ പ്രീതിമാത്രം തനുയുവതിതനൂജാർഥമുഖ്യം സ തസ്മാ- ത്പ്രേയാനാത്മാഥ
വെള്ളംപായുന്ന സ്ഥലങ്ങളിൽ ധാരാളം വെള്ളം കിട്ടാത്തതുകൊണ്ടും വെള്ളച്ചാൽ
സ്വപ്നേ മഹീയമാനശ്ചരത്യേഷ ആത്മേതി ഹോവാചൈതദമൃതമഭയമേതദ്ബ്രഹ്മേതി സ ഹ ശാന്തഹൃദയഃ
ഇരിക്ക. ചതുസ്സമം - നാലുകളോടു കൂടിയത്. നാലുകൾ - കസ്തൂരി, ഗോരോചനം, ചന്ദനം, പനിനീർ.
അധ്യായം44 അധ്യായം46 അധ്യായം46 മഹാഭാരതം മൂലം/വനപർവം/അധ്യായം46 വ്യാസൻ അധ്യായം46
താൾ: 82 ബിപിൻ തെറ്റുതിരുത്തൽ വായന കഴിഞ്ഞവ */ അനുശോചനം (കുമാരനാശാൻ)
ബുദ്ധിമുട്ടുണ്ടെന്നു പറഞ്ഞത്. പ്രയോജ നം അറിവുണ്ടാക്കുക മാത്രവും, വിഷയങ്ങളു ടെ
ഇരിക്കുമ്പോൾ ദൈവദൂത ന്മാർ എല്ലാവരും ഇവനെ കുമ്പിടേണ്ടു (സങ്കീ. ൯൭, ൭ എ
സർവം ബ്രൂഹി മേ ഽദ്യ പിതാമഹ 5 ഇത്യ് ഉക്തവതി ധർമജ്ഞേ ധർമരാജേ യുധിഷ്ഠിരേ ഉവാചേദം വചോ
അഴിമതികൾ മാ തൃകാരാജ്യം', 'ധർമ്മരാജ്യം' എന്നും മറ്റുമുള്ള വിശേഷണങ്ങൾകൊണ്ട്
അധ്യായം262 അധ്യായം261 അധ്യായം261 അധ്യായം263 അധ്യായം263 മഹാഭാരതം
ഇരുപത്‌ ദിവസം വരെ ഈ വഴിപാട്‌ കളികൾ തുടങ്ങും. മൂലകഥയിൽ നിന്നുള്ള വ്യതിയാനങ്ങൾ:
പള്ളികളിലും അതു ഇപ്പോഴും പ്രത്യക്ഷമാണ്. എന്നാൽ അധിക ദേവാലയങ്ങളിലും ഇപ്പോൾ ആ
ശക്തിയില്ലാത്തത് അവാചകം. ഇതു പലമാതിരിയിൽ വരാം. ഉദാഹരണം - യാദവർക്കു
പുരയിടം ഒന്നും നീയും നിന്റെ മക്കളും തിരുവിള്ളമാകെ അനുഭവിച്ചു കൊണ്ടു കാലത്താൽ
പ്രകാശിക്കുന്നതു്. വെളുത്തവാവുന്നാൾ സൂര്യൻ അസ്തമിക്കുമ്പോൾ ചന്ദ്രൻ
ഗുപ്തിമിച്ഛൻ സ്വയം വിനിർഗന്തുമശക്ത ഏവ സംസ്തതസ്തദന്തേ മ്രിയതേ ച ലഗ്നഃ 44 യഥാ തഥാ
*/ താൾ: താൾ: 90 തെറ്റുതിരുത്തൽ വായന കഴിഞ്ഞവ */ താൾ: 179 തെറ്റുതിരുത്തൽ വായന
മന്ത്രങ്ങൾക്ക് മൂന്നുപ്രകാരം ആവർത്തനങ്ങൾ അല്ലെങ്കിൽ ജപങ്ങൾ ഉണ്ട്. ഒന്ന് വാചികം
സ്വാനുഭവമെന്ന് പറയുന്നത്. ആ സ്വാനുഭവവും താൻ മാത്രമായിരിക്കുന്നു എന്ന നിശ്ചയവും
(ശക്തിസ്വരൂപിണിയായ ഭവതിയോടു കൂടാത്തവനാണെങ്കിൽ, പരബ്രഹ്മസ്വരൂപനാകുന്ന പക്ഷം) അ
ഉദ്യാനലക്ഷ്മി/പിശാചിന്റെ പിടിയിൽ പിശാചിന്റെ പിടിയിൽ ഉദ്യാനലക്ഷ്മി/ശ്മശാനത്തിൽ
പൃഥിവീ പുച്ഛം പ്രതിഷ്ഠാ തദപ്യേഷ ശ്ലോകോ ഭവതി ഇതി ദ്വിതീയോഽനുവാകഃ പ്രാണം ദേവാ അനു
നാടകം, ഹരികഥ, കഥാപ്രസംഗം തുടങ്ങിയ ഇതരകലകളിൽ പ്രവർത്തിച്ചവരായിരുന്നു. പത്മിനി
ദവാഹൃതാംഗഃ കുടകാചലേ ത്വം താപാന്മമാപാകുരു വാതനാഥ നാരായണീയം/ദശകം ഇരുപത്തിയൊന്ന് ൌ -
അവച്ഛന്നൗ തതഃ കൃഷ്ണൗ ദൃഷ്ട്വാ തത്ര മഹാരഥാഃ വിസ്മയം പരമം ഗത്വാ പ്രൈക്ഷാന്ത കുരവസ്
ദ്യുതിസ്തജ്ജ്ഞൈരുദാഹൃതാ മനശ്ചേഷ്ടാവിനിഷ്പന്നഃ ശ്രമഃ ഖേദ ഉദാഹൃതഃ 92
വാച്യാനി മദനാശ്രയേ 301 പ്രിയേഷു വചനാനീഹ യാനി താനി നിബോധത പ്രിഅയഃ കാന്തോ വിനീതശ്ച
സ്ഥാനങ്ങളിലും വച്ചു മൂലാധാരം, സഹസ്രാരപത്മം, മൂലാധാരത്തിന്റെ നേരെ മുകളിലുള്ള
പ്രൂഫ് വായിക്കുക താൾ: 221 താൾ: 128 ദയവായി പ്രൂഫ് വായിക്കുക സർവ്വാധികാര്യക്കാർ:
സ്വയംഭുവാ 16 പ്രയോഗമംഗഹാരാണാമാചക്ഷ്വ സുരസത്തമ തതസ്തണ്ഡും സമാഹൂയ പ്രോക്തവാൻ
മണിമാല/പണം വർഗ്ഗം:മണിമാല വർഗ്ഗം:1924-ലെ കൃതികൾ 1924-ലെ കൃതികൾ എന്ന വർഗ്ഗം
വൈദിക കർമ്മങ്ങളിൽ ക്ഷണിക്കുന്നത്.ആമന്ത്രണം=കാമചാരാനുജ്ഞ അതായതു ഇഷ്ടം ചെയ്തു