G04 #@! TF.GenerationSoftware,KiCad,Pcbnew,5.1.5+dfsg1-2*
G04 #@! TF.CreationDate,2020-02-11T15:18:20+05:30*
G04 #@! TF.ProjectId,flipmouse,666c6970-6d6f-4757-9365-2e6b69636164,rev?*
G04 #@! TF.SameCoordinates,Original*
G04 #@! TF.FileFunction,Other,Fab,Bot*
%FSLAX46Y46*%
G04 Gerber Fmt 4.6, Leading zero omitted, Abs format (unit mm)*
G04 Created by KiCad (PCBNEW 5.1.5+dfsg1-2) date 2020-02-11 15:18:20*
%MOMM*%
%LPD*%
G04 APERTURE LIST*
%ADD10C,0.150000*%
G04 APERTURE END LIST*
D10*
X93527571Y-65874188D02*
X93575190Y-66017045D01*
X93622809Y-66064664D01*
X93718047Y-66112283D01*
X93860904Y-66112283D01*
X93956142Y-66064664D01*
X94003761Y-66017045D01*
X94051380Y-65921807D01*
X94051380Y-65540855D01*
X93051380Y-65540855D01*
X93051380Y-65874188D01*
X93099000Y-65969426D01*
X93146619Y-66017045D01*
X93241857Y-66064664D01*
X93337095Y-66064664D01*
X93432333Y-66017045D01*
X93479952Y-65969426D01*
X93527571Y-65874188D01*
X93527571Y-65540855D01*
X93384714Y-66969426D02*
X94051380Y-66969426D01*
X93384714Y-66540855D02*
X93908523Y-66540855D01*
X94003761Y-66588474D01*
X94051380Y-66683712D01*
X94051380Y-66826569D01*
X94003761Y-66921807D01*
X93956142Y-66969426D01*
X93384714Y-67350379D02*
X93384714Y-67874188D01*
X94051380Y-67350379D01*
X94051380Y-67874188D01*
X93384714Y-68159902D02*
X93384714Y-68683712D01*
X94051380Y-68159902D01*
X94051380Y-68683712D01*
X94003761Y-69445617D02*
X94051380Y-69350379D01*
X94051380Y-69159902D01*
X94003761Y-69064664D01*
X93908523Y-69017045D01*
X93527571Y-69017045D01*
X93432333Y-69064664D01*
X93384714Y-69159902D01*
X93384714Y-69350379D01*
X93432333Y-69445617D01*
X93527571Y-69493236D01*
X93622809Y-69493236D01*
X93718047Y-69017045D01*
X94051380Y-69921807D02*
X93384714Y-69921807D01*
X93575190Y-69921807D02*
X93479952Y-69969426D01*
X93432333Y-70017045D01*
X93384714Y-70112283D01*
X93384714Y-70207521D01*
X81892857Y-71212380D02*
X82369047Y-71212380D01*
X82369047Y-70212380D01*
X81559523Y-70688571D02*
X81226190Y-70688571D01*
X81083333Y-71212380D02*
X81559523Y-71212380D01*
X81559523Y-70212380D01*
X81083333Y-70212380D01*
X80654761Y-71212380D02*
X80654761Y-70212380D01*
X80416666Y-70212380D01*
X80273809Y-70260000D01*
X80178571Y-70355238D01*
X80130952Y-70450476D01*
X80083333Y-70640952D01*
X80083333Y-70783809D01*
X80130952Y-70974285D01*
X80178571Y-71069523D01*
X80273809Y-71164761D01*
X80416666Y-71212380D01*
X80654761Y-71212380D01*
X74779119Y-41282880D02*
X75112452Y-40806690D01*
X75350547Y-41282880D02*
X75350547Y-40282880D01*
X74969595Y-40282880D01*
X74874357Y-40330500D01*
X74826738Y-40378119D01*
X74779119Y-40473357D01*
X74779119Y-40616214D01*
X74826738Y-40711452D01*
X74874357Y-40759071D01*
X74969595Y-40806690D01*
X75350547Y-40806690D01*
X74398166Y-41235261D02*
X74255309Y-41282880D01*
X74017214Y-41282880D01*
X73921976Y-41235261D01*
X73874357Y-41187642D01*
X73826738Y-41092404D01*
X73826738Y-40997166D01*
X73874357Y-40901928D01*
X73921976Y-40854309D01*
X74017214Y-40806690D01*
X74207690Y-40759071D01*
X74302928Y-40711452D01*
X74350547Y-40663833D01*
X74398166Y-40568595D01*
X74398166Y-40473357D01*
X74350547Y-40378119D01*
X74302928Y-40330500D01*
X74207690Y-40282880D01*
X73969595Y-40282880D01*
X73826738Y-40330500D01*
X73541023Y-40282880D02*
X72969595Y-40282880D01*
X73255309Y-41282880D02*
X73255309Y-40282880D01*
X94590547Y-41282880D02*
X94590547Y-40282880D01*
X94257214Y-40997166D01*
X93923880Y-40282880D01*
X93923880Y-41282880D01*
X93304833Y-41282880D02*
X93400071Y-41235261D01*
X93447690Y-41187642D01*
X93495309Y-41092404D01*
X93495309Y-40806690D01*
X93447690Y-40711452D01*
X93400071Y-40663833D01*
X93304833Y-40616214D01*
X93161976Y-40616214D01*
X93066738Y-40663833D01*
X93019119Y-40711452D01*
X92971500Y-40806690D01*
X92971500Y-41092404D01*
X93019119Y-41187642D01*
X93066738Y-41235261D01*
X93161976Y-41282880D01*
X93304833Y-41282880D01*
X92114357Y-41282880D02*
X92114357Y-40282880D01*
X92114357Y-41235261D02*
X92209595Y-41282880D01*
X92400071Y-41282880D01*
X92495309Y-41235261D01*
X92542928Y-41187642D01*
X92590547Y-41092404D01*
X92590547Y-40806690D01*
X92542928Y-40711452D01*
X92495309Y-40663833D01*
X92400071Y-40616214D01*
X92209595Y-40616214D01*
X92114357Y-40663833D01*
X91257214Y-41235261D02*
X91352452Y-41282880D01*
X91542928Y-41282880D01*
X91638166Y-41235261D01*
X91685785Y-41140023D01*
X91685785Y-40759071D01*
X91638166Y-40663833D01*
X91542928Y-40616214D01*
X91352452Y-40616214D01*
X91257214Y-40663833D01*
X91209595Y-40759071D01*
X91209595Y-40854309D01*
X91685785Y-40949547D01*
X90066738Y-41235261D02*
X89923880Y-41282880D01*
X89685785Y-41282880D01*
X89590547Y-41235261D01*
X89542928Y-41187642D01*
X89495309Y-41092404D01*
X89495309Y-40997166D01*
X89542928Y-40901928D01*
X89590547Y-40854309D01*
X89685785Y-40806690D01*
X89876261Y-40759071D01*
X89971500Y-40711452D01*
X90019119Y-40663833D01*
X90066738Y-40568595D01*
X90066738Y-40473357D01*
X90019119Y-40378119D01*
X89971500Y-40330500D01*
X89876261Y-40282880D01*
X89638166Y-40282880D01*
X89495309Y-40330500D01*
X88685785Y-41235261D02*
X88781023Y-41282880D01*
X88971500Y-41282880D01*
X89066738Y-41235261D01*
X89114357Y-41140023D01*
X89114357Y-40759071D01*
X89066738Y-40663833D01*
X88971500Y-40616214D01*
X88781023Y-40616214D01*
X88685785Y-40663833D01*
X88638166Y-40759071D01*
X88638166Y-40854309D01*
X89114357Y-40949547D01*
X88066738Y-41282880D02*
X88161976Y-41235261D01*
X88209595Y-41140023D01*
X88209595Y-40282880D01*
X87304833Y-41235261D02*
X87400071Y-41282880D01*
X87590547Y-41282880D01*
X87685785Y-41235261D01*
X87733404Y-41140023D01*
X87733404Y-40759071D01*
X87685785Y-40663833D01*
X87590547Y-40616214D01*
X87400071Y-40616214D01*
X87304833Y-40663833D01*
X87257214Y-40759071D01*
X87257214Y-40854309D01*
X87733404Y-40949547D01*
X86400071Y-41235261D02*
X86495309Y-41282880D01*
X86685785Y-41282880D01*
X86781023Y-41235261D01*
X86828642Y-41187642D01*
X86876261Y-41092404D01*
X86876261Y-40806690D01*
X86828642Y-40711452D01*
X86781023Y-40663833D01*
X86685785Y-40616214D01*
X86495309Y-40616214D01*
X86400071Y-40663833D01*
X86114357Y-40616214D02*
X85733404Y-40616214D01*
X85971500Y-40282880D02*
X85971500Y-41140023D01*
X85923880Y-41235261D01*
X85828642Y-41282880D01*
X85733404Y-41282880D01*
X85257214Y-41282880D02*
X85352452Y-41235261D01*
X85400071Y-41187642D01*
X85447690Y-41092404D01*
X85447690Y-40806690D01*
X85400071Y-40711452D01*
X85352452Y-40663833D01*
X85257214Y-40616214D01*
X85114357Y-40616214D01*
X85019119Y-40663833D01*
X84971500Y-40711452D01*
X84923880Y-40806690D01*
X84923880Y-41092404D01*
X84971500Y-41187642D01*
X85019119Y-41235261D01*
X85114357Y-41282880D01*
X85257214Y-41282880D01*
X84495309Y-41282880D02*
X84495309Y-40616214D01*
X84495309Y-40806690D02*
X84447690Y-40711452D01*
X84400071Y-40663833D01*
X84304833Y-40616214D01*
X84209595Y-40616214D01*
X81494285Y-66492380D02*
X82065714Y-66492380D01*
X81780000Y-66492380D02*
X81780000Y-65492380D01*
X81875238Y-65635238D01*
X81970476Y-65730476D01*
X82065714Y-65778095D01*
X81065714Y-66492380D02*
X81065714Y-65492380D01*
X80494285Y-66492380D02*
X80922857Y-65920952D01*
X80494285Y-65492380D02*
X81065714Y-66063809D01*
X102842380Y-42212857D02*
X103651904Y-42212857D01*
X103747142Y-42260476D01*
X103794761Y-42308095D01*
X103842380Y-42403333D01*
X103842380Y-42593809D01*
X103794761Y-42689047D01*
X103747142Y-42736666D01*
X103651904Y-42784285D01*
X102842380Y-42784285D01*
X103794761Y-43212857D02*
X103842380Y-43355714D01*
X103842380Y-43593809D01*
X103794761Y-43689047D01*
X103747142Y-43736666D01*
X103651904Y-43784285D01*
X103556666Y-43784285D01*
X103461428Y-43736666D01*
X103413809Y-43689047D01*
X103366190Y-43593809D01*
X103318571Y-43403333D01*
X103270952Y-43308095D01*
X103223333Y-43260476D01*
X103128095Y-43212857D01*
X103032857Y-43212857D01*
X102937619Y-43260476D01*
X102890000Y-43308095D01*
X102842380Y-43403333D01*
X102842380Y-43641428D01*
X102890000Y-43784285D01*
X103318571Y-44546190D02*
X103366190Y-44689047D01*
X103413809Y-44736666D01*
X103509047Y-44784285D01*
X103651904Y-44784285D01*
X103747142Y-44736666D01*
X103794761Y-44689047D01*
X103842380Y-44593809D01*
X103842380Y-44212857D01*
X102842380Y-44212857D01*
X102842380Y-44546190D01*
X102890000Y-44641428D01*
X102937619Y-44689047D01*
X103032857Y-44736666D01*
X103128095Y-44736666D01*
X103223333Y-44689047D01*
X103270952Y-44641428D01*
X103318571Y-44546190D01*
X103318571Y-44212857D01*
X103937619Y-44974761D02*
X103937619Y-45736666D01*
X103842380Y-45974761D02*
X102842380Y-45974761D01*
X102937619Y-46403333D02*
X102890000Y-46450952D01*
X102842380Y-46546190D01*
X102842380Y-46784285D01*
X102890000Y-46879523D01*
X102937619Y-46927142D01*
X103032857Y-46974761D01*
X103128095Y-46974761D01*
X103270952Y-46927142D01*
X103842380Y-46355714D01*
X103842380Y-46974761D01*
X103747142Y-47974761D02*
X103794761Y-47927142D01*
X103842380Y-47784285D01*
X103842380Y-47689047D01*
X103794761Y-47546190D01*
X103699523Y-47450952D01*
X103604285Y-47403333D01*
X103413809Y-47355714D01*
X103270952Y-47355714D01*
X103080476Y-47403333D01*
X102985238Y-47450952D01*
X102890000Y-47546190D01*
X102842380Y-47689047D01*
X102842380Y-47784285D01*
X102890000Y-47927142D01*
X102937619Y-47974761D01*
M02*
