G04 #@! TF.FileFunction,Legend,Top*
%FSLAX46Y46*%
G04 Gerber Fmt 4.6, Leading zero omitted, Abs format (unit mm)*
G04 Created by KiCad (PCBNEW 4.0.5+dfsg1-4) date Tue Oct 23 17:56:44 2018*
%MOMM*%
%LPD*%
G01*
G04 APERTURE LIST*
%ADD10C,0.100000*%
%ADD11C,0.150000*%
G04 APERTURE END LIST*
D10*
D11*
X163042000Y-99822000D02*
X163042000Y-98272000D01*
X163042000Y-98272000D02*
X166142000Y-98272000D01*
X166142000Y-98272000D02*
X166142000Y-99822000D01*
X165862000Y-101092000D02*
X165862000Y-111252000D01*
X165862000Y-111252000D02*
X163322000Y-111252000D01*
X163322000Y-111252000D02*
X163322000Y-101092000D01*
X165862000Y-101092000D02*
X163322000Y-101092000D01*
X150747604Y-93424548D02*
X153717452Y-96394396D01*
X153717452Y-96394396D02*
X152020396Y-98091452D01*
X152020396Y-98091452D02*
X149050548Y-95121604D01*
X149050548Y-95121604D02*
X150747604Y-93424548D01*
X153287604Y-90884548D02*
X156257452Y-93854396D01*
X156257452Y-93854396D02*
X154560396Y-95551452D01*
X154560396Y-95551452D02*
X151590548Y-92581604D01*
X151590548Y-92581604D02*
X153287604Y-90884548D01*
X134826548Y-100458396D02*
X137796396Y-97488548D01*
X137796396Y-97488548D02*
X139493452Y-99185604D01*
X139493452Y-99185604D02*
X136523604Y-102155452D01*
X136523604Y-102155452D02*
X134826548Y-100458396D01*
X137366548Y-102998396D02*
X140336396Y-100028548D01*
X140336396Y-100028548D02*
X142033452Y-101725604D01*
X142033452Y-101725604D02*
X139063604Y-104695452D01*
X139063604Y-104695452D02*
X137366548Y-102998396D01*
X157940548Y-110872396D02*
X160910396Y-107902548D01*
X160910396Y-107902548D02*
X162607452Y-109599604D01*
X162607452Y-109599604D02*
X159637604Y-112569452D01*
X159637604Y-112569452D02*
X157940548Y-110872396D01*
X155400548Y-108332396D02*
X158370396Y-105362548D01*
X158370396Y-105362548D02*
X160067452Y-107059604D01*
X160067452Y-107059604D02*
X157097604Y-110029452D01*
X157097604Y-110029452D02*
X155400548Y-108332396D01*
X145159604Y-111458548D02*
X148129452Y-114428396D01*
X148129452Y-114428396D02*
X146432396Y-116125452D01*
X146432396Y-116125452D02*
X143462548Y-113155604D01*
X143462548Y-113155604D02*
X145159604Y-111458548D01*
X142619604Y-113998548D02*
X145589452Y-116968396D01*
X145589452Y-116968396D02*
X143892396Y-118665452D01*
X143892396Y-118665452D02*
X140922548Y-115695604D01*
X140922548Y-115695604D02*
X142619604Y-113998548D01*
X163853905Y-95174381D02*
X163853905Y-94174381D01*
X164234858Y-94174381D01*
X164330096Y-94222000D01*
X164377715Y-94269619D01*
X164425334Y-94364857D01*
X164425334Y-94507714D01*
X164377715Y-94602952D01*
X164330096Y-94650571D01*
X164234858Y-94698190D01*
X163853905Y-94698190D01*
X164758667Y-94174381D02*
X165377715Y-94174381D01*
X165044381Y-94555333D01*
X165187239Y-94555333D01*
X165282477Y-94602952D01*
X165330096Y-94650571D01*
X165377715Y-94745810D01*
X165377715Y-94983905D01*
X165330096Y-95079143D01*
X165282477Y-95126762D01*
X165187239Y-95174381D01*
X164901524Y-95174381D01*
X164806286Y-95126762D01*
X164758667Y-95079143D01*
X151830150Y-93661934D02*
X152537257Y-92954827D01*
X152806631Y-93224201D01*
X152840303Y-93325216D01*
X152840303Y-93392560D01*
X152806631Y-93493575D01*
X152705616Y-93594590D01*
X152604601Y-93628262D01*
X152537258Y-93628262D01*
X152436243Y-93594590D01*
X152166868Y-93325216D01*
X152705616Y-94133338D02*
X153042333Y-94470056D01*
X152436242Y-94268025D02*
X153379051Y-93796620D01*
X152907647Y-94739430D01*
X153513738Y-95345522D02*
X153109677Y-94941460D01*
X153311707Y-95143491D02*
X154018814Y-94436384D01*
X153850455Y-94470055D01*
X153715768Y-94470055D01*
X153614753Y-94436384D01*
X154370150Y-91121934D02*
X155077257Y-90414827D01*
X155346631Y-90684201D01*
X155380303Y-90785216D01*
X155380303Y-90852560D01*
X155346631Y-90953575D01*
X155245616Y-91054590D01*
X155144601Y-91088262D01*
X155077258Y-91088262D01*
X154976243Y-91054590D01*
X154706868Y-90785216D01*
X155245616Y-91593338D02*
X155582333Y-91930056D01*
X154976242Y-91728025D02*
X155919051Y-91256620D01*
X155447647Y-92199430D01*
X156289440Y-91761697D02*
X156356784Y-91761697D01*
X156457799Y-91795369D01*
X156626158Y-91963728D01*
X156659830Y-92064743D01*
X156659830Y-92132086D01*
X156626158Y-92233102D01*
X156558815Y-92300445D01*
X156424128Y-92367788D01*
X155616005Y-92367788D01*
X156053738Y-92805522D01*
X135013426Y-99426357D02*
X134306320Y-98719250D01*
X134575694Y-98449876D01*
X134676709Y-98416204D01*
X134744053Y-98416204D01*
X134845068Y-98449876D01*
X134946083Y-98550891D01*
X134979755Y-98651906D01*
X134979755Y-98719250D01*
X134946083Y-98820265D01*
X134676708Y-99089639D01*
X135585846Y-98113158D02*
X135720533Y-98045814D01*
X135787877Y-98045815D01*
X135888892Y-98079487D01*
X135989908Y-98180502D01*
X136023579Y-98281517D01*
X136023579Y-98348861D01*
X135989908Y-98449876D01*
X135720533Y-98719250D01*
X135013426Y-98012143D01*
X135249129Y-97776441D01*
X135350144Y-97742769D01*
X135417488Y-97742769D01*
X135518503Y-97776441D01*
X135585846Y-97843784D01*
X135619518Y-97944799D01*
X135619518Y-98012143D01*
X135585846Y-98113158D01*
X135350143Y-98348861D01*
X136798029Y-97641754D02*
X136393968Y-98045815D01*
X136595998Y-97843785D02*
X135888892Y-97136678D01*
X135922563Y-97305037D01*
X135922563Y-97439724D01*
X135888892Y-97540739D01*
X137553426Y-101966357D02*
X136846320Y-101259250D01*
X137115694Y-100989876D01*
X137216709Y-100956204D01*
X137284053Y-100956204D01*
X137385068Y-100989876D01*
X137486083Y-101090891D01*
X137519755Y-101191906D01*
X137519755Y-101259250D01*
X137486083Y-101360265D01*
X137216708Y-101629639D01*
X138125846Y-100653158D02*
X138260533Y-100585814D01*
X138327877Y-100585815D01*
X138428892Y-100619487D01*
X138529908Y-100720502D01*
X138563579Y-100821517D01*
X138563579Y-100888861D01*
X138529908Y-100989876D01*
X138260533Y-101259250D01*
X137553426Y-100552143D01*
X137789129Y-100316441D01*
X137890144Y-100282769D01*
X137957488Y-100282769D01*
X138058503Y-100316441D01*
X138125846Y-100383784D01*
X138159518Y-100484799D01*
X138159518Y-100552143D01*
X138125846Y-100653158D01*
X137890143Y-100888861D01*
X138294205Y-99946052D02*
X138294205Y-99878708D01*
X138327877Y-99777693D01*
X138496236Y-99609334D01*
X138597251Y-99575662D01*
X138664594Y-99575662D01*
X138765610Y-99609334D01*
X138832953Y-99676677D01*
X138900296Y-99811364D01*
X138900296Y-100619487D01*
X139338029Y-100181754D01*
X158127426Y-109840357D02*
X157420320Y-109133250D01*
X157689694Y-108863876D01*
X157790709Y-108830204D01*
X157858053Y-108830204D01*
X157959068Y-108863876D01*
X158060083Y-108964891D01*
X158093755Y-109065906D01*
X158093755Y-109133250D01*
X158060083Y-109234265D01*
X157790708Y-109503639D01*
X159171251Y-108661846D02*
X159171251Y-108729189D01*
X159103908Y-108863876D01*
X159036564Y-108931219D01*
X158901877Y-108998563D01*
X158767190Y-108998563D01*
X158666174Y-108964892D01*
X158497816Y-108863877D01*
X158396800Y-108762861D01*
X158295785Y-108594502D01*
X158262113Y-108493487D01*
X158262113Y-108358800D01*
X158329457Y-108224112D01*
X158396801Y-108156769D01*
X158531488Y-108089426D01*
X158598831Y-108089426D01*
X159912029Y-108055754D02*
X159507968Y-108459815D01*
X159709998Y-108257785D02*
X159002892Y-107550678D01*
X159036563Y-107719037D01*
X159036563Y-107853724D01*
X159002892Y-107954739D01*
X155587426Y-107300357D02*
X154880320Y-106593250D01*
X155149694Y-106323876D01*
X155250709Y-106290204D01*
X155318053Y-106290204D01*
X155419068Y-106323876D01*
X155520083Y-106424891D01*
X155553755Y-106525906D01*
X155553755Y-106593250D01*
X155520083Y-106694265D01*
X155250708Y-106963639D01*
X156631251Y-106121846D02*
X156631251Y-106189189D01*
X156563908Y-106323876D01*
X156496564Y-106391219D01*
X156361877Y-106458563D01*
X156227190Y-106458563D01*
X156126174Y-106424892D01*
X155957816Y-106323877D01*
X155856800Y-106222861D01*
X155755785Y-106054502D01*
X155722113Y-105953487D01*
X155722113Y-105818800D01*
X155789457Y-105684112D01*
X155856801Y-105616769D01*
X155991488Y-105549426D01*
X156058831Y-105549426D01*
X156328205Y-105280052D02*
X156328205Y-105212708D01*
X156361877Y-105111693D01*
X156530236Y-104943334D01*
X156631251Y-104909662D01*
X156698594Y-104909662D01*
X156799610Y-104943334D01*
X156866953Y-105010677D01*
X156934296Y-105145364D01*
X156934296Y-105953487D01*
X157372029Y-105515754D01*
X146191643Y-111645426D02*
X146898750Y-110938320D01*
X147168124Y-111207694D01*
X147201796Y-111308709D01*
X147201796Y-111376053D01*
X147168124Y-111477068D01*
X147067109Y-111578083D01*
X146966094Y-111611755D01*
X146898750Y-111611755D01*
X146797735Y-111578083D01*
X146528361Y-111308708D01*
X146898750Y-112352533D02*
X147605857Y-111645426D01*
X147774215Y-111813785D01*
X147841559Y-111948472D01*
X147841559Y-112083159D01*
X147807888Y-112184174D01*
X147706872Y-112352533D01*
X147605857Y-112453549D01*
X147437498Y-112554564D01*
X147336483Y-112588236D01*
X147201796Y-112588236D01*
X147067108Y-112520892D01*
X146898750Y-112352533D01*
X147976246Y-113430029D02*
X147572185Y-113025968D01*
X147774215Y-113227998D02*
X148481322Y-112520892D01*
X148312963Y-112554563D01*
X148178276Y-112554563D01*
X148077261Y-112520892D01*
X143651643Y-114185426D02*
X144358750Y-113478320D01*
X144628124Y-113747694D01*
X144661796Y-113848709D01*
X144661796Y-113916053D01*
X144628124Y-114017068D01*
X144527109Y-114118083D01*
X144426094Y-114151755D01*
X144358750Y-114151755D01*
X144257735Y-114118083D01*
X143988361Y-113848708D01*
X144358750Y-114892533D02*
X145065857Y-114185426D01*
X145234215Y-114353785D01*
X145301559Y-114488472D01*
X145301559Y-114623159D01*
X145267888Y-114724174D01*
X145166872Y-114892533D01*
X145065857Y-114993549D01*
X144897498Y-115094564D01*
X144796483Y-115128236D01*
X144661796Y-115128236D01*
X144527108Y-115060892D01*
X144358750Y-114892533D01*
X145671948Y-114926205D02*
X145739292Y-114926205D01*
X145840307Y-114959877D01*
X146008666Y-115128236D01*
X146042338Y-115229251D01*
X146042338Y-115296594D01*
X146008666Y-115397610D01*
X145941323Y-115464953D01*
X145806636Y-115532296D01*
X144998513Y-115532296D01*
X145436246Y-115970029D01*
M02*
