M48
; DRILL file {KiCad 5.1.5+dfsg1-2} date Fri Jan 10 10:39:43 2020
; FORMAT={-:-/ absolute / inch / decimal}
; #@! TF.CreationDate,2020-01-10T10:39:43+05:30
; #@! TF.GenerationSoftware,Kicad,Pcbnew,5.1.5+dfsg1-2
FMAT,2
INCH
T1C0.0079
T2C0.0315
T3C0.0390
T4C0.0394
T5C0.0400
T6C0.0433
T7C0.0512
T8C0.0354
T9C0.0413
%
G90
G05
T1
X2.97Y-1.87
X2.98Y-2.52
X3.2Y-2.67
X3.4Y-2.48
X3.45Y-2.925
X3.65Y-2.475
X3.725Y-2.45
X3.76Y-2.67
X3.77Y-2.51
X3.94Y-2.05
X4.15Y-2.625
X4.16Y-1.62
X4.24Y-1.9
X4.27Y-2.52
X4.325Y-2.625
X4.37Y-2.02
X4.39Y-1.99
X4.45Y-2.58
X4.55Y-2.54
T2
X3.61Y-2.18
X3.71Y-2.18
X3.81Y-2.18
X3.91Y-2.18
X4.01Y-2.18
X4.25Y-2.05
X4.25Y-2.15
X4.25Y-2.25
X4.25Y-2.35
X4.25Y-2.45
T3
X2.8228Y-1.7
X3.0Y-1.7
X3.4228Y-1.7
X3.6Y-1.7
T4
X3.0Y-2.75
X3.4Y-2.75
X2.75Y-1.95
X2.75Y-2.35
X3.15Y-2.9
X3.25Y-2.9
X4.0Y-2.4804
X4.0Y-2.7796
T5
X4.48Y-2.1
X4.48Y-2.2
X4.48Y-2.3
X4.48Y-2.4
X4.48Y-2.5
T6
X2.9Y-1.75
X2.9Y-1.85
X2.9Y-1.95
X2.9Y-2.05
X2.9Y-2.15
X2.9Y-2.25
X2.9Y-2.35
X2.9Y-2.45
X2.9Y-2.55
X2.9Y-2.65
X2.9Y-2.75
X2.9Y-2.85
X3.5Y-1.75
X3.5Y-1.85
X3.5Y-1.95
X3.5Y-2.05
X3.5Y-2.15
X3.5Y-2.25
X3.5Y-2.35
X3.5Y-2.45
X3.5Y-2.55
X3.5Y-2.65
X3.5Y-2.75
X3.5Y-2.85
T7
X2.7732Y-1.798
X3.0492Y-1.798
X3.3732Y-1.798
X3.6492Y-1.798
T8
X4.2634Y-1.8079
X4.4366Y-1.8079
T9
X4.1516Y-2.7098
X4.3484Y-2.7098
X3.6516Y-2.7098
X3.8484Y-2.7098
X3.8016Y-1.8902
X3.9984Y-1.8902
T0
M30
