G04 #@! TF.FileFunction,Other,Fab,Top*
%FSLAX46Y46*%
G04 Gerber Fmt 4.6, Leading zero omitted, Abs format (unit mm)*
G04 Created by KiCad (PCBNEW 4.0.5+dfsg1-4) date Wed Jun 13 14:41:34 2018*
%MOMM*%
%LPD*%
G01*
G04 APERTURE LIST*
%ADD10C,0.100000*%
%ADD11C,0.150000*%
G04 APERTURE END LIST*
D10*
X161970400Y-105999600D02*
X161970400Y-103499600D01*
X161970400Y-103499600D02*
X149230400Y-103499600D01*
X149230400Y-103499600D02*
X149230400Y-105999600D01*
X149230400Y-105999600D02*
X161970400Y-105999600D01*
X159410400Y-105999600D02*
X159410400Y-103499600D01*
D11*
X161339981Y-93850343D02*
X162149505Y-93850343D01*
X162244743Y-93802724D01*
X162292362Y-93755105D01*
X162339981Y-93659867D01*
X162339981Y-93469390D01*
X162292362Y-93374152D01*
X162244743Y-93326533D01*
X162149505Y-93278914D01*
X161339981Y-93278914D01*
X162292362Y-92850343D02*
X162339981Y-92707486D01*
X162339981Y-92469390D01*
X162292362Y-92374152D01*
X162244743Y-92326533D01*
X162149505Y-92278914D01*
X162054267Y-92278914D01*
X161959029Y-92326533D01*
X161911410Y-92374152D01*
X161863790Y-92469390D01*
X161816171Y-92659867D01*
X161768552Y-92755105D01*
X161720933Y-92802724D01*
X161625695Y-92850343D01*
X161530457Y-92850343D01*
X161435219Y-92802724D01*
X161387600Y-92755105D01*
X161339981Y-92659867D01*
X161339981Y-92421771D01*
X161387600Y-92278914D01*
X161816171Y-91517009D02*
X161863790Y-91374152D01*
X161911410Y-91326533D01*
X162006648Y-91278914D01*
X162149505Y-91278914D01*
X162244743Y-91326533D01*
X162292362Y-91374152D01*
X162339981Y-91469390D01*
X162339981Y-91850343D01*
X161339981Y-91850343D01*
X161339981Y-91517009D01*
X161387600Y-91421771D01*
X161435219Y-91374152D01*
X161530457Y-91326533D01*
X161625695Y-91326533D01*
X161720933Y-91374152D01*
X161768552Y-91421771D01*
X161816171Y-91517009D01*
X161816171Y-91850343D01*
X162435219Y-91088438D02*
X162435219Y-90326533D01*
X162339981Y-90088438D02*
X161339981Y-90088438D01*
X161435219Y-89659867D02*
X161387600Y-89612248D01*
X161339981Y-89517010D01*
X161339981Y-89278914D01*
X161387600Y-89183676D01*
X161435219Y-89136057D01*
X161530457Y-89088438D01*
X161625695Y-89088438D01*
X161768552Y-89136057D01*
X162339981Y-89707486D01*
X162339981Y-89088438D01*
X162244743Y-88088438D02*
X162292362Y-88136057D01*
X162339981Y-88278914D01*
X162339981Y-88374152D01*
X162292362Y-88517010D01*
X162197124Y-88612248D01*
X162101886Y-88659867D01*
X161911410Y-88707486D01*
X161768552Y-88707486D01*
X161578076Y-88659867D01*
X161482838Y-88612248D01*
X161387600Y-88517010D01*
X161339981Y-88374152D01*
X161339981Y-88278914D01*
X161387600Y-88136057D01*
X161435219Y-88088438D01*
X149347181Y-110059410D02*
X148347181Y-110059410D01*
X148347181Y-109678457D01*
X148394800Y-109583219D01*
X148442419Y-109535600D01*
X148537657Y-109487981D01*
X148680514Y-109487981D01*
X148775752Y-109535600D01*
X148823371Y-109583219D01*
X148870990Y-109678457D01*
X148870990Y-110059410D01*
X149347181Y-109059410D02*
X148680514Y-109059410D01*
X148870990Y-109059410D02*
X148775752Y-109011791D01*
X148728133Y-108964172D01*
X148680514Y-108868934D01*
X148680514Y-108773695D01*
X149347181Y-108297505D02*
X149299562Y-108392743D01*
X149251943Y-108440362D01*
X149156705Y-108487981D01*
X148870990Y-108487981D01*
X148775752Y-108440362D01*
X148728133Y-108392743D01*
X148680514Y-108297505D01*
X148680514Y-108154647D01*
X148728133Y-108059409D01*
X148775752Y-108011790D01*
X148870990Y-107964171D01*
X149156705Y-107964171D01*
X149251943Y-108011790D01*
X149299562Y-108059409D01*
X149347181Y-108154647D01*
X149347181Y-108297505D01*
X149347181Y-107535600D02*
X148347181Y-107535600D01*
X149061467Y-107202266D01*
X148347181Y-106868933D01*
X149347181Y-106868933D01*
X149347181Y-106392743D02*
X148680514Y-106392743D01*
X148347181Y-106392743D02*
X148394800Y-106440362D01*
X148442419Y-106392743D01*
X148394800Y-106345124D01*
X148347181Y-106392743D01*
X148442419Y-106392743D01*
X149299562Y-105487981D02*
X149347181Y-105583219D01*
X149347181Y-105773696D01*
X149299562Y-105868934D01*
X149251943Y-105916553D01*
X149156705Y-105964172D01*
X148870990Y-105964172D01*
X148775752Y-105916553D01*
X148728133Y-105868934D01*
X148680514Y-105773696D01*
X148680514Y-105583219D01*
X148728133Y-105487981D01*
X149347181Y-105059410D02*
X148680514Y-105059410D01*
X148870990Y-105059410D02*
X148775752Y-105011791D01*
X148728133Y-104964172D01*
X148680514Y-104868934D01*
X148680514Y-104773695D01*
X149347181Y-104297505D02*
X149299562Y-104392743D01*
X149251943Y-104440362D01*
X149156705Y-104487981D01*
X148870990Y-104487981D01*
X148775752Y-104440362D01*
X148728133Y-104392743D01*
X148680514Y-104297505D01*
X148680514Y-104154647D01*
X148728133Y-104059409D01*
X148775752Y-104011790D01*
X148870990Y-103964171D01*
X149156705Y-103964171D01*
X149251943Y-104011790D01*
X149299562Y-104059409D01*
X149347181Y-104154647D01*
X149347181Y-104297505D01*
X166069971Y-119058131D02*
X166117590Y-118915274D01*
X166165210Y-118867655D01*
X166260448Y-118820036D01*
X166403305Y-118820036D01*
X166498543Y-118867655D01*
X166546162Y-118915274D01*
X166593781Y-119010512D01*
X166593781Y-119391465D01*
X165593781Y-119391465D01*
X165593781Y-119058131D01*
X165641400Y-118962893D01*
X165689019Y-118915274D01*
X165784257Y-118867655D01*
X165879495Y-118867655D01*
X165974733Y-118915274D01*
X166022352Y-118962893D01*
X166069971Y-119058131D01*
X166069971Y-119391465D01*
X165927114Y-117962893D02*
X166593781Y-117962893D01*
X165927114Y-118391465D02*
X166450924Y-118391465D01*
X166546162Y-118343846D01*
X166593781Y-118248608D01*
X166593781Y-118105750D01*
X166546162Y-118010512D01*
X166498543Y-117962893D01*
X165927114Y-117581941D02*
X165927114Y-117058131D01*
X166593781Y-117581941D01*
X166593781Y-117058131D01*
X165927114Y-116772417D02*
X165927114Y-116248607D01*
X166593781Y-116772417D01*
X166593781Y-116248607D01*
X166546162Y-115486702D02*
X166593781Y-115581940D01*
X166593781Y-115772417D01*
X166546162Y-115867655D01*
X166450924Y-115915274D01*
X166069971Y-115915274D01*
X165974733Y-115867655D01*
X165927114Y-115772417D01*
X165927114Y-115581940D01*
X165974733Y-115486702D01*
X166069971Y-115439083D01*
X166165210Y-115439083D01*
X166260448Y-115915274D01*
X166593781Y-115010512D02*
X165927114Y-115010512D01*
X166117590Y-115010512D02*
X166022352Y-114962893D01*
X165974733Y-114915274D01*
X165927114Y-114820036D01*
X165927114Y-114724797D01*
X151663733Y-102801981D02*
X151330399Y-102325790D01*
X151092304Y-102801981D02*
X151092304Y-101801981D01*
X151473257Y-101801981D01*
X151568495Y-101849600D01*
X151616114Y-101897219D01*
X151663733Y-101992457D01*
X151663733Y-102135314D01*
X151616114Y-102230552D01*
X151568495Y-102278171D01*
X151473257Y-102325790D01*
X151092304Y-102325790D01*
X152092304Y-102801981D02*
X152092304Y-101801981D01*
X152663733Y-102801981D01*
X152663733Y-101801981D01*
X153520876Y-102754362D02*
X153425638Y-102801981D01*
X153235161Y-102801981D01*
X153139923Y-102754362D01*
X153092304Y-102659124D01*
X153092304Y-102278171D01*
X153139923Y-102182933D01*
X153235161Y-102135314D01*
X153425638Y-102135314D01*
X153520876Y-102182933D01*
X153568495Y-102278171D01*
X153568495Y-102373410D01*
X153092304Y-102468648D01*
X153854209Y-102135314D02*
X154235161Y-102135314D01*
X153997066Y-101801981D02*
X153997066Y-102659124D01*
X154044685Y-102754362D01*
X154139923Y-102801981D01*
X154235161Y-102801981D01*
X155854210Y-102801981D02*
X155282781Y-102801981D01*
X155568495Y-102801981D02*
X155568495Y-101801981D01*
X155473257Y-101944838D01*
X155378019Y-102040076D01*
X155282781Y-102087695D01*
X156473257Y-101801981D02*
X156568496Y-101801981D01*
X156663734Y-101849600D01*
X156711353Y-101897219D01*
X156758972Y-101992457D01*
X156806591Y-102182933D01*
X156806591Y-102421029D01*
X156758972Y-102611505D01*
X156711353Y-102706743D01*
X156663734Y-102754362D01*
X156568496Y-102801981D01*
X156473257Y-102801981D01*
X156378019Y-102754362D01*
X156330400Y-102706743D01*
X156282781Y-102611505D01*
X156235162Y-102421029D01*
X156235162Y-102182933D01*
X156282781Y-101992457D01*
X156330400Y-101897219D01*
X156378019Y-101849600D01*
X156473257Y-101801981D01*
X157235162Y-102801981D02*
X157235162Y-101801981D01*
X157330400Y-102421029D02*
X157616115Y-102801981D01*
X157616115Y-102135314D02*
X157235162Y-102516267D01*
X155386115Y-105201981D02*
X154814686Y-105201981D01*
X155100400Y-105201981D02*
X155100400Y-104201981D01*
X155005162Y-104344838D01*
X154909924Y-104440076D01*
X154814686Y-104487695D01*
X155814686Y-105201981D02*
X155814686Y-104201981D01*
X156386115Y-105201981D02*
X155957543Y-104630552D01*
X156386115Y-104201981D02*
X155814686Y-104773410D01*
X159907791Y-97434743D02*
X159860172Y-97482362D01*
X159717315Y-97529981D01*
X159622077Y-97529981D01*
X159479219Y-97482362D01*
X159383981Y-97387124D01*
X159336362Y-97291886D01*
X159288743Y-97101410D01*
X159288743Y-96958552D01*
X159336362Y-96768076D01*
X159383981Y-96672838D01*
X159479219Y-96577600D01*
X159622077Y-96529981D01*
X159717315Y-96529981D01*
X159860172Y-96577600D01*
X159907791Y-96625219D01*
X160526838Y-96529981D02*
X160717315Y-96529981D01*
X160812553Y-96577600D01*
X160907791Y-96672838D01*
X160955410Y-96863314D01*
X160955410Y-97196648D01*
X160907791Y-97387124D01*
X160812553Y-97482362D01*
X160717315Y-97529981D01*
X160526838Y-97529981D01*
X160431600Y-97482362D01*
X160336362Y-97387124D01*
X160288743Y-97196648D01*
X160288743Y-96863314D01*
X160336362Y-96672838D01*
X160431600Y-96577600D01*
X160526838Y-96529981D01*
X161383981Y-97529981D02*
X161383981Y-96529981D01*
X161955410Y-97529981D01*
X161955410Y-96529981D01*
X162431600Y-97529981D02*
X162431600Y-96529981D01*
X163003029Y-97529981D01*
X163003029Y-96529981D01*
X163241124Y-97625219D02*
X164003029Y-97625219D01*
X164431600Y-96529981D02*
X164526839Y-96529981D01*
X164622077Y-96577600D01*
X164669696Y-96625219D01*
X164717315Y-96720457D01*
X164764934Y-96910933D01*
X164764934Y-97149029D01*
X164717315Y-97339505D01*
X164669696Y-97434743D01*
X164622077Y-97482362D01*
X164526839Y-97529981D01*
X164431600Y-97529981D01*
X164336362Y-97482362D01*
X164288743Y-97434743D01*
X164241124Y-97339505D01*
X164193505Y-97149029D01*
X164193505Y-96910933D01*
X164241124Y-96720457D01*
X164288743Y-96625219D01*
X164336362Y-96577600D01*
X164431600Y-96529981D01*
X165717315Y-97529981D02*
X165145886Y-97529981D01*
X165431600Y-97529981D02*
X165431600Y-96529981D01*
X165336362Y-96672838D01*
X165241124Y-96768076D01*
X165145886Y-96815695D01*
X166050648Y-96529981D02*
X166717315Y-97529981D01*
X166717315Y-96529981D02*
X166050648Y-97529981D01*
X167288743Y-96529981D02*
X167383982Y-96529981D01*
X167479220Y-96577600D01*
X167526839Y-96625219D01*
X167574458Y-96720457D01*
X167622077Y-96910933D01*
X167622077Y-97149029D01*
X167574458Y-97339505D01*
X167526839Y-97434743D01*
X167479220Y-97482362D01*
X167383982Y-97529981D01*
X167288743Y-97529981D01*
X167193505Y-97482362D01*
X167145886Y-97434743D01*
X167098267Y-97339505D01*
X167050648Y-97149029D01*
X167050648Y-96910933D01*
X167098267Y-96720457D01*
X167145886Y-96625219D01*
X167193505Y-96577600D01*
X167288743Y-96529981D01*
X168526839Y-96529981D02*
X168050648Y-96529981D01*
X168003029Y-97006171D01*
X168050648Y-96958552D01*
X168145886Y-96910933D01*
X168383982Y-96910933D01*
X168479220Y-96958552D01*
X168526839Y-97006171D01*
X168574458Y-97101410D01*
X168574458Y-97339505D01*
X168526839Y-97434743D01*
X168479220Y-97482362D01*
X168383982Y-97529981D01*
X168145886Y-97529981D01*
X168050648Y-97482362D01*
X168003029Y-97434743D01*
M02*
