(module Lumberg-1503_02 (layer F.Cu) (tedit 5B30C21A)
  (fp_text reference J1 (at 0.88 -4.46) (layer F.SilkS)
    (effects (font (size 1 1) (thickness 0.15)))
  )
  (fp_text value "JACK External Switch" (at 0 4.75) (layer F.Fab)
    (effects (font (size 1 1) (thickness 0.15)))
  )
  (fp_line (start 9.75 2.5) (end 9.75 0) (layer F.SilkS) (width 0.15))
  (fp_line (start -0.75 3) (end -2.5 3) (layer F.SilkS) (width 0.15))
  (fp_line (start -0.75 3) (end -0.5 3) (layer F.SilkS) (width 0.15))
  (fp_line (start 2.5 3) (end 1 3) (layer F.SilkS) (width 0.15))
  (fp_line (start 1 -3) (end 2.5 -3) (layer F.SilkS) (width 0.15))
  (fp_line (start -0.5 -3) (end -2.5 -3) (layer F.SilkS) (width 0.15))
  (fp_line (start -4.25 0.25) (end -4.25 1.45) (layer F.SilkS) (width 0.15))
  (fp_line (start -4.25 0.25) (end -4.25 -1.25) (layer F.SilkS) (width 0.15))
  (fp_line (start 7.25 -3) (end 6.2 -3) (layer F.SilkS) (width 0.15))
  (fp_line (start 7.25 0.75) (end 7.25 -3) (layer F.SilkS) (width 0.15))
  (fp_line (start 7.25 3) (end 6.2 3) (layer F.SilkS) (width 0.15))
  (fp_line (start 7.25 3) (end 7.25 0.75) (layer F.SilkS) (width 0.15))
  (fp_line (start 7.25 2.5) (end 9.75 2.5) (layer F.SilkS) (width 0.15))
  (fp_line (start 9.75 0) (end 9.75 -2.5) (layer F.SilkS) (width 0.15))
  (fp_line (start 9.75 -2.5) (end 7.25 -2.5) (layer F.SilkS) (width 0.15))
  (pad 2 smd rect (at 4.572 -3.048) (size 3 2.3) (layers F.Cu F.Paste F.Mask))
  (pad 2 smd rect (at 4.572 3.048) (size 3 2.3) (layers F.Cu F.Paste F.Mask))
  (pad 1 smd rect (at -3.81 -2.94) (size 2 2.3) (layers F.Cu F.Paste F.Mask))
  (pad 3 smd rect (at -3.81 3.01) (size 2 2.3) (layers F.Cu F.Paste F.Mask))
  (pad "" np_thru_hole circle (at 0.25 -2.5) (size 1.05 1.05) (drill 1.05) (layers *.Cu *.Mask))
  (pad "" np_thru_hole circle (at 0.25 2.5) (size 1.05 1.05) (drill 1.05) (layers *.Cu *.Mask))
  (model ../../../../../home/vaisakh/work/CircuitDesigns/customFootprints/Lumberg1.wrl
    (at (xyz 0.276 0 0.08500000000000001))
    (scale (xyz 0.38 0.38 0.378))
    (rotate (xyz 90 180 90))
  )
)
