G04 #@! TF.FileFunction,Copper,L2,Bot,Signal*
%FSLAX46Y46*%
G04 Gerber Fmt 4.6, Leading zero omitted, Abs format (unit mm)*
G04 Created by KiCad (PCBNEW 4.0.5+dfsg1-4) date Tue Oct 23 17:58:09 2018*
%MOMM*%
%LPD*%
G01*
G04 APERTURE LIST*
%ADD10C,0.100000*%
%ADD11R,1.600000X1.600000*%
%ADD12C,1.600000*%
%ADD13C,2.000000*%
%ADD14R,2.000000X2.000000*%
%ADD15O,1.600000X1.600000*%
%ADD16C,2.100000*%
%ADD17C,1.750000*%
%ADD18C,1.998980*%
%ADD19R,1.524000X2.540000*%
%ADD20R,0.500000X2.300000*%
%ADD21R,2.000000X2.500000*%
%ADD22R,2.032000X1.727200*%
%ADD23O,2.032000X1.727200*%
%ADD24C,0.450000*%
%ADD25C,0.250000*%
%ADD26C,0.400000*%
%ADD27C,0.254000*%
G04 APERTURE END LIST*
D10*
D11*
X88900000Y-72390000D03*
D12*
X88900000Y-69850000D03*
X88900000Y-67310000D03*
X88900000Y-64770000D03*
X88900000Y-62230000D03*
X88900000Y-59690000D03*
X88900000Y-57150000D03*
X88900000Y-54610000D03*
X88900000Y-52070000D03*
X88900000Y-49530000D03*
X88900000Y-46990000D03*
X88900000Y-44450000D03*
X73660000Y-44450000D03*
X73660000Y-46990000D03*
X73660000Y-49530000D03*
X73660000Y-52070000D03*
X73660000Y-54610000D03*
X73660000Y-57150000D03*
X73660000Y-59690000D03*
X73660000Y-62230000D03*
X73660000Y-64770000D03*
X73660000Y-67310000D03*
X73660000Y-69850000D03*
X73660000Y-72390000D03*
D13*
X101600000Y-70601840D03*
X101600000Y-63002160D03*
D14*
X82550000Y-73660000D03*
D13*
X80010000Y-73660000D03*
D11*
X107950000Y-62230000D03*
D15*
X107950000Y-59690000D03*
X107950000Y-57150000D03*
X107950000Y-54610000D03*
X107950000Y-52070000D03*
D11*
X91694000Y-55372000D03*
D15*
X94234000Y-55372000D03*
X96774000Y-55372000D03*
X99314000Y-55372000D03*
X101854000Y-55372000D03*
D16*
X70440000Y-45670000D03*
D17*
X71700000Y-43180000D03*
X76200000Y-43180000D03*
D16*
X77450000Y-45670000D03*
X85680000Y-45670000D03*
D17*
X86940000Y-43180000D03*
X91440000Y-43180000D03*
D16*
X92690000Y-45670000D03*
D18*
X76200000Y-69850000D03*
X86360000Y-69850000D03*
X69850000Y-59690000D03*
X69850000Y-49530000D03*
D19*
X85090000Y-65532000D03*
X82550000Y-65532000D03*
X80010000Y-65532000D03*
X77470000Y-65532000D03*
X77470000Y-48768000D03*
X80010000Y-48768000D03*
X82550000Y-48768000D03*
X85090000Y-48768000D03*
D20*
X108890000Y-48520000D03*
X109690000Y-48520000D03*
X110490000Y-48520000D03*
X111290000Y-48520000D03*
X112090000Y-48520000D03*
D21*
X106040000Y-48420000D03*
X106040000Y-42920000D03*
X114940000Y-48420000D03*
X114940000Y-42920000D03*
D22*
X113792000Y-53340000D03*
D23*
X113792000Y-55880000D03*
X113792000Y-58420000D03*
X113792000Y-60960000D03*
X113792000Y-63500000D03*
D24*
X86360000Y-62992000D03*
X95758000Y-63754000D03*
X93218000Y-66802000D03*
X103632000Y-66802000D03*
X107696000Y-48260000D03*
X105664000Y-41148000D03*
X81280000Y-67818000D03*
X100076000Y-52070000D03*
X108458000Y-64008000D03*
X75692000Y-64008000D03*
X95504000Y-67818000D03*
X115570000Y-64516000D03*
X110998000Y-51308000D03*
X111506000Y-50546000D03*
X113030000Y-65532000D03*
X75438000Y-47498000D03*
D25*
X88900000Y-57150000D02*
X88646000Y-57150000D01*
X88646000Y-57150000D02*
X87122000Y-58674000D01*
X87122000Y-58674000D02*
X87122000Y-67818000D01*
X87122000Y-67818000D02*
X87884000Y-68580000D01*
X87884000Y-68580000D02*
X90424000Y-68580000D01*
X90424000Y-68580000D02*
X92445840Y-70601840D01*
X92445840Y-70601840D02*
X101600000Y-70601840D01*
X80010000Y-65532000D02*
X80010000Y-64008000D01*
X86106000Y-62738000D02*
X86360000Y-62992000D01*
X81280000Y-62738000D02*
X86106000Y-62738000D01*
X80010000Y-64008000D02*
X81280000Y-62738000D01*
X113792000Y-63500000D02*
X115062000Y-63500000D01*
X115062000Y-63500000D02*
X115824000Y-62738000D01*
X115824000Y-62738000D02*
X115824000Y-52324000D01*
X115824000Y-52324000D02*
X114300000Y-50800000D01*
X114300000Y-50800000D02*
X114300000Y-50730000D01*
X114300000Y-50730000D02*
X112090000Y-48520000D01*
X91694000Y-55372000D02*
X91694000Y-64770000D01*
X112090000Y-48520000D02*
X111290000Y-48520000D01*
X98552000Y-64770000D02*
X112522000Y-64770000D01*
X112522000Y-64770000D02*
X113792000Y-63500000D01*
X88900000Y-64770000D02*
X91694000Y-64770000D01*
X91694000Y-64770000D02*
X98552000Y-64770000D01*
X98552000Y-64770000D02*
X99060000Y-64770000D01*
X99060000Y-64770000D02*
X100827840Y-63002160D01*
X100827840Y-63002160D02*
X101600000Y-63002160D01*
X71700000Y-43180000D02*
X71700000Y-44522000D01*
X69850000Y-48514000D02*
X69850000Y-49530000D01*
X71882000Y-46482000D02*
X69850000Y-48514000D01*
X71882000Y-44704000D02*
X71882000Y-46482000D01*
X71700000Y-44522000D02*
X71882000Y-44704000D01*
X69850000Y-49530000D02*
X69850000Y-56388000D01*
X71628000Y-68580000D02*
X72898000Y-69850000D01*
X71628000Y-58166000D02*
X71628000Y-68580000D01*
X69850000Y-56388000D02*
X71628000Y-58166000D01*
X72898000Y-69850000D02*
X73660000Y-69850000D01*
X80010000Y-65532000D02*
X80010000Y-73660000D01*
X88900000Y-52070000D02*
X94488000Y-52070000D01*
X96774000Y-54356000D02*
X96774000Y-55372000D01*
X94488000Y-52070000D02*
X96774000Y-54356000D01*
X96774000Y-55372000D02*
X96774000Y-58420000D01*
X95758000Y-59436000D02*
X95758000Y-63754000D01*
X96774000Y-58420000D02*
X95758000Y-59436000D01*
D26*
X93218000Y-66802000D02*
X103632000Y-66802000D01*
X107696000Y-48260000D02*
X108630000Y-48260000D01*
D25*
X108630000Y-48260000D02*
X108890000Y-48520000D01*
D26*
X107950000Y-62230000D02*
X106680000Y-62230000D01*
X106172000Y-51238000D02*
X108890000Y-48520000D01*
X106172000Y-61722000D02*
X106172000Y-52070000D01*
X106172000Y-52070000D02*
X106172000Y-51238000D01*
X106680000Y-62230000D02*
X106172000Y-61722000D01*
D25*
X91440000Y-43180000D02*
X91440000Y-42672000D01*
D26*
X91440000Y-42672000D02*
X92964000Y-41148000D01*
X92964000Y-41148000D02*
X105664000Y-41148000D01*
D25*
X81280000Y-67818000D02*
X82550000Y-66548000D01*
X82550000Y-66548000D02*
X82550000Y-65532000D01*
X101854000Y-53086000D02*
X101854000Y-55372000D01*
X100838000Y-52070000D02*
X101854000Y-53086000D01*
X100076000Y-52070000D02*
X100838000Y-52070000D01*
X99314000Y-55372000D02*
X99314000Y-57404000D01*
X107442000Y-64008000D02*
X108458000Y-64008000D01*
X106426000Y-62992000D02*
X107442000Y-64008000D01*
X104902000Y-62992000D02*
X106426000Y-62992000D01*
X99314000Y-57404000D02*
X104902000Y-62992000D01*
X88900000Y-44450000D02*
X92710000Y-48260000D01*
X99314000Y-50546000D02*
X99314000Y-55372000D01*
X98552000Y-49784000D02*
X99314000Y-50546000D01*
X93218000Y-49784000D02*
X98552000Y-49784000D01*
X92710000Y-49276000D02*
X93218000Y-49784000D01*
X92710000Y-48260000D02*
X92710000Y-49276000D01*
X77470000Y-65532000D02*
X77216000Y-65532000D01*
X77216000Y-65532000D02*
X75692000Y-64008000D01*
X112268000Y-67818000D02*
X112522000Y-67564000D01*
X95504000Y-67818000D02*
X112268000Y-67818000D01*
X110998000Y-51308000D02*
X110236000Y-51308000D01*
X110236000Y-51308000D02*
X109690000Y-50762000D01*
X109690000Y-48520000D02*
X109690000Y-50762000D01*
X112522000Y-67564000D02*
X115570000Y-64516000D01*
X88138000Y-66040000D02*
X111252000Y-66040000D01*
X88646000Y-59690000D02*
X87632002Y-60703998D01*
X87632002Y-60703998D02*
X87632002Y-65534002D01*
X87632002Y-65534002D02*
X88138000Y-66040000D01*
X111506000Y-50546000D02*
X110744000Y-50546000D01*
X110744000Y-50546000D02*
X110490000Y-50292000D01*
X110490000Y-50292000D02*
X110490000Y-48520000D01*
X111760000Y-65532000D02*
X113030000Y-65532000D01*
X111252000Y-66040000D02*
X111760000Y-65532000D01*
X88900000Y-59690000D02*
X88646000Y-59690000D01*
X88900000Y-49530000D02*
X87122000Y-51308000D01*
X92710000Y-53340000D02*
X94234000Y-54864000D01*
X87630000Y-53340000D02*
X92710000Y-53340000D01*
X87122000Y-52832000D02*
X87630000Y-53340000D01*
X87122000Y-51308000D02*
X87122000Y-52832000D01*
X94234000Y-54864000D02*
X94234000Y-55372000D01*
X75438000Y-47498000D02*
X75438000Y-49784000D01*
X75438000Y-49784000D02*
X75438000Y-62484000D01*
X75438000Y-62484000D02*
X74930000Y-62992000D01*
X74930000Y-62992000D02*
X74930000Y-66040000D01*
X74930000Y-66040000D02*
X73660000Y-67310000D01*
D27*
G36*
X87464752Y-44734187D02*
X87682757Y-45261800D01*
X88086077Y-45665824D01*
X88216215Y-45719862D01*
X88088200Y-45772757D01*
X87684176Y-46176077D01*
X87465250Y-46703309D01*
X87464752Y-47274187D01*
X87682757Y-47801800D01*
X88086077Y-48205824D01*
X88216215Y-48259862D01*
X88088200Y-48312757D01*
X87684176Y-48716077D01*
X87465250Y-49243309D01*
X87464752Y-49814187D01*
X87487049Y-49868149D01*
X86584599Y-50770599D01*
X86419852Y-51017161D01*
X86362000Y-51308000D01*
X86362000Y-52832000D01*
X86419852Y-53122839D01*
X86584599Y-53369401D01*
X87092599Y-53877401D01*
X87339161Y-54042148D01*
X87563471Y-54086766D01*
X87465250Y-54323309D01*
X87464752Y-54894187D01*
X87682757Y-55421800D01*
X88086077Y-55825824D01*
X88216215Y-55879862D01*
X88088200Y-55932757D01*
X87684176Y-56336077D01*
X87465250Y-56863309D01*
X87464907Y-57256291D01*
X86584599Y-58136599D01*
X86419852Y-58383161D01*
X86362000Y-58674000D01*
X86362000Y-63881905D01*
X86316090Y-63810559D01*
X86103890Y-63665569D01*
X85852000Y-63614560D01*
X84328000Y-63614560D01*
X84092683Y-63658838D01*
X83876559Y-63797910D01*
X83820626Y-63879770D01*
X83776090Y-63810559D01*
X83563890Y-63665569D01*
X83312000Y-63614560D01*
X81788000Y-63614560D01*
X81552683Y-63658838D01*
X81336559Y-63797910D01*
X81283536Y-63875511D01*
X81131699Y-63723673D01*
X80898310Y-63627000D01*
X80295750Y-63627000D01*
X80137000Y-63785750D01*
X80137000Y-65405000D01*
X80157000Y-65405000D01*
X80157000Y-65659000D01*
X80137000Y-65659000D01*
X80137000Y-67278250D01*
X80295750Y-67437000D01*
X80507011Y-67437000D01*
X80420150Y-67646185D01*
X80419851Y-67988314D01*
X80550503Y-68304514D01*
X80792213Y-68546647D01*
X81108185Y-68677850D01*
X81450314Y-68678149D01*
X81766514Y-68547497D01*
X82008647Y-68305787D01*
X82109219Y-68063583D01*
X82723362Y-67449440D01*
X83312000Y-67449440D01*
X83547317Y-67405162D01*
X83763441Y-67266090D01*
X83819374Y-67184230D01*
X83863910Y-67253441D01*
X84076110Y-67398431D01*
X84328000Y-67449440D01*
X85852000Y-67449440D01*
X86087317Y-67405162D01*
X86303441Y-67266090D01*
X86362000Y-67180386D01*
X86362000Y-67818000D01*
X86419852Y-68108839D01*
X86491203Y-68215623D01*
X86036306Y-68215226D01*
X85435345Y-68463538D01*
X84975154Y-68922927D01*
X84725794Y-69523453D01*
X84725226Y-70173694D01*
X84973538Y-70774655D01*
X85432927Y-71234846D01*
X86033453Y-71484206D01*
X86683694Y-71484774D01*
X87284655Y-71236462D01*
X87744846Y-70777073D01*
X87760411Y-70739589D01*
X87984688Y-70964258D01*
X87864683Y-70986838D01*
X87648559Y-71125910D01*
X87503569Y-71338110D01*
X87452560Y-71590000D01*
X87452560Y-73190000D01*
X87496838Y-73425317D01*
X87635910Y-73641441D01*
X87848110Y-73786431D01*
X88100000Y-73837440D01*
X89700000Y-73837440D01*
X89935317Y-73793162D01*
X90151441Y-73654090D01*
X90296431Y-73441890D01*
X90347440Y-73190000D01*
X90347440Y-71590000D01*
X90303162Y-71354683D01*
X90164090Y-71138559D01*
X89951890Y-70993569D01*
X89813646Y-70965574D01*
X90115824Y-70663923D01*
X90334750Y-70136691D01*
X90335248Y-69566050D01*
X91908439Y-71139241D01*
X92155001Y-71303988D01*
X92445840Y-71361840D01*
X100144953Y-71361840D01*
X100213106Y-71526783D01*
X100672637Y-71987118D01*
X101273352Y-72236556D01*
X101923795Y-72237124D01*
X102524943Y-71988734D01*
X102985278Y-71529203D01*
X103234716Y-70928488D01*
X103235284Y-70278045D01*
X102986894Y-69676897D01*
X102527363Y-69216562D01*
X101926648Y-68967124D01*
X101276205Y-68966556D01*
X100675057Y-69214946D01*
X100214722Y-69674477D01*
X100145227Y-69841840D01*
X98338788Y-69841840D01*
X98406229Y-69813974D01*
X98732827Y-69487945D01*
X98909798Y-69061751D01*
X98910201Y-68600274D01*
X98900998Y-68578000D01*
X104298610Y-68578000D01*
X104290202Y-68598249D01*
X104289799Y-69059726D01*
X104466026Y-69486229D01*
X104792055Y-69812827D01*
X105218249Y-69989798D01*
X105679726Y-69990201D01*
X106106229Y-69813974D01*
X106432827Y-69487945D01*
X106609798Y-69061751D01*
X106610201Y-68600274D01*
X106600998Y-68578000D01*
X109298610Y-68578000D01*
X109290202Y-68598249D01*
X109289799Y-69059726D01*
X109466026Y-69486229D01*
X109792055Y-69812827D01*
X110218249Y-69989798D01*
X110679726Y-69990201D01*
X111106229Y-69813974D01*
X111432827Y-69487945D01*
X111609798Y-69061751D01*
X111610201Y-68600274D01*
X111600998Y-68578000D01*
X112268000Y-68578000D01*
X112558839Y-68520148D01*
X112805401Y-68355401D01*
X115815874Y-65344928D01*
X116056514Y-65245497D01*
X116130000Y-65172139D01*
X116130000Y-75490000D01*
X69290000Y-75490000D01*
X69290000Y-72674187D01*
X72224752Y-72674187D01*
X72442757Y-73201800D01*
X72846077Y-73605824D01*
X73373309Y-73824750D01*
X73944187Y-73825248D01*
X74471800Y-73607243D01*
X74683951Y-73395461D01*
X78364092Y-73395461D01*
X78388144Y-74045460D01*
X78590613Y-74534264D01*
X78857468Y-74632927D01*
X79830395Y-73660000D01*
X78857468Y-72687073D01*
X78590613Y-72785736D01*
X78364092Y-73395461D01*
X74683951Y-73395461D01*
X74875824Y-73203923D01*
X75094750Y-72676691D01*
X75094897Y-72507468D01*
X79037073Y-72507468D01*
X80010000Y-73480395D01*
X80024143Y-73466253D01*
X80203748Y-73645858D01*
X80189605Y-73660000D01*
X80203748Y-73674143D01*
X80024143Y-73853748D01*
X80010000Y-73839605D01*
X79037073Y-74812532D01*
X79135736Y-75079387D01*
X79745461Y-75305908D01*
X80395460Y-75281856D01*
X80884264Y-75079387D01*
X80950319Y-74900727D01*
X81085910Y-75111441D01*
X81298110Y-75256431D01*
X81550000Y-75307440D01*
X83550000Y-75307440D01*
X83785317Y-75263162D01*
X84001441Y-75124090D01*
X84146431Y-74911890D01*
X84197440Y-74660000D01*
X84197440Y-72660000D01*
X84153162Y-72424683D01*
X84014090Y-72208559D01*
X83801890Y-72063569D01*
X83550000Y-72012560D01*
X81550000Y-72012560D01*
X81314683Y-72056838D01*
X81098559Y-72195910D01*
X80953569Y-72408110D01*
X80950958Y-72421002D01*
X80884264Y-72240613D01*
X80274539Y-72014092D01*
X79624540Y-72038144D01*
X79135736Y-72240613D01*
X79037073Y-72507468D01*
X75094897Y-72507468D01*
X75095248Y-72105813D01*
X74877243Y-71578200D01*
X74473923Y-71174176D01*
X74359232Y-71126552D01*
X74414005Y-71103864D01*
X74488139Y-70857745D01*
X73660000Y-70029605D01*
X72831861Y-70857745D01*
X72905995Y-71103864D01*
X72964254Y-71124805D01*
X72848200Y-71172757D01*
X72444176Y-71576077D01*
X72225250Y-72103309D01*
X72224752Y-72674187D01*
X69290000Y-72674187D01*
X69290000Y-69633223D01*
X72213035Y-69633223D01*
X72240222Y-70203454D01*
X72406136Y-70604005D01*
X72652255Y-70678139D01*
X73480395Y-69850000D01*
X73839605Y-69850000D01*
X74667745Y-70678139D01*
X74761936Y-70649768D01*
X74813538Y-70774655D01*
X75272927Y-71234846D01*
X75873453Y-71484206D01*
X76523694Y-71484774D01*
X77124655Y-71236462D01*
X77584846Y-70777073D01*
X77834206Y-70176547D01*
X77834774Y-69526306D01*
X77586462Y-68925345D01*
X77127073Y-68465154D01*
X76526547Y-68215794D01*
X75876306Y-68215226D01*
X75275345Y-68463538D01*
X74815154Y-68922927D01*
X74762253Y-69050328D01*
X74667745Y-69021861D01*
X73839605Y-69850000D01*
X73480395Y-69850000D01*
X72652255Y-69021861D01*
X72406136Y-69095995D01*
X72213035Y-69633223D01*
X69290000Y-69633223D01*
X69290000Y-61227268D01*
X69523453Y-61324206D01*
X70173694Y-61324774D01*
X70774655Y-61076462D01*
X71234846Y-60617073D01*
X71484206Y-60016547D01*
X71484774Y-59366306D01*
X71236462Y-58765345D01*
X70777073Y-58305154D01*
X70176547Y-58055794D01*
X69526306Y-58055226D01*
X69290000Y-58152866D01*
X69290000Y-51065596D01*
X69585582Y-51175401D01*
X70235377Y-51151341D01*
X70723958Y-50948965D01*
X70822557Y-50682163D01*
X69850000Y-49709605D01*
X69835858Y-49723748D01*
X69656253Y-49544143D01*
X69670395Y-49530000D01*
X70029605Y-49530000D01*
X71002163Y-50502557D01*
X71268965Y-50403958D01*
X71495401Y-49794418D01*
X71471341Y-49144623D01*
X71268965Y-48656042D01*
X71002163Y-48557443D01*
X70029605Y-49530000D01*
X69670395Y-49530000D01*
X69656253Y-49515858D01*
X69835858Y-49336252D01*
X69850000Y-49350395D01*
X70822557Y-48377837D01*
X70723958Y-48111035D01*
X70114418Y-47884599D01*
X69464623Y-47908659D01*
X69290000Y-47980990D01*
X69290000Y-46903023D01*
X69484278Y-47097640D01*
X70103362Y-47354707D01*
X70773697Y-47355292D01*
X71393229Y-47099306D01*
X71867640Y-46625722D01*
X72124707Y-46006638D01*
X72125292Y-45336303D01*
X71869306Y-44716771D01*
X71838026Y-44685436D01*
X72065458Y-44675579D01*
X72224861Y-44609553D01*
X72224752Y-44734187D01*
X72442757Y-45261800D01*
X72846077Y-45665824D01*
X72976215Y-45719862D01*
X72848200Y-45772757D01*
X72444176Y-46176077D01*
X72225250Y-46703309D01*
X72224752Y-47274187D01*
X72442757Y-47801800D01*
X72846077Y-48205824D01*
X72976215Y-48259862D01*
X72848200Y-48312757D01*
X72444176Y-48716077D01*
X72225250Y-49243309D01*
X72224752Y-49814187D01*
X72442757Y-50341800D01*
X72846077Y-50745824D01*
X72976215Y-50799862D01*
X72848200Y-50852757D01*
X72444176Y-51256077D01*
X72225250Y-51783309D01*
X72224752Y-52354187D01*
X72442757Y-52881800D01*
X72846077Y-53285824D01*
X72976215Y-53339862D01*
X72848200Y-53392757D01*
X72444176Y-53796077D01*
X72225250Y-54323309D01*
X72224752Y-54894187D01*
X72442757Y-55421800D01*
X72846077Y-55825824D01*
X72976215Y-55879862D01*
X72848200Y-55932757D01*
X72444176Y-56336077D01*
X72225250Y-56863309D01*
X72224752Y-57434187D01*
X72442757Y-57961800D01*
X72846077Y-58365824D01*
X72976215Y-58419862D01*
X72848200Y-58472757D01*
X72444176Y-58876077D01*
X72225250Y-59403309D01*
X72224752Y-59974187D01*
X72442757Y-60501800D01*
X72846077Y-60905824D01*
X72976215Y-60959862D01*
X72848200Y-61012757D01*
X72444176Y-61416077D01*
X72225250Y-61943309D01*
X72224752Y-62514187D01*
X72442757Y-63041800D01*
X72846077Y-63445824D01*
X72976215Y-63499862D01*
X72848200Y-63552757D01*
X72444176Y-63956077D01*
X72225250Y-64483309D01*
X72224752Y-65054187D01*
X72442757Y-65581800D01*
X72846077Y-65985824D01*
X72976215Y-66039862D01*
X72848200Y-66092757D01*
X72444176Y-66496077D01*
X72225250Y-67023309D01*
X72224752Y-67594187D01*
X72442757Y-68121800D01*
X72846077Y-68525824D01*
X72960768Y-68573448D01*
X72905995Y-68596136D01*
X72831861Y-68842255D01*
X73660000Y-69670395D01*
X74488139Y-68842255D01*
X74414005Y-68596136D01*
X74355746Y-68575195D01*
X74471800Y-68527243D01*
X74875824Y-68123923D01*
X75094750Y-67596691D01*
X75095248Y-67025813D01*
X75072951Y-66971851D01*
X75467401Y-66577401D01*
X75632148Y-66330840D01*
X75690000Y-66040000D01*
X75690000Y-65080802D01*
X76060560Y-65451362D01*
X76060560Y-66802000D01*
X76104838Y-67037317D01*
X76243910Y-67253441D01*
X76456110Y-67398431D01*
X76708000Y-67449440D01*
X78232000Y-67449440D01*
X78467317Y-67405162D01*
X78683441Y-67266090D01*
X78736464Y-67188489D01*
X78888301Y-67340327D01*
X79121690Y-67437000D01*
X79724250Y-67437000D01*
X79883000Y-67278250D01*
X79883000Y-65659000D01*
X79863000Y-65659000D01*
X79863000Y-65405000D01*
X79883000Y-65405000D01*
X79883000Y-63785750D01*
X79724250Y-63627000D01*
X79121690Y-63627000D01*
X78888301Y-63723673D01*
X78737329Y-63874646D01*
X78696090Y-63810559D01*
X78483890Y-63665569D01*
X78232000Y-63614560D01*
X76708000Y-63614560D01*
X76477848Y-63657866D01*
X76421497Y-63521486D01*
X76179787Y-63279353D01*
X75863815Y-63148150D01*
X75848665Y-63148137D01*
X75975401Y-63021401D01*
X76140147Y-62774840D01*
X76140148Y-62774839D01*
X76198000Y-62484000D01*
X76198000Y-50418095D01*
X76243910Y-50489441D01*
X76456110Y-50634431D01*
X76708000Y-50685440D01*
X78232000Y-50685440D01*
X78467317Y-50641162D01*
X78683441Y-50502090D01*
X78739374Y-50420230D01*
X78783910Y-50489441D01*
X78996110Y-50634431D01*
X79248000Y-50685440D01*
X80772000Y-50685440D01*
X81007317Y-50641162D01*
X81223441Y-50502090D01*
X81279374Y-50420230D01*
X81323910Y-50489441D01*
X81536110Y-50634431D01*
X81788000Y-50685440D01*
X83312000Y-50685440D01*
X83547317Y-50641162D01*
X83763441Y-50502090D01*
X83819374Y-50420230D01*
X83863910Y-50489441D01*
X84076110Y-50634431D01*
X84328000Y-50685440D01*
X85852000Y-50685440D01*
X86087317Y-50641162D01*
X86303441Y-50502090D01*
X86448431Y-50289890D01*
X86499440Y-50038000D01*
X86499440Y-47498000D01*
X86455162Y-47262683D01*
X86409514Y-47191744D01*
X86633229Y-47099306D01*
X87107640Y-46625722D01*
X87364707Y-46006638D01*
X87365292Y-45336303D01*
X87109306Y-44716771D01*
X87082707Y-44690126D01*
X87239040Y-44690262D01*
X87464872Y-44596950D01*
X87464752Y-44734187D01*
X87464752Y-44734187D01*
G37*
X87464752Y-44734187D02*
X87682757Y-45261800D01*
X88086077Y-45665824D01*
X88216215Y-45719862D01*
X88088200Y-45772757D01*
X87684176Y-46176077D01*
X87465250Y-46703309D01*
X87464752Y-47274187D01*
X87682757Y-47801800D01*
X88086077Y-48205824D01*
X88216215Y-48259862D01*
X88088200Y-48312757D01*
X87684176Y-48716077D01*
X87465250Y-49243309D01*
X87464752Y-49814187D01*
X87487049Y-49868149D01*
X86584599Y-50770599D01*
X86419852Y-51017161D01*
X86362000Y-51308000D01*
X86362000Y-52832000D01*
X86419852Y-53122839D01*
X86584599Y-53369401D01*
X87092599Y-53877401D01*
X87339161Y-54042148D01*
X87563471Y-54086766D01*
X87465250Y-54323309D01*
X87464752Y-54894187D01*
X87682757Y-55421800D01*
X88086077Y-55825824D01*
X88216215Y-55879862D01*
X88088200Y-55932757D01*
X87684176Y-56336077D01*
X87465250Y-56863309D01*
X87464907Y-57256291D01*
X86584599Y-58136599D01*
X86419852Y-58383161D01*
X86362000Y-58674000D01*
X86362000Y-63881905D01*
X86316090Y-63810559D01*
X86103890Y-63665569D01*
X85852000Y-63614560D01*
X84328000Y-63614560D01*
X84092683Y-63658838D01*
X83876559Y-63797910D01*
X83820626Y-63879770D01*
X83776090Y-63810559D01*
X83563890Y-63665569D01*
X83312000Y-63614560D01*
X81788000Y-63614560D01*
X81552683Y-63658838D01*
X81336559Y-63797910D01*
X81283536Y-63875511D01*
X81131699Y-63723673D01*
X80898310Y-63627000D01*
X80295750Y-63627000D01*
X80137000Y-63785750D01*
X80137000Y-65405000D01*
X80157000Y-65405000D01*
X80157000Y-65659000D01*
X80137000Y-65659000D01*
X80137000Y-67278250D01*
X80295750Y-67437000D01*
X80507011Y-67437000D01*
X80420150Y-67646185D01*
X80419851Y-67988314D01*
X80550503Y-68304514D01*
X80792213Y-68546647D01*
X81108185Y-68677850D01*
X81450314Y-68678149D01*
X81766514Y-68547497D01*
X82008647Y-68305787D01*
X82109219Y-68063583D01*
X82723362Y-67449440D01*
X83312000Y-67449440D01*
X83547317Y-67405162D01*
X83763441Y-67266090D01*
X83819374Y-67184230D01*
X83863910Y-67253441D01*
X84076110Y-67398431D01*
X84328000Y-67449440D01*
X85852000Y-67449440D01*
X86087317Y-67405162D01*
X86303441Y-67266090D01*
X86362000Y-67180386D01*
X86362000Y-67818000D01*
X86419852Y-68108839D01*
X86491203Y-68215623D01*
X86036306Y-68215226D01*
X85435345Y-68463538D01*
X84975154Y-68922927D01*
X84725794Y-69523453D01*
X84725226Y-70173694D01*
X84973538Y-70774655D01*
X85432927Y-71234846D01*
X86033453Y-71484206D01*
X86683694Y-71484774D01*
X87284655Y-71236462D01*
X87744846Y-70777073D01*
X87760411Y-70739589D01*
X87984688Y-70964258D01*
X87864683Y-70986838D01*
X87648559Y-71125910D01*
X87503569Y-71338110D01*
X87452560Y-71590000D01*
X87452560Y-73190000D01*
X87496838Y-73425317D01*
X87635910Y-73641441D01*
X87848110Y-73786431D01*
X88100000Y-73837440D01*
X89700000Y-73837440D01*
X89935317Y-73793162D01*
X90151441Y-73654090D01*
X90296431Y-73441890D01*
X90347440Y-73190000D01*
X90347440Y-71590000D01*
X90303162Y-71354683D01*
X90164090Y-71138559D01*
X89951890Y-70993569D01*
X89813646Y-70965574D01*
X90115824Y-70663923D01*
X90334750Y-70136691D01*
X90335248Y-69566050D01*
X91908439Y-71139241D01*
X92155001Y-71303988D01*
X92445840Y-71361840D01*
X100144953Y-71361840D01*
X100213106Y-71526783D01*
X100672637Y-71987118D01*
X101273352Y-72236556D01*
X101923795Y-72237124D01*
X102524943Y-71988734D01*
X102985278Y-71529203D01*
X103234716Y-70928488D01*
X103235284Y-70278045D01*
X102986894Y-69676897D01*
X102527363Y-69216562D01*
X101926648Y-68967124D01*
X101276205Y-68966556D01*
X100675057Y-69214946D01*
X100214722Y-69674477D01*
X100145227Y-69841840D01*
X98338788Y-69841840D01*
X98406229Y-69813974D01*
X98732827Y-69487945D01*
X98909798Y-69061751D01*
X98910201Y-68600274D01*
X98900998Y-68578000D01*
X104298610Y-68578000D01*
X104290202Y-68598249D01*
X104289799Y-69059726D01*
X104466026Y-69486229D01*
X104792055Y-69812827D01*
X105218249Y-69989798D01*
X105679726Y-69990201D01*
X106106229Y-69813974D01*
X106432827Y-69487945D01*
X106609798Y-69061751D01*
X106610201Y-68600274D01*
X106600998Y-68578000D01*
X109298610Y-68578000D01*
X109290202Y-68598249D01*
X109289799Y-69059726D01*
X109466026Y-69486229D01*
X109792055Y-69812827D01*
X110218249Y-69989798D01*
X110679726Y-69990201D01*
X111106229Y-69813974D01*
X111432827Y-69487945D01*
X111609798Y-69061751D01*
X111610201Y-68600274D01*
X111600998Y-68578000D01*
X112268000Y-68578000D01*
X112558839Y-68520148D01*
X112805401Y-68355401D01*
X115815874Y-65344928D01*
X116056514Y-65245497D01*
X116130000Y-65172139D01*
X116130000Y-75490000D01*
X69290000Y-75490000D01*
X69290000Y-72674187D01*
X72224752Y-72674187D01*
X72442757Y-73201800D01*
X72846077Y-73605824D01*
X73373309Y-73824750D01*
X73944187Y-73825248D01*
X74471800Y-73607243D01*
X74683951Y-73395461D01*
X78364092Y-73395461D01*
X78388144Y-74045460D01*
X78590613Y-74534264D01*
X78857468Y-74632927D01*
X79830395Y-73660000D01*
X78857468Y-72687073D01*
X78590613Y-72785736D01*
X78364092Y-73395461D01*
X74683951Y-73395461D01*
X74875824Y-73203923D01*
X75094750Y-72676691D01*
X75094897Y-72507468D01*
X79037073Y-72507468D01*
X80010000Y-73480395D01*
X80024143Y-73466253D01*
X80203748Y-73645858D01*
X80189605Y-73660000D01*
X80203748Y-73674143D01*
X80024143Y-73853748D01*
X80010000Y-73839605D01*
X79037073Y-74812532D01*
X79135736Y-75079387D01*
X79745461Y-75305908D01*
X80395460Y-75281856D01*
X80884264Y-75079387D01*
X80950319Y-74900727D01*
X81085910Y-75111441D01*
X81298110Y-75256431D01*
X81550000Y-75307440D01*
X83550000Y-75307440D01*
X83785317Y-75263162D01*
X84001441Y-75124090D01*
X84146431Y-74911890D01*
X84197440Y-74660000D01*
X84197440Y-72660000D01*
X84153162Y-72424683D01*
X84014090Y-72208559D01*
X83801890Y-72063569D01*
X83550000Y-72012560D01*
X81550000Y-72012560D01*
X81314683Y-72056838D01*
X81098559Y-72195910D01*
X80953569Y-72408110D01*
X80950958Y-72421002D01*
X80884264Y-72240613D01*
X80274539Y-72014092D01*
X79624540Y-72038144D01*
X79135736Y-72240613D01*
X79037073Y-72507468D01*
X75094897Y-72507468D01*
X75095248Y-72105813D01*
X74877243Y-71578200D01*
X74473923Y-71174176D01*
X74359232Y-71126552D01*
X74414005Y-71103864D01*
X74488139Y-70857745D01*
X73660000Y-70029605D01*
X72831861Y-70857745D01*
X72905995Y-71103864D01*
X72964254Y-71124805D01*
X72848200Y-71172757D01*
X72444176Y-71576077D01*
X72225250Y-72103309D01*
X72224752Y-72674187D01*
X69290000Y-72674187D01*
X69290000Y-69633223D01*
X72213035Y-69633223D01*
X72240222Y-70203454D01*
X72406136Y-70604005D01*
X72652255Y-70678139D01*
X73480395Y-69850000D01*
X73839605Y-69850000D01*
X74667745Y-70678139D01*
X74761936Y-70649768D01*
X74813538Y-70774655D01*
X75272927Y-71234846D01*
X75873453Y-71484206D01*
X76523694Y-71484774D01*
X77124655Y-71236462D01*
X77584846Y-70777073D01*
X77834206Y-70176547D01*
X77834774Y-69526306D01*
X77586462Y-68925345D01*
X77127073Y-68465154D01*
X76526547Y-68215794D01*
X75876306Y-68215226D01*
X75275345Y-68463538D01*
X74815154Y-68922927D01*
X74762253Y-69050328D01*
X74667745Y-69021861D01*
X73839605Y-69850000D01*
X73480395Y-69850000D01*
X72652255Y-69021861D01*
X72406136Y-69095995D01*
X72213035Y-69633223D01*
X69290000Y-69633223D01*
X69290000Y-61227268D01*
X69523453Y-61324206D01*
X70173694Y-61324774D01*
X70774655Y-61076462D01*
X71234846Y-60617073D01*
X71484206Y-60016547D01*
X71484774Y-59366306D01*
X71236462Y-58765345D01*
X70777073Y-58305154D01*
X70176547Y-58055794D01*
X69526306Y-58055226D01*
X69290000Y-58152866D01*
X69290000Y-51065596D01*
X69585582Y-51175401D01*
X70235377Y-51151341D01*
X70723958Y-50948965D01*
X70822557Y-50682163D01*
X69850000Y-49709605D01*
X69835858Y-49723748D01*
X69656253Y-49544143D01*
X69670395Y-49530000D01*
X70029605Y-49530000D01*
X71002163Y-50502557D01*
X71268965Y-50403958D01*
X71495401Y-49794418D01*
X71471341Y-49144623D01*
X71268965Y-48656042D01*
X71002163Y-48557443D01*
X70029605Y-49530000D01*
X69670395Y-49530000D01*
X69656253Y-49515858D01*
X69835858Y-49336252D01*
X69850000Y-49350395D01*
X70822557Y-48377837D01*
X70723958Y-48111035D01*
X70114418Y-47884599D01*
X69464623Y-47908659D01*
X69290000Y-47980990D01*
X69290000Y-46903023D01*
X69484278Y-47097640D01*
X70103362Y-47354707D01*
X70773697Y-47355292D01*
X71393229Y-47099306D01*
X71867640Y-46625722D01*
X72124707Y-46006638D01*
X72125292Y-45336303D01*
X71869306Y-44716771D01*
X71838026Y-44685436D01*
X72065458Y-44675579D01*
X72224861Y-44609553D01*
X72224752Y-44734187D01*
X72442757Y-45261800D01*
X72846077Y-45665824D01*
X72976215Y-45719862D01*
X72848200Y-45772757D01*
X72444176Y-46176077D01*
X72225250Y-46703309D01*
X72224752Y-47274187D01*
X72442757Y-47801800D01*
X72846077Y-48205824D01*
X72976215Y-48259862D01*
X72848200Y-48312757D01*
X72444176Y-48716077D01*
X72225250Y-49243309D01*
X72224752Y-49814187D01*
X72442757Y-50341800D01*
X72846077Y-50745824D01*
X72976215Y-50799862D01*
X72848200Y-50852757D01*
X72444176Y-51256077D01*
X72225250Y-51783309D01*
X72224752Y-52354187D01*
X72442757Y-52881800D01*
X72846077Y-53285824D01*
X72976215Y-53339862D01*
X72848200Y-53392757D01*
X72444176Y-53796077D01*
X72225250Y-54323309D01*
X72224752Y-54894187D01*
X72442757Y-55421800D01*
X72846077Y-55825824D01*
X72976215Y-55879862D01*
X72848200Y-55932757D01*
X72444176Y-56336077D01*
X72225250Y-56863309D01*
X72224752Y-57434187D01*
X72442757Y-57961800D01*
X72846077Y-58365824D01*
X72976215Y-58419862D01*
X72848200Y-58472757D01*
X72444176Y-58876077D01*
X72225250Y-59403309D01*
X72224752Y-59974187D01*
X72442757Y-60501800D01*
X72846077Y-60905824D01*
X72976215Y-60959862D01*
X72848200Y-61012757D01*
X72444176Y-61416077D01*
X72225250Y-61943309D01*
X72224752Y-62514187D01*
X72442757Y-63041800D01*
X72846077Y-63445824D01*
X72976215Y-63499862D01*
X72848200Y-63552757D01*
X72444176Y-63956077D01*
X72225250Y-64483309D01*
X72224752Y-65054187D01*
X72442757Y-65581800D01*
X72846077Y-65985824D01*
X72976215Y-66039862D01*
X72848200Y-66092757D01*
X72444176Y-66496077D01*
X72225250Y-67023309D01*
X72224752Y-67594187D01*
X72442757Y-68121800D01*
X72846077Y-68525824D01*
X72960768Y-68573448D01*
X72905995Y-68596136D01*
X72831861Y-68842255D01*
X73660000Y-69670395D01*
X74488139Y-68842255D01*
X74414005Y-68596136D01*
X74355746Y-68575195D01*
X74471800Y-68527243D01*
X74875824Y-68123923D01*
X75094750Y-67596691D01*
X75095248Y-67025813D01*
X75072951Y-66971851D01*
X75467401Y-66577401D01*
X75632148Y-66330840D01*
X75690000Y-66040000D01*
X75690000Y-65080802D01*
X76060560Y-65451362D01*
X76060560Y-66802000D01*
X76104838Y-67037317D01*
X76243910Y-67253441D01*
X76456110Y-67398431D01*
X76708000Y-67449440D01*
X78232000Y-67449440D01*
X78467317Y-67405162D01*
X78683441Y-67266090D01*
X78736464Y-67188489D01*
X78888301Y-67340327D01*
X79121690Y-67437000D01*
X79724250Y-67437000D01*
X79883000Y-67278250D01*
X79883000Y-65659000D01*
X79863000Y-65659000D01*
X79863000Y-65405000D01*
X79883000Y-65405000D01*
X79883000Y-63785750D01*
X79724250Y-63627000D01*
X79121690Y-63627000D01*
X78888301Y-63723673D01*
X78737329Y-63874646D01*
X78696090Y-63810559D01*
X78483890Y-63665569D01*
X78232000Y-63614560D01*
X76708000Y-63614560D01*
X76477848Y-63657866D01*
X76421497Y-63521486D01*
X76179787Y-63279353D01*
X75863815Y-63148150D01*
X75848665Y-63148137D01*
X75975401Y-63021401D01*
X76140147Y-62774840D01*
X76140148Y-62774839D01*
X76198000Y-62484000D01*
X76198000Y-50418095D01*
X76243910Y-50489441D01*
X76456110Y-50634431D01*
X76708000Y-50685440D01*
X78232000Y-50685440D01*
X78467317Y-50641162D01*
X78683441Y-50502090D01*
X78739374Y-50420230D01*
X78783910Y-50489441D01*
X78996110Y-50634431D01*
X79248000Y-50685440D01*
X80772000Y-50685440D01*
X81007317Y-50641162D01*
X81223441Y-50502090D01*
X81279374Y-50420230D01*
X81323910Y-50489441D01*
X81536110Y-50634431D01*
X81788000Y-50685440D01*
X83312000Y-50685440D01*
X83547317Y-50641162D01*
X83763441Y-50502090D01*
X83819374Y-50420230D01*
X83863910Y-50489441D01*
X84076110Y-50634431D01*
X84328000Y-50685440D01*
X85852000Y-50685440D01*
X86087317Y-50641162D01*
X86303441Y-50502090D01*
X86448431Y-50289890D01*
X86499440Y-50038000D01*
X86499440Y-47498000D01*
X86455162Y-47262683D01*
X86409514Y-47191744D01*
X86633229Y-47099306D01*
X87107640Y-46625722D01*
X87364707Y-46006638D01*
X87365292Y-45336303D01*
X87109306Y-44716771D01*
X87082707Y-44690126D01*
X87239040Y-44690262D01*
X87464872Y-44596950D01*
X87464752Y-44734187D01*
G36*
X89093748Y-67295858D02*
X89079605Y-67310000D01*
X89093748Y-67324142D01*
X88914143Y-67503748D01*
X88900000Y-67489605D01*
X88885858Y-67503748D01*
X88706252Y-67324142D01*
X88720395Y-67310000D01*
X88706252Y-67295858D01*
X88885858Y-67116253D01*
X88900000Y-67130395D01*
X88914143Y-67116253D01*
X89093748Y-67295858D01*
X89093748Y-67295858D01*
G37*
X89093748Y-67295858D02*
X89079605Y-67310000D01*
X89093748Y-67324142D01*
X88914143Y-67503748D01*
X88900000Y-67489605D01*
X88885858Y-67503748D01*
X88706252Y-67324142D01*
X88720395Y-67310000D01*
X88706252Y-67295858D01*
X88885858Y-67116253D01*
X88900000Y-67130395D01*
X88914143Y-67116253D01*
X89093748Y-67295858D01*
G36*
X113343569Y-41418110D02*
X113292560Y-41670000D01*
X113292560Y-44170000D01*
X113336838Y-44405317D01*
X113475910Y-44621441D01*
X113688110Y-44766431D01*
X113940000Y-44817440D01*
X115940000Y-44817440D01*
X116130000Y-44781689D01*
X116130000Y-46561036D01*
X115940000Y-46522560D01*
X113940000Y-46522560D01*
X113704683Y-46566838D01*
X113488559Y-46705910D01*
X113343569Y-46918110D01*
X113292560Y-47170000D01*
X113292560Y-49670000D01*
X113336838Y-49905317D01*
X113475910Y-50121441D01*
X113688110Y-50266431D01*
X113940000Y-50317440D01*
X115940000Y-50317440D01*
X116130000Y-50281689D01*
X116130000Y-63859692D01*
X116057787Y-63787353D01*
X115741815Y-63656150D01*
X115399686Y-63655851D01*
X115312162Y-63692016D01*
X115278217Y-63627000D01*
X113919000Y-63627000D01*
X113919000Y-64840924D01*
X114074674Y-64936524D01*
X113819791Y-65191407D01*
X113759497Y-65045486D01*
X113596986Y-64882691D01*
X113665000Y-64840924D01*
X113665000Y-63627000D01*
X112305783Y-63627000D01*
X112184642Y-63859026D01*
X112187291Y-63874791D01*
X112441268Y-64402036D01*
X112780074Y-64704746D01*
X112617308Y-64772000D01*
X111760000Y-64772000D01*
X111469161Y-64829852D01*
X111222599Y-64994599D01*
X110937198Y-65280000D01*
X90241569Y-65280000D01*
X90346965Y-64986777D01*
X90319778Y-64416546D01*
X90153864Y-64015995D01*
X89907745Y-63941861D01*
X89079605Y-64770000D01*
X89093748Y-64784142D01*
X88914143Y-64963748D01*
X88900000Y-64949605D01*
X88885858Y-64963748D01*
X88706253Y-64784143D01*
X88720395Y-64770000D01*
X88706253Y-64755858D01*
X88885858Y-64576252D01*
X88900000Y-64590395D01*
X89728139Y-63762255D01*
X89654005Y-63516136D01*
X89595746Y-63495195D01*
X89711800Y-63447243D01*
X90115824Y-63043923D01*
X90334750Y-62516691D01*
X90335248Y-61945813D01*
X90117243Y-61418200D01*
X89713923Y-61014176D01*
X89583785Y-60960138D01*
X89711800Y-60907243D01*
X90115824Y-60503923D01*
X90334750Y-59976691D01*
X90335248Y-59405813D01*
X90117243Y-58878200D01*
X89713923Y-58474176D01*
X89583785Y-58420138D01*
X89711800Y-58367243D01*
X90115824Y-57963923D01*
X90334750Y-57436691D01*
X90335248Y-56865813D01*
X90117243Y-56338200D01*
X89713923Y-55934176D01*
X89583785Y-55880138D01*
X89711800Y-55827243D01*
X89881588Y-55657750D01*
X90259000Y-55657750D01*
X90259000Y-56298310D01*
X90355673Y-56531699D01*
X90534302Y-56710327D01*
X90767691Y-56807000D01*
X91408250Y-56807000D01*
X91567000Y-56648250D01*
X91567000Y-55499000D01*
X90417750Y-55499000D01*
X90259000Y-55657750D01*
X89881588Y-55657750D01*
X90115824Y-55423923D01*
X90259000Y-55079117D01*
X90259000Y-55086250D01*
X90417750Y-55245000D01*
X91567000Y-55245000D01*
X91567000Y-55225000D01*
X91821000Y-55225000D01*
X91821000Y-55245000D01*
X91841000Y-55245000D01*
X91841000Y-55499000D01*
X91821000Y-55499000D01*
X91821000Y-56648250D01*
X91979750Y-56807000D01*
X92620309Y-56807000D01*
X92853698Y-56710327D01*
X93032327Y-56531699D01*
X93129000Y-56298310D01*
X93129000Y-56293626D01*
X93191189Y-56386698D01*
X93656736Y-56697767D01*
X94205887Y-56807000D01*
X94262113Y-56807000D01*
X94811264Y-56697767D01*
X95276811Y-56386698D01*
X95504000Y-56046686D01*
X95731189Y-56386698D01*
X96014000Y-56575667D01*
X96014000Y-58105198D01*
X95220599Y-58898599D01*
X95055852Y-59145161D01*
X94998000Y-59436000D01*
X94998000Y-63341719D01*
X94898150Y-63582185D01*
X94897851Y-63924314D01*
X95028503Y-64240514D01*
X95270213Y-64482647D01*
X95586185Y-64613850D01*
X95928314Y-64614149D01*
X96244514Y-64483497D01*
X96486647Y-64241787D01*
X96522811Y-64154692D01*
X100627073Y-64154692D01*
X100725736Y-64421547D01*
X101335461Y-64648068D01*
X101985460Y-64624016D01*
X102474264Y-64421547D01*
X102572927Y-64154692D01*
X101600000Y-63181765D01*
X100627073Y-64154692D01*
X96522811Y-64154692D01*
X96617850Y-63925815D01*
X96618149Y-63583686D01*
X96518000Y-63341308D01*
X96518000Y-62737621D01*
X99954092Y-62737621D01*
X99978144Y-63387620D01*
X100180613Y-63876424D01*
X100447468Y-63975087D01*
X101420395Y-63002160D01*
X100447468Y-62029233D01*
X100180613Y-62127896D01*
X99954092Y-62737621D01*
X96518000Y-62737621D01*
X96518000Y-59750802D01*
X97311401Y-58957401D01*
X97476148Y-58710839D01*
X97534000Y-58420000D01*
X97534000Y-56575667D01*
X97816811Y-56386698D01*
X98044000Y-56046686D01*
X98271189Y-56386698D01*
X98554000Y-56575667D01*
X98554000Y-57404000D01*
X98611852Y-57694839D01*
X98776599Y-57941401D01*
X102384695Y-61549497D01*
X101864539Y-61356252D01*
X101214540Y-61380304D01*
X100725736Y-61582773D01*
X100627073Y-61849628D01*
X101600000Y-62822555D01*
X101614143Y-62808413D01*
X101793748Y-62988018D01*
X101779605Y-63002160D01*
X102752532Y-63975087D01*
X103019387Y-63876424D01*
X103245908Y-63266699D01*
X103221856Y-62616700D01*
X103059192Y-62223994D01*
X104364599Y-63529401D01*
X104611160Y-63694148D01*
X104902000Y-63752000D01*
X106111198Y-63752000D01*
X106904599Y-64545401D01*
X107151161Y-64710148D01*
X107442000Y-64768000D01*
X108045719Y-64768000D01*
X108286185Y-64867850D01*
X108628314Y-64868149D01*
X108944514Y-64737497D01*
X109186647Y-64495787D01*
X109317850Y-64179815D01*
X109318149Y-63837686D01*
X109187497Y-63521486D01*
X109176299Y-63510268D01*
X109201441Y-63494090D01*
X109346431Y-63281890D01*
X109397440Y-63030000D01*
X109397440Y-61430000D01*
X109353162Y-61194683D01*
X109214090Y-60978559D01*
X109001890Y-60833569D01*
X108857625Y-60804355D01*
X108964698Y-60732811D01*
X109275767Y-60267264D01*
X109385000Y-59718113D01*
X109385000Y-59661887D01*
X109275767Y-59112736D01*
X108964698Y-58647189D01*
X108624686Y-58420000D01*
X108964698Y-58192811D01*
X109275767Y-57727264D01*
X109385000Y-57178113D01*
X109385000Y-57121887D01*
X109275767Y-56572736D01*
X108964698Y-56107189D01*
X108624686Y-55880000D01*
X112108655Y-55880000D01*
X112222729Y-56453489D01*
X112547585Y-56939670D01*
X112862366Y-57150000D01*
X112547585Y-57360330D01*
X112222729Y-57846511D01*
X112108655Y-58420000D01*
X112222729Y-58993489D01*
X112547585Y-59479670D01*
X112862366Y-59690000D01*
X112547585Y-59900330D01*
X112222729Y-60386511D01*
X112108655Y-60960000D01*
X112222729Y-61533489D01*
X112547585Y-62019670D01*
X112857069Y-62226461D01*
X112441268Y-62597964D01*
X112187291Y-63125209D01*
X112184642Y-63140974D01*
X112305783Y-63373000D01*
X113665000Y-63373000D01*
X113665000Y-63353000D01*
X113919000Y-63353000D01*
X113919000Y-63373000D01*
X115278217Y-63373000D01*
X115399358Y-63140974D01*
X115396709Y-63125209D01*
X115142732Y-62597964D01*
X114726931Y-62226461D01*
X115036415Y-62019670D01*
X115361271Y-61533489D01*
X115475345Y-60960000D01*
X115361271Y-60386511D01*
X115036415Y-59900330D01*
X114721634Y-59690000D01*
X115036415Y-59479670D01*
X115361271Y-58993489D01*
X115475345Y-58420000D01*
X115361271Y-57846511D01*
X115036415Y-57360330D01*
X114721634Y-57150000D01*
X115036415Y-56939670D01*
X115361271Y-56453489D01*
X115475345Y-55880000D01*
X115361271Y-55306511D01*
X115036415Y-54820330D01*
X115022087Y-54810757D01*
X115043317Y-54806762D01*
X115259441Y-54667690D01*
X115404431Y-54455490D01*
X115455440Y-54203600D01*
X115455440Y-52476400D01*
X115411162Y-52241083D01*
X115272090Y-52024959D01*
X115059890Y-51879969D01*
X114808000Y-51828960D01*
X112776000Y-51828960D01*
X112540683Y-51873238D01*
X112324559Y-52012310D01*
X112179569Y-52224510D01*
X112128560Y-52476400D01*
X112128560Y-54203600D01*
X112172838Y-54438917D01*
X112311910Y-54655041D01*
X112524110Y-54800031D01*
X112565439Y-54808400D01*
X112547585Y-54820330D01*
X112222729Y-55306511D01*
X112108655Y-55880000D01*
X108624686Y-55880000D01*
X108964698Y-55652811D01*
X109275767Y-55187264D01*
X109385000Y-54638113D01*
X109385000Y-54581887D01*
X109275767Y-54032736D01*
X108964698Y-53567189D01*
X108624686Y-53340000D01*
X108964698Y-53112811D01*
X109275767Y-52647264D01*
X109385000Y-52098113D01*
X109385000Y-52041887D01*
X109275767Y-51492736D01*
X108964698Y-51027189D01*
X108499151Y-50716120D01*
X107978343Y-50612525D01*
X108350283Y-50240585D01*
X108388110Y-50266431D01*
X108640000Y-50317440D01*
X108930000Y-50317440D01*
X108930000Y-50762000D01*
X108987852Y-51052839D01*
X109152599Y-51299401D01*
X109698599Y-51845401D01*
X109945161Y-52010148D01*
X110236000Y-52068000D01*
X110585719Y-52068000D01*
X110826185Y-52167850D01*
X111168314Y-52168149D01*
X111484514Y-52037497D01*
X111726647Y-51795787D01*
X111857850Y-51479815D01*
X111857980Y-51331086D01*
X111992514Y-51275497D01*
X112234647Y-51033787D01*
X112365850Y-50717815D01*
X112366149Y-50375686D01*
X112311024Y-50242274D01*
X112373750Y-50305000D01*
X112466310Y-50305000D01*
X112699699Y-50208327D01*
X112878327Y-50029698D01*
X112975000Y-49796309D01*
X112975000Y-48805750D01*
X112816250Y-48647000D01*
X112215000Y-48647000D01*
X112215000Y-48667000D01*
X112036250Y-48667000D01*
X112016250Y-48647000D01*
X111943000Y-48647000D01*
X111943000Y-48393000D01*
X112016250Y-48393000D01*
X112036250Y-48373000D01*
X112215000Y-48373000D01*
X112215000Y-48393000D01*
X112816250Y-48393000D01*
X112975000Y-48234250D01*
X112975000Y-47243691D01*
X112878327Y-47010302D01*
X112873185Y-47005160D01*
X112904873Y-47005188D01*
X113303800Y-46840354D01*
X113609282Y-46535405D01*
X113774811Y-46136767D01*
X113775188Y-45705127D01*
X113610354Y-45306200D01*
X113305405Y-45000718D01*
X112906767Y-44835189D01*
X112475127Y-44834812D01*
X112076200Y-44999646D01*
X111770718Y-45304595D01*
X111605189Y-45703233D01*
X111604812Y-46134873D01*
X111769646Y-46533800D01*
X111970495Y-46735000D01*
X111962998Y-46735000D01*
X111962998Y-46891748D01*
X111806250Y-46735000D01*
X111713690Y-46735000D01*
X111690000Y-46744813D01*
X111666310Y-46735000D01*
X111573750Y-46735000D01*
X111415000Y-46893750D01*
X111415000Y-46896974D01*
X111301673Y-47010302D01*
X111286577Y-47046747D01*
X111204090Y-46918559D01*
X111159001Y-46887751D01*
X111006250Y-46735000D01*
X110913690Y-46735000D01*
X110876829Y-46750268D01*
X110740000Y-46722560D01*
X110240000Y-46722560D01*
X110084493Y-46751821D01*
X109940000Y-46722560D01*
X109440000Y-46722560D01*
X109284493Y-46751821D01*
X109140000Y-46722560D01*
X109021800Y-46722560D01*
X109209282Y-46535405D01*
X109374811Y-46136767D01*
X109375188Y-45705127D01*
X109210354Y-45306200D01*
X108905405Y-45000718D01*
X108506767Y-44835189D01*
X108075127Y-44834812D01*
X107676200Y-44999646D01*
X107370718Y-45304595D01*
X107205189Y-45703233D01*
X107204812Y-46134873D01*
X107369646Y-46533800D01*
X107674595Y-46839282D01*
X108073233Y-47004811D01*
X108120954Y-47004853D01*
X108043569Y-47118110D01*
X107992560Y-47370000D01*
X107992560Y-47425000D01*
X107927660Y-47425000D01*
X107867815Y-47400150D01*
X107687440Y-47399992D01*
X107687440Y-47170000D01*
X107643162Y-46934683D01*
X107504090Y-46718559D01*
X107291890Y-46573569D01*
X107040000Y-46522560D01*
X105040000Y-46522560D01*
X104804683Y-46566838D01*
X104588559Y-46705910D01*
X104443569Y-46918110D01*
X104392560Y-47170000D01*
X104392560Y-49670000D01*
X104436838Y-49905317D01*
X104575910Y-50121441D01*
X104788110Y-50266431D01*
X105040000Y-50317440D01*
X105911692Y-50317440D01*
X105581566Y-50647566D01*
X105400561Y-50918459D01*
X105337000Y-51238000D01*
X105337000Y-61722000D01*
X105400561Y-62041541D01*
X105527822Y-62232000D01*
X105216802Y-62232000D01*
X100074000Y-57089198D01*
X100074000Y-56575667D01*
X100356811Y-56386698D01*
X100584000Y-56046686D01*
X100811189Y-56386698D01*
X101276736Y-56697767D01*
X101825887Y-56807000D01*
X101882113Y-56807000D01*
X102431264Y-56697767D01*
X102896811Y-56386698D01*
X103207880Y-55921151D01*
X103317113Y-55372000D01*
X103207880Y-54822849D01*
X102896811Y-54357302D01*
X102614000Y-54168333D01*
X102614000Y-53086000D01*
X102556148Y-52795161D01*
X102391401Y-52548599D01*
X101375401Y-51532599D01*
X101128839Y-51367852D01*
X100838000Y-51310000D01*
X100488281Y-51310000D01*
X100247815Y-51210150D01*
X100074000Y-51209998D01*
X100074000Y-50546000D01*
X100016148Y-50255161D01*
X99851401Y-50008599D01*
X99089401Y-49246599D01*
X98842839Y-49081852D01*
X98552000Y-49024000D01*
X97143560Y-49024000D01*
X97216229Y-48993974D01*
X97542827Y-48667945D01*
X97719798Y-48241751D01*
X97719799Y-48239726D01*
X100399799Y-48239726D01*
X100576026Y-48666229D01*
X100902055Y-48992827D01*
X101328249Y-49169798D01*
X101789726Y-49170201D01*
X102216229Y-48993974D01*
X102542827Y-48667945D01*
X102719798Y-48241751D01*
X102720201Y-47780274D01*
X102543974Y-47353771D01*
X102217945Y-47027173D01*
X101791751Y-46850202D01*
X101330274Y-46849799D01*
X100903771Y-47026026D01*
X100577173Y-47352055D01*
X100400202Y-47778249D01*
X100399799Y-48239726D01*
X97719799Y-48239726D01*
X97720201Y-47780274D01*
X97543974Y-47353771D01*
X97217945Y-47027173D01*
X96791751Y-46850202D01*
X96330274Y-46849799D01*
X95903771Y-47026026D01*
X95577173Y-47352055D01*
X95400202Y-47778249D01*
X95399799Y-48239726D01*
X95576026Y-48666229D01*
X95902055Y-48992827D01*
X95977128Y-49024000D01*
X93532802Y-49024000D01*
X93470000Y-48961198D01*
X93470000Y-48260000D01*
X93412148Y-47969161D01*
X93247401Y-47722599D01*
X92879969Y-47355167D01*
X93023697Y-47355292D01*
X93643229Y-47099306D01*
X94117640Y-46625722D01*
X94374707Y-46006638D01*
X94375292Y-45336303D01*
X94119306Y-44716771D01*
X93645722Y-44242360D01*
X93026638Y-43985293D01*
X92740721Y-43985043D01*
X92949738Y-43481675D01*
X92950262Y-42880960D01*
X92792857Y-42500011D01*
X93309868Y-41983000D01*
X104392560Y-41983000D01*
X104392560Y-44170000D01*
X104436838Y-44405317D01*
X104575910Y-44621441D01*
X104788110Y-44766431D01*
X105040000Y-44817440D01*
X107040000Y-44817440D01*
X107275317Y-44773162D01*
X107491441Y-44634090D01*
X107636431Y-44421890D01*
X107687440Y-44170000D01*
X107687440Y-41670000D01*
X107643162Y-41434683D01*
X107588670Y-41350000D01*
X113390107Y-41350000D01*
X113343569Y-41418110D01*
X113343569Y-41418110D01*
G37*
X113343569Y-41418110D02*
X113292560Y-41670000D01*
X113292560Y-44170000D01*
X113336838Y-44405317D01*
X113475910Y-44621441D01*
X113688110Y-44766431D01*
X113940000Y-44817440D01*
X115940000Y-44817440D01*
X116130000Y-44781689D01*
X116130000Y-46561036D01*
X115940000Y-46522560D01*
X113940000Y-46522560D01*
X113704683Y-46566838D01*
X113488559Y-46705910D01*
X113343569Y-46918110D01*
X113292560Y-47170000D01*
X113292560Y-49670000D01*
X113336838Y-49905317D01*
X113475910Y-50121441D01*
X113688110Y-50266431D01*
X113940000Y-50317440D01*
X115940000Y-50317440D01*
X116130000Y-50281689D01*
X116130000Y-63859692D01*
X116057787Y-63787353D01*
X115741815Y-63656150D01*
X115399686Y-63655851D01*
X115312162Y-63692016D01*
X115278217Y-63627000D01*
X113919000Y-63627000D01*
X113919000Y-64840924D01*
X114074674Y-64936524D01*
X113819791Y-65191407D01*
X113759497Y-65045486D01*
X113596986Y-64882691D01*
X113665000Y-64840924D01*
X113665000Y-63627000D01*
X112305783Y-63627000D01*
X112184642Y-63859026D01*
X112187291Y-63874791D01*
X112441268Y-64402036D01*
X112780074Y-64704746D01*
X112617308Y-64772000D01*
X111760000Y-64772000D01*
X111469161Y-64829852D01*
X111222599Y-64994599D01*
X110937198Y-65280000D01*
X90241569Y-65280000D01*
X90346965Y-64986777D01*
X90319778Y-64416546D01*
X90153864Y-64015995D01*
X89907745Y-63941861D01*
X89079605Y-64770000D01*
X89093748Y-64784142D01*
X88914143Y-64963748D01*
X88900000Y-64949605D01*
X88885858Y-64963748D01*
X88706253Y-64784143D01*
X88720395Y-64770000D01*
X88706253Y-64755858D01*
X88885858Y-64576252D01*
X88900000Y-64590395D01*
X89728139Y-63762255D01*
X89654005Y-63516136D01*
X89595746Y-63495195D01*
X89711800Y-63447243D01*
X90115824Y-63043923D01*
X90334750Y-62516691D01*
X90335248Y-61945813D01*
X90117243Y-61418200D01*
X89713923Y-61014176D01*
X89583785Y-60960138D01*
X89711800Y-60907243D01*
X90115824Y-60503923D01*
X90334750Y-59976691D01*
X90335248Y-59405813D01*
X90117243Y-58878200D01*
X89713923Y-58474176D01*
X89583785Y-58420138D01*
X89711800Y-58367243D01*
X90115824Y-57963923D01*
X90334750Y-57436691D01*
X90335248Y-56865813D01*
X90117243Y-56338200D01*
X89713923Y-55934176D01*
X89583785Y-55880138D01*
X89711800Y-55827243D01*
X89881588Y-55657750D01*
X90259000Y-55657750D01*
X90259000Y-56298310D01*
X90355673Y-56531699D01*
X90534302Y-56710327D01*
X90767691Y-56807000D01*
X91408250Y-56807000D01*
X91567000Y-56648250D01*
X91567000Y-55499000D01*
X90417750Y-55499000D01*
X90259000Y-55657750D01*
X89881588Y-55657750D01*
X90115824Y-55423923D01*
X90259000Y-55079117D01*
X90259000Y-55086250D01*
X90417750Y-55245000D01*
X91567000Y-55245000D01*
X91567000Y-55225000D01*
X91821000Y-55225000D01*
X91821000Y-55245000D01*
X91841000Y-55245000D01*
X91841000Y-55499000D01*
X91821000Y-55499000D01*
X91821000Y-56648250D01*
X91979750Y-56807000D01*
X92620309Y-56807000D01*
X92853698Y-56710327D01*
X93032327Y-56531699D01*
X93129000Y-56298310D01*
X93129000Y-56293626D01*
X93191189Y-56386698D01*
X93656736Y-56697767D01*
X94205887Y-56807000D01*
X94262113Y-56807000D01*
X94811264Y-56697767D01*
X95276811Y-56386698D01*
X95504000Y-56046686D01*
X95731189Y-56386698D01*
X96014000Y-56575667D01*
X96014000Y-58105198D01*
X95220599Y-58898599D01*
X95055852Y-59145161D01*
X94998000Y-59436000D01*
X94998000Y-63341719D01*
X94898150Y-63582185D01*
X94897851Y-63924314D01*
X95028503Y-64240514D01*
X95270213Y-64482647D01*
X95586185Y-64613850D01*
X95928314Y-64614149D01*
X96244514Y-64483497D01*
X96486647Y-64241787D01*
X96522811Y-64154692D01*
X100627073Y-64154692D01*
X100725736Y-64421547D01*
X101335461Y-64648068D01*
X101985460Y-64624016D01*
X102474264Y-64421547D01*
X102572927Y-64154692D01*
X101600000Y-63181765D01*
X100627073Y-64154692D01*
X96522811Y-64154692D01*
X96617850Y-63925815D01*
X96618149Y-63583686D01*
X96518000Y-63341308D01*
X96518000Y-62737621D01*
X99954092Y-62737621D01*
X99978144Y-63387620D01*
X100180613Y-63876424D01*
X100447468Y-63975087D01*
X101420395Y-63002160D01*
X100447468Y-62029233D01*
X100180613Y-62127896D01*
X99954092Y-62737621D01*
X96518000Y-62737621D01*
X96518000Y-59750802D01*
X97311401Y-58957401D01*
X97476148Y-58710839D01*
X97534000Y-58420000D01*
X97534000Y-56575667D01*
X97816811Y-56386698D01*
X98044000Y-56046686D01*
X98271189Y-56386698D01*
X98554000Y-56575667D01*
X98554000Y-57404000D01*
X98611852Y-57694839D01*
X98776599Y-57941401D01*
X102384695Y-61549497D01*
X101864539Y-61356252D01*
X101214540Y-61380304D01*
X100725736Y-61582773D01*
X100627073Y-61849628D01*
X101600000Y-62822555D01*
X101614143Y-62808413D01*
X101793748Y-62988018D01*
X101779605Y-63002160D01*
X102752532Y-63975087D01*
X103019387Y-63876424D01*
X103245908Y-63266699D01*
X103221856Y-62616700D01*
X103059192Y-62223994D01*
X104364599Y-63529401D01*
X104611160Y-63694148D01*
X104902000Y-63752000D01*
X106111198Y-63752000D01*
X106904599Y-64545401D01*
X107151161Y-64710148D01*
X107442000Y-64768000D01*
X108045719Y-64768000D01*
X108286185Y-64867850D01*
X108628314Y-64868149D01*
X108944514Y-64737497D01*
X109186647Y-64495787D01*
X109317850Y-64179815D01*
X109318149Y-63837686D01*
X109187497Y-63521486D01*
X109176299Y-63510268D01*
X109201441Y-63494090D01*
X109346431Y-63281890D01*
X109397440Y-63030000D01*
X109397440Y-61430000D01*
X109353162Y-61194683D01*
X109214090Y-60978559D01*
X109001890Y-60833569D01*
X108857625Y-60804355D01*
X108964698Y-60732811D01*
X109275767Y-60267264D01*
X109385000Y-59718113D01*
X109385000Y-59661887D01*
X109275767Y-59112736D01*
X108964698Y-58647189D01*
X108624686Y-58420000D01*
X108964698Y-58192811D01*
X109275767Y-57727264D01*
X109385000Y-57178113D01*
X109385000Y-57121887D01*
X109275767Y-56572736D01*
X108964698Y-56107189D01*
X108624686Y-55880000D01*
X112108655Y-55880000D01*
X112222729Y-56453489D01*
X112547585Y-56939670D01*
X112862366Y-57150000D01*
X112547585Y-57360330D01*
X112222729Y-57846511D01*
X112108655Y-58420000D01*
X112222729Y-58993489D01*
X112547585Y-59479670D01*
X112862366Y-59690000D01*
X112547585Y-59900330D01*
X112222729Y-60386511D01*
X112108655Y-60960000D01*
X112222729Y-61533489D01*
X112547585Y-62019670D01*
X112857069Y-62226461D01*
X112441268Y-62597964D01*
X112187291Y-63125209D01*
X112184642Y-63140974D01*
X112305783Y-63373000D01*
X113665000Y-63373000D01*
X113665000Y-63353000D01*
X113919000Y-63353000D01*
X113919000Y-63373000D01*
X115278217Y-63373000D01*
X115399358Y-63140974D01*
X115396709Y-63125209D01*
X115142732Y-62597964D01*
X114726931Y-62226461D01*
X115036415Y-62019670D01*
X115361271Y-61533489D01*
X115475345Y-60960000D01*
X115361271Y-60386511D01*
X115036415Y-59900330D01*
X114721634Y-59690000D01*
X115036415Y-59479670D01*
X115361271Y-58993489D01*
X115475345Y-58420000D01*
X115361271Y-57846511D01*
X115036415Y-57360330D01*
X114721634Y-57150000D01*
X115036415Y-56939670D01*
X115361271Y-56453489D01*
X115475345Y-55880000D01*
X115361271Y-55306511D01*
X115036415Y-54820330D01*
X115022087Y-54810757D01*
X115043317Y-54806762D01*
X115259441Y-54667690D01*
X115404431Y-54455490D01*
X115455440Y-54203600D01*
X115455440Y-52476400D01*
X115411162Y-52241083D01*
X115272090Y-52024959D01*
X115059890Y-51879969D01*
X114808000Y-51828960D01*
X112776000Y-51828960D01*
X112540683Y-51873238D01*
X112324559Y-52012310D01*
X112179569Y-52224510D01*
X112128560Y-52476400D01*
X112128560Y-54203600D01*
X112172838Y-54438917D01*
X112311910Y-54655041D01*
X112524110Y-54800031D01*
X112565439Y-54808400D01*
X112547585Y-54820330D01*
X112222729Y-55306511D01*
X112108655Y-55880000D01*
X108624686Y-55880000D01*
X108964698Y-55652811D01*
X109275767Y-55187264D01*
X109385000Y-54638113D01*
X109385000Y-54581887D01*
X109275767Y-54032736D01*
X108964698Y-53567189D01*
X108624686Y-53340000D01*
X108964698Y-53112811D01*
X109275767Y-52647264D01*
X109385000Y-52098113D01*
X109385000Y-52041887D01*
X109275767Y-51492736D01*
X108964698Y-51027189D01*
X108499151Y-50716120D01*
X107978343Y-50612525D01*
X108350283Y-50240585D01*
X108388110Y-50266431D01*
X108640000Y-50317440D01*
X108930000Y-50317440D01*
X108930000Y-50762000D01*
X108987852Y-51052839D01*
X109152599Y-51299401D01*
X109698599Y-51845401D01*
X109945161Y-52010148D01*
X110236000Y-52068000D01*
X110585719Y-52068000D01*
X110826185Y-52167850D01*
X111168314Y-52168149D01*
X111484514Y-52037497D01*
X111726647Y-51795787D01*
X111857850Y-51479815D01*
X111857980Y-51331086D01*
X111992514Y-51275497D01*
X112234647Y-51033787D01*
X112365850Y-50717815D01*
X112366149Y-50375686D01*
X112311024Y-50242274D01*
X112373750Y-50305000D01*
X112466310Y-50305000D01*
X112699699Y-50208327D01*
X112878327Y-50029698D01*
X112975000Y-49796309D01*
X112975000Y-48805750D01*
X112816250Y-48647000D01*
X112215000Y-48647000D01*
X112215000Y-48667000D01*
X112036250Y-48667000D01*
X112016250Y-48647000D01*
X111943000Y-48647000D01*
X111943000Y-48393000D01*
X112016250Y-48393000D01*
X112036250Y-48373000D01*
X112215000Y-48373000D01*
X112215000Y-48393000D01*
X112816250Y-48393000D01*
X112975000Y-48234250D01*
X112975000Y-47243691D01*
X112878327Y-47010302D01*
X112873185Y-47005160D01*
X112904873Y-47005188D01*
X113303800Y-46840354D01*
X113609282Y-46535405D01*
X113774811Y-46136767D01*
X113775188Y-45705127D01*
X113610354Y-45306200D01*
X113305405Y-45000718D01*
X112906767Y-44835189D01*
X112475127Y-44834812D01*
X112076200Y-44999646D01*
X111770718Y-45304595D01*
X111605189Y-45703233D01*
X111604812Y-46134873D01*
X111769646Y-46533800D01*
X111970495Y-46735000D01*
X111962998Y-46735000D01*
X111962998Y-46891748D01*
X111806250Y-46735000D01*
X111713690Y-46735000D01*
X111690000Y-46744813D01*
X111666310Y-46735000D01*
X111573750Y-46735000D01*
X111415000Y-46893750D01*
X111415000Y-46896974D01*
X111301673Y-47010302D01*
X111286577Y-47046747D01*
X111204090Y-46918559D01*
X111159001Y-46887751D01*
X111006250Y-46735000D01*
X110913690Y-46735000D01*
X110876829Y-46750268D01*
X110740000Y-46722560D01*
X110240000Y-46722560D01*
X110084493Y-46751821D01*
X109940000Y-46722560D01*
X109440000Y-46722560D01*
X109284493Y-46751821D01*
X109140000Y-46722560D01*
X109021800Y-46722560D01*
X109209282Y-46535405D01*
X109374811Y-46136767D01*
X109375188Y-45705127D01*
X109210354Y-45306200D01*
X108905405Y-45000718D01*
X108506767Y-44835189D01*
X108075127Y-44834812D01*
X107676200Y-44999646D01*
X107370718Y-45304595D01*
X107205189Y-45703233D01*
X107204812Y-46134873D01*
X107369646Y-46533800D01*
X107674595Y-46839282D01*
X108073233Y-47004811D01*
X108120954Y-47004853D01*
X108043569Y-47118110D01*
X107992560Y-47370000D01*
X107992560Y-47425000D01*
X107927660Y-47425000D01*
X107867815Y-47400150D01*
X107687440Y-47399992D01*
X107687440Y-47170000D01*
X107643162Y-46934683D01*
X107504090Y-46718559D01*
X107291890Y-46573569D01*
X107040000Y-46522560D01*
X105040000Y-46522560D01*
X104804683Y-46566838D01*
X104588559Y-46705910D01*
X104443569Y-46918110D01*
X104392560Y-47170000D01*
X104392560Y-49670000D01*
X104436838Y-49905317D01*
X104575910Y-50121441D01*
X104788110Y-50266431D01*
X105040000Y-50317440D01*
X105911692Y-50317440D01*
X105581566Y-50647566D01*
X105400561Y-50918459D01*
X105337000Y-51238000D01*
X105337000Y-61722000D01*
X105400561Y-62041541D01*
X105527822Y-62232000D01*
X105216802Y-62232000D01*
X100074000Y-57089198D01*
X100074000Y-56575667D01*
X100356811Y-56386698D01*
X100584000Y-56046686D01*
X100811189Y-56386698D01*
X101276736Y-56697767D01*
X101825887Y-56807000D01*
X101882113Y-56807000D01*
X102431264Y-56697767D01*
X102896811Y-56386698D01*
X103207880Y-55921151D01*
X103317113Y-55372000D01*
X103207880Y-54822849D01*
X102896811Y-54357302D01*
X102614000Y-54168333D01*
X102614000Y-53086000D01*
X102556148Y-52795161D01*
X102391401Y-52548599D01*
X101375401Y-51532599D01*
X101128839Y-51367852D01*
X100838000Y-51310000D01*
X100488281Y-51310000D01*
X100247815Y-51210150D01*
X100074000Y-51209998D01*
X100074000Y-50546000D01*
X100016148Y-50255161D01*
X99851401Y-50008599D01*
X99089401Y-49246599D01*
X98842839Y-49081852D01*
X98552000Y-49024000D01*
X97143560Y-49024000D01*
X97216229Y-48993974D01*
X97542827Y-48667945D01*
X97719798Y-48241751D01*
X97719799Y-48239726D01*
X100399799Y-48239726D01*
X100576026Y-48666229D01*
X100902055Y-48992827D01*
X101328249Y-49169798D01*
X101789726Y-49170201D01*
X102216229Y-48993974D01*
X102542827Y-48667945D01*
X102719798Y-48241751D01*
X102720201Y-47780274D01*
X102543974Y-47353771D01*
X102217945Y-47027173D01*
X101791751Y-46850202D01*
X101330274Y-46849799D01*
X100903771Y-47026026D01*
X100577173Y-47352055D01*
X100400202Y-47778249D01*
X100399799Y-48239726D01*
X97719799Y-48239726D01*
X97720201Y-47780274D01*
X97543974Y-47353771D01*
X97217945Y-47027173D01*
X96791751Y-46850202D01*
X96330274Y-46849799D01*
X95903771Y-47026026D01*
X95577173Y-47352055D01*
X95400202Y-47778249D01*
X95399799Y-48239726D01*
X95576026Y-48666229D01*
X95902055Y-48992827D01*
X95977128Y-49024000D01*
X93532802Y-49024000D01*
X93470000Y-48961198D01*
X93470000Y-48260000D01*
X93412148Y-47969161D01*
X93247401Y-47722599D01*
X92879969Y-47355167D01*
X93023697Y-47355292D01*
X93643229Y-47099306D01*
X94117640Y-46625722D01*
X94374707Y-46006638D01*
X94375292Y-45336303D01*
X94119306Y-44716771D01*
X93645722Y-44242360D01*
X93026638Y-43985293D01*
X92740721Y-43985043D01*
X92949738Y-43481675D01*
X92950262Y-42880960D01*
X92792857Y-42500011D01*
X93309868Y-41983000D01*
X104392560Y-41983000D01*
X104392560Y-44170000D01*
X104436838Y-44405317D01*
X104575910Y-44621441D01*
X104788110Y-44766431D01*
X105040000Y-44817440D01*
X107040000Y-44817440D01*
X107275317Y-44773162D01*
X107491441Y-44634090D01*
X107636431Y-44421890D01*
X107687440Y-44170000D01*
X107687440Y-41670000D01*
X107643162Y-41434683D01*
X107588670Y-41350000D01*
X113390107Y-41350000D01*
X113343569Y-41418110D01*
G36*
X91261289Y-41669843D02*
X91140960Y-41669738D01*
X90585771Y-41899138D01*
X90160630Y-42323537D01*
X89930262Y-42878325D01*
X89929763Y-43450393D01*
X89713923Y-43234176D01*
X89186691Y-43015250D01*
X88615813Y-43014752D01*
X88450086Y-43083229D01*
X88450262Y-42880960D01*
X88220862Y-42325771D01*
X87796463Y-41900630D01*
X87241675Y-41670262D01*
X86640960Y-41669738D01*
X86085771Y-41899138D01*
X85660630Y-42323537D01*
X85430262Y-42878325D01*
X85429738Y-43479040D01*
X85638782Y-43984963D01*
X85346303Y-43984708D01*
X84726771Y-44240694D01*
X84252360Y-44714278D01*
X83995293Y-45333362D01*
X83994708Y-46003697D01*
X84250694Y-46623229D01*
X84477629Y-46850560D01*
X84328000Y-46850560D01*
X84092683Y-46894838D01*
X83876559Y-47033910D01*
X83820626Y-47115770D01*
X83776090Y-47046559D01*
X83563890Y-46901569D01*
X83312000Y-46850560D01*
X81788000Y-46850560D01*
X81552683Y-46894838D01*
X81336559Y-47033910D01*
X81280626Y-47115770D01*
X81236090Y-47046559D01*
X81023890Y-46901569D01*
X80772000Y-46850560D01*
X79248000Y-46850560D01*
X79012683Y-46894838D01*
X78796559Y-47033910D01*
X78740626Y-47115770D01*
X78696090Y-47046559D01*
X78553598Y-46949199D01*
X78877640Y-46625722D01*
X79134707Y-46006638D01*
X79135292Y-45336303D01*
X78879306Y-44716771D01*
X78405722Y-44242360D01*
X77786638Y-43985293D01*
X77500721Y-43985043D01*
X77709738Y-43481675D01*
X77710262Y-42880960D01*
X77480862Y-42325771D01*
X77056463Y-41900630D01*
X76501675Y-41670262D01*
X75900960Y-41669738D01*
X75345771Y-41899138D01*
X74920630Y-42323537D01*
X74690262Y-42878325D01*
X74689763Y-43450393D01*
X74473923Y-43234176D01*
X73946691Y-43015250D01*
X73375813Y-43014752D01*
X73207274Y-43084391D01*
X73195579Y-42814542D01*
X73015953Y-42380884D01*
X72762060Y-42297545D01*
X71879605Y-43180000D01*
X71893748Y-43194143D01*
X71714143Y-43373748D01*
X71700000Y-43359605D01*
X71685858Y-43373748D01*
X71506253Y-43194143D01*
X71520395Y-43180000D01*
X70637940Y-42297545D01*
X70384047Y-42380884D01*
X70178410Y-42945306D01*
X70204421Y-43545458D01*
X70384047Y-43979116D01*
X70401869Y-43984966D01*
X70106303Y-43984708D01*
X69486771Y-44240694D01*
X69290000Y-44437122D01*
X69290000Y-42117940D01*
X70817545Y-42117940D01*
X71700000Y-43000395D01*
X72582455Y-42117940D01*
X72499116Y-41864047D01*
X71934694Y-41658410D01*
X71334542Y-41684421D01*
X70900884Y-41864047D01*
X70817545Y-42117940D01*
X69290000Y-42117940D01*
X69290000Y-41350000D01*
X91581132Y-41350000D01*
X91261289Y-41669843D01*
X91261289Y-41669843D01*
G37*
X91261289Y-41669843D02*
X91140960Y-41669738D01*
X90585771Y-41899138D01*
X90160630Y-42323537D01*
X89930262Y-42878325D01*
X89929763Y-43450393D01*
X89713923Y-43234176D01*
X89186691Y-43015250D01*
X88615813Y-43014752D01*
X88450086Y-43083229D01*
X88450262Y-42880960D01*
X88220862Y-42325771D01*
X87796463Y-41900630D01*
X87241675Y-41670262D01*
X86640960Y-41669738D01*
X86085771Y-41899138D01*
X85660630Y-42323537D01*
X85430262Y-42878325D01*
X85429738Y-43479040D01*
X85638782Y-43984963D01*
X85346303Y-43984708D01*
X84726771Y-44240694D01*
X84252360Y-44714278D01*
X83995293Y-45333362D01*
X83994708Y-46003697D01*
X84250694Y-46623229D01*
X84477629Y-46850560D01*
X84328000Y-46850560D01*
X84092683Y-46894838D01*
X83876559Y-47033910D01*
X83820626Y-47115770D01*
X83776090Y-47046559D01*
X83563890Y-46901569D01*
X83312000Y-46850560D01*
X81788000Y-46850560D01*
X81552683Y-46894838D01*
X81336559Y-47033910D01*
X81280626Y-47115770D01*
X81236090Y-47046559D01*
X81023890Y-46901569D01*
X80772000Y-46850560D01*
X79248000Y-46850560D01*
X79012683Y-46894838D01*
X78796559Y-47033910D01*
X78740626Y-47115770D01*
X78696090Y-47046559D01*
X78553598Y-46949199D01*
X78877640Y-46625722D01*
X79134707Y-46006638D01*
X79135292Y-45336303D01*
X78879306Y-44716771D01*
X78405722Y-44242360D01*
X77786638Y-43985293D01*
X77500721Y-43985043D01*
X77709738Y-43481675D01*
X77710262Y-42880960D01*
X77480862Y-42325771D01*
X77056463Y-41900630D01*
X76501675Y-41670262D01*
X75900960Y-41669738D01*
X75345771Y-41899138D01*
X74920630Y-42323537D01*
X74690262Y-42878325D01*
X74689763Y-43450393D01*
X74473923Y-43234176D01*
X73946691Y-43015250D01*
X73375813Y-43014752D01*
X73207274Y-43084391D01*
X73195579Y-42814542D01*
X73015953Y-42380884D01*
X72762060Y-42297545D01*
X71879605Y-43180000D01*
X71893748Y-43194143D01*
X71714143Y-43373748D01*
X71700000Y-43359605D01*
X71685858Y-43373748D01*
X71506253Y-43194143D01*
X71520395Y-43180000D01*
X70637940Y-42297545D01*
X70384047Y-42380884D01*
X70178410Y-42945306D01*
X70204421Y-43545458D01*
X70384047Y-43979116D01*
X70401869Y-43984966D01*
X70106303Y-43984708D01*
X69486771Y-44240694D01*
X69290000Y-44437122D01*
X69290000Y-42117940D01*
X70817545Y-42117940D01*
X71700000Y-43000395D01*
X72582455Y-42117940D01*
X72499116Y-41864047D01*
X71934694Y-41658410D01*
X71334542Y-41684421D01*
X70900884Y-41864047D01*
X70817545Y-42117940D01*
X69290000Y-42117940D01*
X69290000Y-41350000D01*
X91581132Y-41350000D01*
X91261289Y-41669843D01*
M02*
