(kicad_pcb (version 4) (host pcbnew 4.0.5+dfsg1-4)

  (general
    (links 35)
    (no_connects 12)
    (area 114.224999 70.028999 172.287001 126.059001)
    (thickness 1.6)
    (drawings 7)
    (tracks 111)
    (zones 0)
    (modules 11)
    (nets 26)
  )

  (page A4)
  (layers
    (0 F.Cu signal)
    (31 B.Cu mixed)
    (32 B.Adhes user)
    (33 F.Adhes user)
    (34 B.Paste user)
    (35 F.Paste user)
    (36 B.SilkS user)
    (37 F.SilkS user)
    (38 B.Mask user)
    (39 F.Mask user)
    (40 Dwgs.User user hide)
    (41 Cmts.User user)
    (42 Eco1.User user)
    (43 Eco2.User user)
    (44 Edge.Cuts user)
    (45 Margin user)
    (46 B.CrtYd user)
    (47 F.CrtYd user)
    (48 B.Fab user)
    (49 F.Fab user)
  )

  (setup
    (last_trace_width 0.6)
    (user_trace_width 0.2)
    (user_trace_width 0.6)
    (trace_clearance 0.5)
    (zone_clearance 0.508)
    (zone_45_only no)
    (trace_min 0.2)
    (segment_width 0.2)
    (edge_width 0.15)
    (via_size 0.6)
    (via_drill 0.4)
    (via_min_size 0.4)
    (via_min_drill 0.3)
    (uvia_size 0.3)
    (uvia_drill 0.1)
    (uvias_allowed no)
    (uvia_min_size 0.2)
    (uvia_min_drill 0.1)
    (pcb_text_width 0.3)
    (pcb_text_size 1.5 1.5)
    (mod_edge_width 0.15)
    (mod_text_size 1 1)
    (mod_text_width 0.15)
    (pad_size 1.524 1.524)
    (pad_drill 0.762)
    (pad_to_mask_clearance 0.2)
    (aux_axis_origin 0 0)
    (visible_elements FFFFFF7F)
    (pcbplotparams
      (layerselection 0x00030_80000001)
      (usegerberextensions false)
      (excludeedgelayer true)
      (linewidth 0.100000)
      (plotframeref false)
      (viasonmask false)
      (mode 1)
      (useauxorigin false)
      (hpglpennumber 1)
      (hpglpenspeed 20)
      (hpglpendiameter 15)
      (hpglpenoverlay 2)
      (psnegative false)
      (psa4output false)
      (plotreference true)
      (plotvalue true)
      (plotinvisibletext false)
      (padsonsilk false)
      (subtractmaskfromsilk false)
      (outputformat 1)
      (mirror false)
      (drillshape 1)
      (scaleselection 1)
      (outputdirectory ""))
  )

  (net 0 "")
  (net 1 "Net-(I2C_1-Pad2)")
  (net 2 "Net-(I2C_1-Pad3)")
  (net 3 "Net-(J1-Pad1)")
  (net 4 "Net-(J2-Pad1)")
  (net 5 "Net-(J3-Pad1)")
  (net 6 "Net-(MPX1-Pad4)")
  (net 7 "Net-(P1-Pad2)")
  (net 8 "Net-(P1-Pad3)")
  (net 9 "Net-(P1-Pad4)")
  (net 10 "Net-(RN2-Pad2)")
  (net 11 "Net-(SW1-Pad1)")
  (net 12 "Net-(U1-Pad1)")
  (net 13 "Net-(U1-Pad2)")
  (net 14 "Net-(U1-Pad7)")
  (net 15 "Net-(U1-Pad8)")
  (net 16 "Net-(U1-Pad14)")
  (net 17 "Net-(U1-Pad15)")
  (net 18 "Net-(U1-Pad16)")
  (net 19 "Net-(U1-Pad24)")
  (net 20 "Net-(P1-Pad1)")
  (net 21 +5V)
  (net 22 GND)
  (net 23 "Net-(I2C_1-Pad5)")
  (net 24 "Net-(U1-Pad3)")
  (net 25 "Net-(U1-Pad4)")

  (net_class Default "This is the default net class."
    (clearance 0.5)
    (trace_width 0.6)
    (via_dia 0.6)
    (via_drill 0.4)
    (uvia_dia 0.3)
    (uvia_drill 0.1)
    (add_net +5V)
    (add_net GND)
    (add_net "Net-(I2C_1-Pad2)")
    (add_net "Net-(I2C_1-Pad3)")
    (add_net "Net-(I2C_1-Pad5)")
    (add_net "Net-(J1-Pad1)")
    (add_net "Net-(J2-Pad1)")
    (add_net "Net-(J3-Pad1)")
    (add_net "Net-(MPX1-Pad4)")
    (add_net "Net-(P1-Pad1)")
    (add_net "Net-(P1-Pad2)")
    (add_net "Net-(P1-Pad3)")
    (add_net "Net-(P1-Pad4)")
    (add_net "Net-(RN2-Pad2)")
    (add_net "Net-(SW1-Pad1)")
    (add_net "Net-(U1-Pad1)")
    (add_net "Net-(U1-Pad14)")
    (add_net "Net-(U1-Pad15)")
    (add_net "Net-(U1-Pad16)")
    (add_net "Net-(U1-Pad2)")
    (add_net "Net-(U1-Pad24)")
    (add_net "Net-(U1-Pad3)")
    (add_net "Net-(U1-Pad4)")
    (add_net "Net-(U1-Pad7)")
    (add_net "Net-(U1-Pad8)")
  )

  (net_class power ""
    (clearance 0.5)
    (trace_width 0.6)
    (via_dia 0.6)
    (via_drill 0.4)
    (uvia_dia 0.3)
    (uvia_drill 0.1)
  )

  (module Connectors:Stereo_Jack_3.5mm_Switch_Ledino_KB3SPRS (layer F.Cu) (tedit 59B11716) (tstamp 5AF01EF0)
    (at 162.56 117.348 90)
    (descr https://www.reichelt.de/index.html?ACTION=7&LA=3&OPEN=0&INDEX=0&FILENAME=C160%252FKB3SPRS.pdf)
    (tags "jack stereo TRS")
    (path /5AED63DF)
    (fp_text reference J3 (at -3.5 2.3 90) (layer F.SilkS)
      (effects (font (size 1 1) (thickness 0.15)))
    )
    (fp_text value "JACK External Switch" (at 2.3 -12.2 90) (layer F.Fab)
      (effects (font (size 1 1) (thickness 0.15)))
    )
    (fp_line (start -9.3 -7.6) (end -9.3 -1.6) (layer F.Fab) (width 0.1))
    (fp_line (start -9.3 -1.6) (end -5.7 -1.6) (layer F.Fab) (width 0.1))
    (fp_line (start -9.3 -7.6) (end -5.7 -7.6) (layer F.Fab) (width 0.1))
    (fp_line (start -5.7 -10.7) (end -5.7 0.9) (layer F.Fab) (width 0.1))
    (fp_line (start -5.7 0.9) (end 8.6 0.9) (layer F.Fab) (width 0.1))
    (fp_line (start 8.6 0.9) (end 8.6 -10.7) (layer F.Fab) (width 0.1))
    (fp_line (start 8.6 -10.7) (end -5.7 -10.7) (layer F.Fab) (width 0.1))
    (fp_text user %R (at 2.7 -4.6 90) (layer F.Fab)
      (effects (font (size 1 1) (thickness 0.15)))
    )
    (fp_line (start -9.8 2) (end 9.1 2) (layer F.CrtYd) (width 0.05))
    (fp_line (start 9.1 -11.4) (end -9.8 -11.4) (layer F.CrtYd) (width 0.05))
    (fp_line (start -5.8 -10.8) (end 2.2 -10.8) (layer F.SilkS) (width 0.15))
    (fp_line (start 6 -10.8) (end 8.7 -10.8) (layer F.SilkS) (width 0.15))
    (fp_line (start 8.7 -10.8) (end 8.7 1) (layer F.SilkS) (width 0.15))
    (fp_line (start 8.7 1) (end 8.6 1) (layer F.SilkS) (width 0.15))
    (fp_line (start 6 1) (end 1.9 1) (layer F.SilkS) (width 0.15))
    (fp_line (start -1.9 1) (end -5.8 1) (layer F.SilkS) (width 0.15))
    (fp_line (start -5.8 1) (end -5.8 -10.8) (layer F.SilkS) (width 0.15))
    (fp_line (start -5.8 -7.7) (end -9.4 -7.7) (layer F.SilkS) (width 0.15))
    (fp_line (start -9.4 -7.7) (end -9.4 -1.5) (layer F.SilkS) (width 0.15))
    (fp_line (start -9.4 -1.5) (end -5.8 -1.5) (layer F.SilkS) (width 0.15))
    (fp_line (start -9.8 -11.4) (end -9.8 2) (layer F.CrtYd) (width 0.05))
    (fp_line (start 9.1 2) (end 9.1 -11.4) (layer F.CrtYd) (width 0.05))
    (pad 1 thru_hole oval (at 0 0 90) (size 4 2.2) (drill 1.3) (layers *.Cu *.Mask)
      (net 5 "Net-(J3-Pad1)"))
    (pad 4 thru_hole oval (at 7.3 -0.5 180) (size 4 2.2) (drill 1.3) (layers *.Cu *.Mask))
    (pad 5 thru_hole oval (at 2.9 -7.1 90) (size 4 2.2) (drill 1.3) (layers *.Cu *.Mask))
    (pad 2 thru_hole oval (at 4.1 -9.8 90) (size 4 2.2) (drill 1.3) (layers *.Cu *.Mask)
      (net 5 "Net-(J3-Pad1)"))
    (pad 3 thru_hole oval (at -3.9 -4.6 90) (size 2.2 4) (drill 1.3) (layers *.Cu *.Mask)
      (net 21 +5V))
    (model ${KISYS3DMOD}/Connectors.3dshapes/Stereo_Jack_3.5mm_Switch_Ledino_KB3SPRS.wrl
      (at (xyz 0 0 0))
      (scale (xyz 1 1 1))
      (rotate (xyz 0 0 0))
    )
  )

  (module promicro:ProMicro (layer F.Cu) (tedit 5A06A962) (tstamp 5AF01F43)
    (at 126.746 88.392 270)
    (descr "Pro Micro footprint")
    (tags "promicro ProMicro")
    (path /5AEC1DA8)
    (fp_text reference U1 (at 0 -10.16 270) (layer F.SilkS) hide
      (effects (font (size 1 1) (thickness 0.15)))
    )
    (fp_text value ProMicro (at 0 10.16 270) (layer F.Fab)
      (effects (font (size 1 1) (thickness 0.15)))
    )
    (fp_line (start 15.24 -8.89) (end 15.24 8.89) (layer B.SilkS) (width 0.15))
    (fp_line (start 15.24 8.89) (end -15.24 8.89) (layer B.SilkS) (width 0.15))
    (fp_line (start -15.24 8.89) (end -15.24 3.81) (layer B.SilkS) (width 0.15))
    (fp_line (start -15.24 3.81) (end -17.78 3.81) (layer B.SilkS) (width 0.15))
    (fp_line (start -17.78 3.81) (end -17.78 -3.81) (layer B.SilkS) (width 0.15))
    (fp_line (start -17.78 -3.81) (end -15.24 -3.81) (layer B.SilkS) (width 0.15))
    (fp_line (start -15.24 -3.81) (end -15.24 -8.89) (layer B.SilkS) (width 0.15))
    (fp_line (start -15.24 -8.89) (end 15.24 -8.89) (layer B.SilkS) (width 0.15))
    (fp_line (start -15.24 8.89) (end 15.24 8.89) (layer F.SilkS) (width 0.15))
    (fp_line (start -15.24 8.89) (end -15.24 3.81) (layer F.SilkS) (width 0.15))
    (fp_line (start -15.24 3.81) (end -17.78 3.81) (layer F.SilkS) (width 0.15))
    (fp_line (start -17.78 3.81) (end -17.78 -3.81) (layer F.SilkS) (width 0.15))
    (fp_line (start -17.78 -3.81) (end -15.24 -3.81) (layer F.SilkS) (width 0.15))
    (fp_line (start -15.24 -3.81) (end -15.24 -8.89) (layer F.SilkS) (width 0.15))
    (fp_line (start -15.24 -8.89) (end 15.24 -8.89) (layer F.SilkS) (width 0.15))
    (fp_line (start 15.24 -8.89) (end 15.24 8.89) (layer F.SilkS) (width 0.15))
    (pad 1 thru_hole rect (at -13.97 7.62 270) (size 1.6 1.6) (drill 1.1) (layers *.Cu *.Mask F.SilkS)
      (net 12 "Net-(U1-Pad1)"))
    (pad 2 thru_hole circle (at -11.43 7.62 270) (size 1.6 1.6) (drill 1.1) (layers *.Cu *.Mask F.SilkS)
      (net 13 "Net-(U1-Pad2)"))
    (pad 3 thru_hole circle (at -8.89 7.62 270) (size 1.6 1.6) (drill 1.1) (layers *.Cu *.Mask F.SilkS)
      (net 24 "Net-(U1-Pad3)"))
    (pad 4 thru_hole circle (at -6.35 7.62 270) (size 1.6 1.6) (drill 1.1) (layers *.Cu *.Mask F.SilkS)
      (net 25 "Net-(U1-Pad4)"))
    (pad 5 thru_hole circle (at -3.81 7.62 270) (size 1.6 1.6) (drill 1.1) (layers *.Cu *.Mask F.SilkS)
      (net 1 "Net-(I2C_1-Pad2)"))
    (pad 6 thru_hole circle (at -1.27 7.62 270) (size 1.6 1.6) (drill 1.1) (layers *.Cu *.Mask F.SilkS)
      (net 2 "Net-(I2C_1-Pad3)"))
    (pad 7 thru_hole circle (at 1.27 7.62 270) (size 1.6 1.6) (drill 1.1) (layers *.Cu *.Mask F.SilkS)
      (net 14 "Net-(U1-Pad7)"))
    (pad 8 thru_hole circle (at 3.81 7.62 270) (size 1.6 1.6) (drill 1.1) (layers *.Cu *.Mask F.SilkS)
      (net 15 "Net-(U1-Pad8)"))
    (pad 9 thru_hole circle (at 6.35 7.62 270) (size 1.6 1.6) (drill 1.1) (layers *.Cu *.Mask F.SilkS)
      (net 3 "Net-(J1-Pad1)"))
    (pad 10 thru_hole circle (at 8.89 7.62 270) (size 1.6 1.6) (drill 1.1) (layers *.Cu *.Mask F.SilkS)
      (net 10 "Net-(RN2-Pad2)"))
    (pad 11 thru_hole circle (at 11.43 7.62 270) (size 1.6 1.6) (drill 1.1) (layers *.Cu *.Mask F.SilkS)
      (net 4 "Net-(J2-Pad1)"))
    (pad 12 thru_hole circle (at 13.97 7.62 270) (size 1.6 1.6) (drill 1.1) (layers *.Cu *.Mask F.SilkS)
      (net 5 "Net-(J3-Pad1)"))
    (pad 13 thru_hole circle (at 13.97 -7.62 270) (size 1.6 1.6) (drill 1.1) (layers *.Cu *.Mask F.SilkS)
      (net 6 "Net-(MPX1-Pad4)"))
    (pad 14 thru_hole circle (at 11.43 -7.62 270) (size 1.6 1.6) (drill 1.1) (layers *.Cu *.Mask F.SilkS)
      (net 16 "Net-(U1-Pad14)"))
    (pad 15 thru_hole circle (at 8.89 -7.62 270) (size 1.6 1.6) (drill 1.1) (layers *.Cu *.Mask F.SilkS)
      (net 17 "Net-(U1-Pad15)"))
    (pad 16 thru_hole circle (at 6.35 -7.62 270) (size 1.6 1.6) (drill 1.1) (layers *.Cu *.Mask F.SilkS)
      (net 18 "Net-(U1-Pad16)"))
    (pad 17 thru_hole circle (at 3.81 -7.62 270) (size 1.6 1.6) (drill 1.1) (layers *.Cu *.Mask F.SilkS)
      (net 9 "Net-(P1-Pad4)"))
    (pad 18 thru_hole circle (at 1.27 -7.62 270) (size 1.6 1.6) (drill 1.1) (layers *.Cu *.Mask F.SilkS)
      (net 8 "Net-(P1-Pad3)"))
    (pad 19 thru_hole circle (at -1.27 -7.62 270) (size 1.6 1.6) (drill 1.1) (layers *.Cu *.Mask F.SilkS)
      (net 7 "Net-(P1-Pad2)"))
    (pad 20 thru_hole circle (at -3.81 -7.62 270) (size 1.6 1.6) (drill 1.1) (layers *.Cu *.Mask F.SilkS)
      (net 20 "Net-(P1-Pad1)"))
    (pad 21 thru_hole circle (at -6.35 -7.62 270) (size 1.6 1.6) (drill 1.1) (layers *.Cu *.Mask F.SilkS)
      (net 21 +5V))
    (pad 22 thru_hole circle (at -8.89 -7.62 270) (size 1.6 1.6) (drill 1.1) (layers *.Cu *.Mask F.SilkS)
      (net 11 "Net-(SW1-Pad1)"))
    (pad 23 thru_hole circle (at -11.43 -7.62 270) (size 1.6 1.6) (drill 1.1) (layers *.Cu *.Mask F.SilkS)
      (net 22 GND))
    (pad 24 thru_hole circle (at -13.97 -7.62 270) (size 1.6 1.6) (drill 1.1) (layers *.Cu *.Mask F.SilkS)
      (net 19 "Net-(U1-Pad24)"))
  )

  (module Connectors:USB_Micro-B (layer B.Cu) (tedit 5543E447) (tstamp 5AF01ED5)
    (at 144.78 120.65 180)
    (descr "Micro USB Type B Receptacle")
    (tags "USB USB_B USB_micro USB_OTG")
    (path /5AED8076)
    (attr smd)
    (fp_text reference I2C_1 (at 0 3.24 180) (layer B.SilkS)
      (effects (font (size 1 1) (thickness 0.15)) (justify mirror))
    )
    (fp_text value MicroUSB (at 0 -5.01 180) (layer B.Fab)
      (effects (font (size 1 1) (thickness 0.15)) (justify mirror))
    )
    (fp_line (start -4.6 2.59) (end 4.6 2.59) (layer B.CrtYd) (width 0.05))
    (fp_line (start 4.6 2.59) (end 4.6 -4.26) (layer B.CrtYd) (width 0.05))
    (fp_line (start 4.6 -4.26) (end -4.6 -4.26) (layer B.CrtYd) (width 0.05))
    (fp_line (start -4.6 -4.26) (end -4.6 2.59) (layer B.CrtYd) (width 0.05))
    (fp_line (start -4.35 -4.03) (end 4.35 -4.03) (layer B.SilkS) (width 0.12))
    (fp_line (start -4.35 2.38) (end 4.35 2.38) (layer B.SilkS) (width 0.12))
    (fp_line (start 4.35 2.38) (end 4.35 -4.03) (layer B.SilkS) (width 0.12))
    (fp_line (start 4.35 -2.8) (end -4.35 -2.8) (layer B.SilkS) (width 0.12))
    (fp_line (start -4.35 -4.03) (end -4.35 2.38) (layer B.SilkS) (width 0.12))
    (pad 1 smd rect (at -1.3 1.35 90) (size 1.35 0.4) (layers B.Cu B.Paste B.Mask)
      (net 21 +5V))
    (pad 2 smd rect (at -0.65 1.35 90) (size 1.35 0.4) (layers B.Cu B.Paste B.Mask)
      (net 1 "Net-(I2C_1-Pad2)"))
    (pad 3 smd rect (at 0 1.35 90) (size 1.35 0.4) (layers B.Cu B.Paste B.Mask)
      (net 2 "Net-(I2C_1-Pad3)"))
    (pad 4 smd rect (at 0.65 1.35 90) (size 1.35 0.4) (layers B.Cu B.Paste B.Mask)
      (net 22 GND))
    (pad 5 smd rect (at 1.3 1.35 90) (size 1.35 0.4) (layers B.Cu B.Paste B.Mask)
      (net 23 "Net-(I2C_1-Pad5)"))
    (pad 6 thru_hole oval (at -2.5 1.35 90) (size 0.95 1.25) (drill oval 0.55 0.85) (layers *.Cu *.Mask))
    (pad 6 thru_hole oval (at 2.5 1.35 90) (size 0.95 1.25) (drill oval 0.55 0.85) (layers *.Cu *.Mask))
    (pad 6 thru_hole oval (at -3.5 -1.35 90) (size 1.55 1) (drill oval 1.15 0.5) (layers *.Cu *.Mask))
    (pad 6 thru_hole oval (at 3.5 -1.35 90) (size 1.55 1) (drill oval 1.15 0.5) (layers *.Cu *.Mask))
  )

  (module Connectors:Stereo_Jack_3.5mm_Switch_Ledino_KB3SPRS (layer F.Cu) (tedit 59B11716) (tstamp 5AF01EDE)
    (at 140.716 78.74 270)
    (descr https://www.reichelt.de/index.html?ACTION=7&LA=3&OPEN=0&INDEX=0&FILENAME=C160%252FKB3SPRS.pdf)
    (tags "jack stereo TRS")
    (path /5AED5077)
    (fp_text reference J1 (at -3.5 2.3 270) (layer F.SilkS)
      (effects (font (size 1 1) (thickness 0.15)))
    )
    (fp_text value "JACK External Switch" (at 2.3 -12.2 270) (layer F.Fab)
      (effects (font (size 1 1) (thickness 0.15)))
    )
    (fp_line (start -9.3 -7.6) (end -9.3 -1.6) (layer F.Fab) (width 0.1))
    (fp_line (start -9.3 -1.6) (end -5.7 -1.6) (layer F.Fab) (width 0.1))
    (fp_line (start -9.3 -7.6) (end -5.7 -7.6) (layer F.Fab) (width 0.1))
    (fp_line (start -5.7 -10.7) (end -5.7 0.9) (layer F.Fab) (width 0.1))
    (fp_line (start -5.7 0.9) (end 8.6 0.9) (layer F.Fab) (width 0.1))
    (fp_line (start 8.6 0.9) (end 8.6 -10.7) (layer F.Fab) (width 0.1))
    (fp_line (start 8.6 -10.7) (end -5.7 -10.7) (layer F.Fab) (width 0.1))
    (fp_text user %R (at 2.7 -4.6 270) (layer F.Fab)
      (effects (font (size 1 1) (thickness 0.15)))
    )
    (fp_line (start -9.8 2) (end 9.1 2) (layer F.CrtYd) (width 0.05))
    (fp_line (start 9.1 -11.4) (end -9.8 -11.4) (layer F.CrtYd) (width 0.05))
    (fp_line (start -5.8 -10.8) (end 2.2 -10.8) (layer F.SilkS) (width 0.15))
    (fp_line (start 6 -10.8) (end 8.7 -10.8) (layer F.SilkS) (width 0.15))
    (fp_line (start 8.7 -10.8) (end 8.7 1) (layer F.SilkS) (width 0.15))
    (fp_line (start 8.7 1) (end 8.6 1) (layer F.SilkS) (width 0.15))
    (fp_line (start 6 1) (end 1.9 1) (layer F.SilkS) (width 0.15))
    (fp_line (start -1.9 1) (end -5.8 1) (layer F.SilkS) (width 0.15))
    (fp_line (start -5.8 1) (end -5.8 -10.8) (layer F.SilkS) (width 0.15))
    (fp_line (start -5.8 -7.7) (end -9.4 -7.7) (layer F.SilkS) (width 0.15))
    (fp_line (start -9.4 -7.7) (end -9.4 -1.5) (layer F.SilkS) (width 0.15))
    (fp_line (start -9.4 -1.5) (end -5.8 -1.5) (layer F.SilkS) (width 0.15))
    (fp_line (start -9.8 -11.4) (end -9.8 2) (layer F.CrtYd) (width 0.05))
    (fp_line (start 9.1 2) (end 9.1 -11.4) (layer F.CrtYd) (width 0.05))
    (pad 1 thru_hole oval (at 0 0 270) (size 4 2.2) (drill 1.3) (layers *.Cu *.Mask)
      (net 3 "Net-(J1-Pad1)"))
    (pad 4 thru_hole oval (at 7.3 -0.5) (size 4 2.2) (drill 1.3) (layers *.Cu *.Mask))
    (pad 5 thru_hole oval (at 2.9 -7.1 270) (size 4 2.2) (drill 1.3) (layers *.Cu *.Mask))
    (pad 2 thru_hole oval (at 4.1 -9.8 270) (size 4 2.2) (drill 1.3) (layers *.Cu *.Mask)
      (net 3 "Net-(J1-Pad1)"))
    (pad 3 thru_hole oval (at -3.9 -4.6 270) (size 2.2 4) (drill 1.3) (layers *.Cu *.Mask)
      (net 21 +5V))
    (model ${KISYS3DMOD}/Connectors.3dshapes/Stereo_Jack_3.5mm_Switch_Ledino_KB3SPRS.wrl
      (at (xyz 0 0 0))
      (scale (xyz 1 1 1))
      (rotate (xyz 0 0 0))
    )
  )

  (module Connectors:Stereo_Jack_3.5mm_Switch_Ledino_KB3SPRS (layer F.Cu) (tedit 5AF134C4) (tstamp 5AF01EE7)
    (at 158.115 78.74 270)
    (descr https://www.reichelt.de/index.html?ACTION=7&LA=3&OPEN=0&INDEX=0&FILENAME=C160%252FKB3SPRS.pdf)
    (tags "jack stereo TRS")
    (path /5AED50FD)
    (fp_text reference J2 (at -3.5 2.3 270) (layer F.SilkS)
      (effects (font (size 1 1) (thickness 0.15)))
    )
    (fp_text value "JACK External Switch" (at 2.3 -12.2 270) (layer F.Fab)
      (effects (font (size 1 1) (thickness 0.15)))
    )
    (fp_line (start -9.3 -7.6) (end -9.3 -1.6) (layer F.Fab) (width 0.1))
    (fp_line (start -9.3 -1.6) (end -5.7 -1.6) (layer F.Fab) (width 0.1))
    (fp_line (start -9.3 -7.6) (end -5.7 -7.6) (layer F.Fab) (width 0.1))
    (fp_line (start -5.7 -10.7) (end -5.7 0.9) (layer F.Fab) (width 0.1))
    (fp_line (start -5.7 0.9) (end 8.6 0.9) (layer F.Fab) (width 0.1))
    (fp_line (start 8.6 0.9) (end 8.6 -10.7) (layer F.Fab) (width 0.1))
    (fp_line (start 8.6 -10.7) (end -5.7 -10.7) (layer F.Fab) (width 0.1))
    (fp_text user %R (at 5.207 -3.81 270) (layer F.Fab)
      (effects (font (size 1 1) (thickness 0.15)))
    )
    (fp_line (start -9.8 2) (end 9.1 2) (layer F.CrtYd) (width 0.05))
    (fp_line (start 9.1 -11.4) (end -9.8 -11.4) (layer F.CrtYd) (width 0.05))
    (fp_line (start -5.8 -10.8) (end 2.2 -10.8) (layer F.SilkS) (width 0.15))
    (fp_line (start 6 -10.8) (end 8.7 -10.8) (layer F.SilkS) (width 0.15))
    (fp_line (start 8.7 -10.8) (end 8.7 1) (layer F.SilkS) (width 0.15))
    (fp_line (start 8.7 1) (end 8.6 1) (layer F.SilkS) (width 0.15))
    (fp_line (start 6 1) (end 1.9 1) (layer F.SilkS) (width 0.15))
    (fp_line (start -1.9 1) (end -5.8 1) (layer F.SilkS) (width 0.15))
    (fp_line (start -5.8 1) (end -5.8 -10.8) (layer F.SilkS) (width 0.15))
    (fp_line (start -5.8 -7.7) (end -9.4 -7.7) (layer F.SilkS) (width 0.15))
    (fp_line (start -9.4 -7.7) (end -9.4 -1.5) (layer F.SilkS) (width 0.15))
    (fp_line (start -9.4 -1.5) (end -5.8 -1.5) (layer F.SilkS) (width 0.15))
    (fp_line (start -9.8 -11.4) (end -9.8 2) (layer F.CrtYd) (width 0.05))
    (fp_line (start 9.1 2) (end 9.1 -11.4) (layer F.CrtYd) (width 0.05))
    (pad 1 thru_hole oval (at 0 0 270) (size 4 2.2) (drill 1.3) (layers *.Cu *.Mask)
      (net 4 "Net-(J2-Pad1)"))
    (pad 4 thru_hole oval (at 7.3 -0.5) (size 4 2.2) (drill 1.3) (layers *.Cu *.Mask))
    (pad 5 thru_hole oval (at 2.9 -7.1 270) (size 4 2.2) (drill 1.3) (layers *.Cu *.Mask))
    (pad 2 thru_hole oval (at 4.1 -9.8 270) (size 4 2.2) (drill 1.3) (layers *.Cu *.Mask)
      (net 4 "Net-(J2-Pad1)"))
    (pad 3 thru_hole oval (at -3.9 -4.6 270) (size 2.2 4) (drill 1.3) (layers *.Cu *.Mask)
      (net 21 +5V))
    (model ${KISYS3DMOD}/Connectors.3dshapes/Stereo_Jack_3.5mm_Switch_Ledino_KB3SPRS.wrl
      (at (xyz 0 0 0))
      (scale (xyz 1 1 1))
      (rotate (xyz 0 0 0))
    )
  )

  (module SOP8-1369:SOP8-1369 (layer B.Cu) (tedit 0) (tstamp 5AF01EFC)
    (at 122.301 114.173 90)
    (descr "<b>SOP 8  (CASE 1369-01)</b>")
    (path /5AED4843)
    (attr smd)
    (fp_text reference MPX1 (at -4.17224 -7.41728 90) (layer B.SilkS)
      (effects (font (size 0.834342 0.834342) (thickness 0.05)) (justify mirror))
    )
    (fp_text value MPXV7007GP (at -1.2025 0.093525 90) (layer B.SilkS)
      (effects (font (size 0.673306 0.673306) (thickness 0.05)) (justify mirror))
    )
    (fp_arc (start -5.842 5.842) (end -5.842 6.1595) (angle 90) (layer B.SilkS) (width 0.2032))
    (fp_line (start -5.842 6.1595) (end 5.842 6.1595) (layer B.SilkS) (width 0.2032))
    (fp_arc (start 5.842 5.842) (end 6.1595 5.842) (angle 90) (layer B.SilkS) (width 0.2032))
    (fp_arc (start 5.842 -5.842) (end 5.842 -6.1595) (angle 90) (layer B.SilkS) (width 0.2032))
    (fp_line (start 5.842 -6.1595) (end -5.842 -6.1595) (layer B.SilkS) (width 0.2032))
    (fp_arc (start -5.842 -5.842) (end -6.1595 -5.842) (angle 90) (layer B.SilkS) (width 0.2032))
    (fp_line (start -3.81 6.223) (end -3.81 10.16) (layer Dwgs.User) (width 0.0508))
    (fp_line (start -3.81 10.16) (end -4.445 10.16) (layer Dwgs.User) (width 0.0508))
    (fp_line (start -4.445 10.16) (end -3.81 12.7) (layer Dwgs.User) (width 0.0508))
    (fp_line (start -3.81 12.7) (end -1.27 12.7) (layer Dwgs.User) (width 0.0508))
    (fp_line (start -1.27 12.7) (end -0.635 10.16) (layer Dwgs.User) (width 0.0508))
    (fp_line (start -0.635 10.16) (end -1.27 10.16) (layer Dwgs.User) (width 0.0508))
    (fp_line (start -1.27 10.16) (end -1.27 6.223) (layer Dwgs.User) (width 0.0508))
    (fp_line (start -3.81 10.16) (end -1.27 10.16) (layer Dwgs.User) (width 0.0508))
    (fp_circle (center -4.7625 3.81) (end -4.1635 3.81) (layer B.SilkS) (width 0))
    (fp_poly (pts (xy -9.35022 4.318) (xy -6.223 4.318) (xy -6.223 3.47295) (xy -9.35022 3.47295)) (layer Dwgs.User) (width 0.381))
    (fp_poly (pts (xy 8.89 3.47382) (xy 6.54672 3.47382) (xy 6.54672 4.318) (xy 8.89 4.318)) (layer Dwgs.User) (width 0.381))
    (fp_poly (pts (xy -9.33003 1.778) (xy -6.223 1.778) (xy -6.223 0.799719) (xy -9.33003 0.799719)) (layer Dwgs.User) (width 0.381))
    (fp_poly (pts (xy -9.3229 -0.762) (xy -6.223 -0.762) (xy -6.223 -1.86459) (xy -9.3229 -1.86459)) (layer Dwgs.User) (width 0.381))
    (fp_poly (pts (xy -9.37326 -3.302) (xy -6.223 -3.302) (xy -6.223 -4.5527) (xy -9.37326 -4.5527)) (layer Dwgs.User) (width 0.381))
    (fp_poly (pts (xy 8.89 0.802386) (xy 6.55284 0.802386) (xy 6.55284 1.778) (xy 8.89 1.778)) (layer Dwgs.User) (width 0.381))
    (fp_poly (pts (xy 8.89 -1.87381) (xy 6.55821 -1.87381) (xy 6.55821 -0.762) (xy 8.89 -0.762)) (layer Dwgs.User) (width 0.381))
    (fp_poly (pts (xy 8.89 -4.52207) (xy 6.51705 -4.52207) (xy 6.51705 -3.302) (xy 8.89 -3.302)) (layer Dwgs.User) (width 0.381))
    (pad 1 smd rect (at -8.382 3.81 90) (size 2.54 1.524) (layers B.Cu B.Paste B.Mask))
    (pad 2 smd rect (at -8.382 1.27 90) (size 2.54 1.524) (layers B.Cu B.Paste B.Mask)
      (net 21 +5V))
    (pad 3 smd rect (at -8.382 -1.27 90) (size 2.54 1.524) (layers B.Cu B.Paste B.Mask)
      (net 22 GND))
    (pad 4 smd rect (at -8.382 -3.81 90) (size 2.54 1.524) (layers B.Cu B.Paste B.Mask)
      (net 6 "Net-(MPX1-Pad4)"))
    (pad 5 smd rect (at 8.382 -3.81 90) (size 2.54 1.524) (layers B.Cu B.Paste B.Mask))
    (pad 6 smd rect (at 8.382 -1.27 90) (size 2.54 1.524) (layers B.Cu B.Paste B.Mask))
    (pad 7 smd rect (at 8.382 1.27 90) (size 2.54 1.524) (layers B.Cu B.Paste B.Mask))
    (pad 8 smd rect (at 8.382 3.81 90) (size 2.54 1.524) (layers B.Cu B.Paste B.Mask))
  )

  (module Resistors_THT:Resistor_Array_SIP5 (layer F.Cu) (tedit 57FA3974) (tstamp 5AF01F0E)
    (at 141.605 101.219 90)
    (descr "5-pin Resistor SIP pack")
    (tags R)
    (path /5AEC2168)
    (fp_text reference RN1 (at 6.35 -2.4 90) (layer F.SilkS)
      (effects (font (size 1 1) (thickness 0.15)))
    )
    (fp_text value "RNet 10k" (at 6.35 2.4 90) (layer F.Fab)
      (effects (font (size 1 1) (thickness 0.15)))
    )
    (fp_line (start -1.29 -1.25) (end -1.29 1.25) (layer F.Fab) (width 0.1))
    (fp_line (start -1.29 1.25) (end 11.45 1.25) (layer F.Fab) (width 0.1))
    (fp_line (start 11.45 1.25) (end 11.45 -1.25) (layer F.Fab) (width 0.1))
    (fp_line (start 11.45 -1.25) (end -1.29 -1.25) (layer F.Fab) (width 0.1))
    (fp_line (start 1.27 -1.25) (end 1.27 1.25) (layer F.Fab) (width 0.1))
    (fp_line (start -1.44 -1.4) (end -1.44 1.4) (layer F.SilkS) (width 0.15))
    (fp_line (start -1.44 1.4) (end 11.6 1.4) (layer F.SilkS) (width 0.15))
    (fp_line (start 11.6 1.4) (end 11.6 -1.4) (layer F.SilkS) (width 0.15))
    (fp_line (start 11.6 -1.4) (end -1.44 -1.4) (layer F.SilkS) (width 0.15))
    (fp_line (start 1.27 -1.4) (end 1.27 1.4) (layer F.SilkS) (width 0.15))
    (fp_line (start -1.7 -1.65) (end -1.7 1.65) (layer F.CrtYd) (width 0.05))
    (fp_line (start -1.7 1.65) (end 11.9 1.65) (layer F.CrtYd) (width 0.05))
    (fp_line (start 11.9 1.65) (end 11.9 -1.65) (layer F.CrtYd) (width 0.05))
    (fp_line (start 11.9 -1.65) (end -1.7 -1.65) (layer F.CrtYd) (width 0.05))
    (pad 1 thru_hole rect (at 0 0 90) (size 1.6 1.6) (drill 0.8) (layers *.Cu *.Mask)
      (net 21 +5V))
    (pad 2 thru_hole oval (at 2.54 0 90) (size 1.6 1.6) (drill 0.8) (layers *.Cu *.Mask)
      (net 9 "Net-(P1-Pad4)"))
    (pad 3 thru_hole oval (at 5.08 0 90) (size 1.6 1.6) (drill 0.8) (layers *.Cu *.Mask)
      (net 8 "Net-(P1-Pad3)"))
    (pad 4 thru_hole oval (at 7.62 0 90) (size 1.6 1.6) (drill 0.8) (layers *.Cu *.Mask)
      (net 7 "Net-(P1-Pad2)"))
    (pad 5 thru_hole oval (at 10.16 0 90) (size 1.6 1.6) (drill 0.8) (layers *.Cu *.Mask)
      (net 20 "Net-(P1-Pad1)"))
    (model Resistors_ThroughHole.3dshapes/Resistor_Array_SIP5.wrl
      (at (xyz 0 0 0))
      (scale (xyz 0.393701 0.393701 0.393701))
      (rotate (xyz 0 0 0))
    )
  )

  (module Resistors_THT:Resistor_Array_SIP5 (layer F.Cu) (tedit 57FA3974) (tstamp 5AF01F17)
    (at 151.892 104.775)
    (descr "5-pin Resistor SIP pack")
    (tags R)
    (path /5AED69C9)
    (fp_text reference RN2 (at 6.35 -2.4) (layer F.SilkS)
      (effects (font (size 1 1) (thickness 0.15)))
    )
    (fp_text value "RNet 10k" (at 6.35 2.4) (layer F.Fab)
      (effects (font (size 1 1) (thickness 0.15)))
    )
    (fp_line (start -1.29 -1.25) (end -1.29 1.25) (layer F.Fab) (width 0.1))
    (fp_line (start -1.29 1.25) (end 11.45 1.25) (layer F.Fab) (width 0.1))
    (fp_line (start 11.45 1.25) (end 11.45 -1.25) (layer F.Fab) (width 0.1))
    (fp_line (start 11.45 -1.25) (end -1.29 -1.25) (layer F.Fab) (width 0.1))
    (fp_line (start 1.27 -1.25) (end 1.27 1.25) (layer F.Fab) (width 0.1))
    (fp_line (start -1.44 -1.4) (end -1.44 1.4) (layer F.SilkS) (width 0.15))
    (fp_line (start -1.44 1.4) (end 11.6 1.4) (layer F.SilkS) (width 0.15))
    (fp_line (start 11.6 1.4) (end 11.6 -1.4) (layer F.SilkS) (width 0.15))
    (fp_line (start 11.6 -1.4) (end -1.44 -1.4) (layer F.SilkS) (width 0.15))
    (fp_line (start 1.27 -1.4) (end 1.27 1.4) (layer F.SilkS) (width 0.15))
    (fp_line (start -1.7 -1.65) (end -1.7 1.65) (layer F.CrtYd) (width 0.05))
    (fp_line (start -1.7 1.65) (end 11.9 1.65) (layer F.CrtYd) (width 0.05))
    (fp_line (start 11.9 1.65) (end 11.9 -1.65) (layer F.CrtYd) (width 0.05))
    (fp_line (start 11.9 -1.65) (end -1.7 -1.65) (layer F.CrtYd) (width 0.05))
    (pad 1 thru_hole rect (at 0 0) (size 1.6 1.6) (drill 0.8) (layers *.Cu *.Mask)
      (net 22 GND))
    (pad 2 thru_hole oval (at 2.54 0) (size 1.6 1.6) (drill 0.8) (layers *.Cu *.Mask)
      (net 10 "Net-(RN2-Pad2)"))
    (pad 3 thru_hole oval (at 5.08 0) (size 1.6 1.6) (drill 0.8) (layers *.Cu *.Mask)
      (net 3 "Net-(J1-Pad1)"))
    (pad 4 thru_hole oval (at 7.62 0) (size 1.6 1.6) (drill 0.8) (layers *.Cu *.Mask)
      (net 5 "Net-(J3-Pad1)"))
    (pad 5 thru_hole oval (at 10.16 0) (size 1.6 1.6) (drill 0.8) (layers *.Cu *.Mask)
      (net 4 "Net-(J2-Pad1)"))
    (model Resistors_ThroughHole.3dshapes/Resistor_Array_SIP5.wrl
      (at (xyz 0 0 0))
      (scale (xyz 0.393701 0.393701 0.393701))
      (rotate (xyz 0 0 0))
    )
  )

  (module Buttons_Switches_THT:SW_Tactile_SPST_Angled (layer F.Cu) (tedit 55225528) (tstamp 5AF01F1F)
    (at 170.18 114.3 270)
    (descr "tactile switch SPST right angle, 1825027-2")
    (tags "tactile switch SPST angled 1825027-2")
    (path /5AED5B84)
    (fp_text reference SW1 (at 2.5 4.65 270) (layer F.SilkS)
      (effects (font (size 1 1) (thickness 0.15)))
    )
    (fp_text value RST (at 1.9685 -2.3495 270) (layer F.Fab)
      (effects (font (size 1 1) (thickness 0.15)))
    )
    (fp_line (start -2.5 -1.5) (end 7.05 -1.5) (layer F.CrtYd) (width 0.05))
    (fp_line (start 7.05 -1.5) (end 7.05 3.8) (layer F.CrtYd) (width 0.05))
    (fp_line (start 7.05 3.8) (end -2.5 3.8) (layer F.CrtYd) (width 0.05))
    (fp_line (start -2.5 3.8) (end -2.5 -1.5) (layer F.CrtYd) (width 0.05))
    (fp_line (start -1.397 -1.27) (end 5.9 -1.27) (layer F.SilkS) (width 0.15))
    (fp_line (start 5.9 -1.27) (end 5.9 1.3) (layer F.SilkS) (width 0.15))
    (fp_line (start 0 3.03) (end 4.5 3.03) (layer F.SilkS) (width 0.15))
    (fp_line (start -1.397 -1.27) (end -1.397 1.3) (layer F.SilkS) (width 0.15))
    (pad "" thru_hole circle (at 5.76 2.49 270) (size 2.1 2.1) (drill 1.3) (layers *.Cu *.Mask))
    (pad 2 thru_hole circle (at 4.5 0 270) (size 1.75 1.75) (drill 0.99) (layers *.Cu *.Mask)
      (net 22 GND))
    (pad 1 thru_hole circle (at 0 0 270) (size 1.75 1.75) (drill 0.99) (layers *.Cu *.Mask)
      (net 11 "Net-(SW1-Pad1)"))
    (pad "" thru_hole circle (at -1.25 2.49 270) (size 2.1 2.1) (drill 1.3) (layers *.Cu *.Mask))
    (model Buttons_Switches_ThroughHole.3dshapes/SW_Tactile_SPST_Angled.wrl
      (at (xyz 0.09 0.1 0.1575))
      (scale (xyz 0.39 0.39 0.39))
      (rotate (xyz -90 0 180))
    )
  )

  (module Buttons_Switches_THT:SW_Tactile_SPST_Angled (layer F.Cu) (tedit 55225528) (tstamp 5AF01F27)
    (at 136.652 121.92 180)
    (descr "tactile switch SPST right angle, 1825027-2")
    (tags "tactile switch SPST angled 1825027-2")
    (path /5AED5CBF)
    (fp_text reference SW2 (at 2.5 4.65 180) (layer F.SilkS)
      (effects (font (size 1 1) (thickness 0.15)))
    )
    (fp_text value "Mode Selector" (at 1.9685 -2.3495 180) (layer F.Fab)
      (effects (font (size 1 1) (thickness 0.15)))
    )
    (fp_line (start -2.5 -1.5) (end 7.05 -1.5) (layer F.CrtYd) (width 0.05))
    (fp_line (start 7.05 -1.5) (end 7.05 3.8) (layer F.CrtYd) (width 0.05))
    (fp_line (start 7.05 3.8) (end -2.5 3.8) (layer F.CrtYd) (width 0.05))
    (fp_line (start -2.5 3.8) (end -2.5 -1.5) (layer F.CrtYd) (width 0.05))
    (fp_line (start -1.397 -1.27) (end 5.9 -1.27) (layer F.SilkS) (width 0.15))
    (fp_line (start 5.9 -1.27) (end 5.9 1.3) (layer F.SilkS) (width 0.15))
    (fp_line (start 0 3.03) (end 4.5 3.03) (layer F.SilkS) (width 0.15))
    (fp_line (start -1.397 -1.27) (end -1.397 1.3) (layer F.SilkS) (width 0.15))
    (pad "" thru_hole circle (at 5.76 2.49 180) (size 2.1 2.1) (drill 1.3) (layers *.Cu *.Mask))
    (pad 2 thru_hole circle (at 4.5 0 180) (size 1.75 1.75) (drill 0.99) (layers *.Cu *.Mask)
      (net 10 "Net-(RN2-Pad2)"))
    (pad 1 thru_hole circle (at 0 0 180) (size 1.75 1.75) (drill 0.99) (layers *.Cu *.Mask)
      (net 21 +5V))
    (pad "" thru_hole circle (at -1.25 2.49 180) (size 2.1 2.1) (drill 1.3) (layers *.Cu *.Mask))
    (model Buttons_Switches_ThroughHole.3dshapes/SW_Tactile_SPST_Angled.wrl
      (at (xyz 0.09 0.1 0.1575))
      (scale (xyz 0.39 0.39 0.39))
      (rotate (xyz -90 0 180))
    )
  )

  (module Pin_Headers:Pin_Header_Straight_1x05 (layer F.Cu) (tedit 54EA0684) (tstamp 5AF01F05)
    (at 146.304 91.186)
    (descr "Through hole pin header")
    (tags "pin header")
    (path /5AF14E8A)
    (fp_text reference P1 (at 0 -5.1) (layer F.SilkS)
      (effects (font (size 1 1) (thickness 0.15)))
    )
    (fp_text value CONN_01X05 (at 0 -3.1) (layer F.Fab)
      (effects (font (size 1 1) (thickness 0.15)))
    )
    (fp_line (start -1.55 0) (end -1.55 -1.55) (layer F.SilkS) (width 0.15))
    (fp_line (start -1.55 -1.55) (end 1.55 -1.55) (layer F.SilkS) (width 0.15))
    (fp_line (start 1.55 -1.55) (end 1.55 0) (layer F.SilkS) (width 0.15))
    (fp_line (start -1.75 -1.75) (end -1.75 11.95) (layer F.CrtYd) (width 0.05))
    (fp_line (start 1.75 -1.75) (end 1.75 11.95) (layer F.CrtYd) (width 0.05))
    (fp_line (start -1.75 -1.75) (end 1.75 -1.75) (layer F.CrtYd) (width 0.05))
    (fp_line (start -1.75 11.95) (end 1.75 11.95) (layer F.CrtYd) (width 0.05))
    (fp_line (start 1.27 1.27) (end 1.27 11.43) (layer F.SilkS) (width 0.15))
    (fp_line (start 1.27 11.43) (end -1.27 11.43) (layer F.SilkS) (width 0.15))
    (fp_line (start -1.27 11.43) (end -1.27 1.27) (layer F.SilkS) (width 0.15))
    (fp_line (start 1.27 1.27) (end -1.27 1.27) (layer F.SilkS) (width 0.15))
    (pad 1 thru_hole rect (at 0 0) (size 2.032 1.7272) (drill 1.016) (layers *.Cu *.Mask)
      (net 20 "Net-(P1-Pad1)"))
    (pad 2 thru_hole oval (at 0 2.54) (size 2.032 1.7272) (drill 1.016) (layers *.Cu *.Mask)
      (net 7 "Net-(P1-Pad2)"))
    (pad 3 thru_hole oval (at 0 5.08) (size 2.032 1.7272) (drill 1.016) (layers *.Cu *.Mask)
      (net 8 "Net-(P1-Pad3)"))
    (pad 4 thru_hole oval (at 0 7.62) (size 2.032 1.7272) (drill 1.016) (layers *.Cu *.Mask)
      (net 9 "Net-(P1-Pad4)"))
    (pad 5 thru_hole oval (at 0 10.16) (size 2.032 1.7272) (drill 1.016) (layers *.Cu *.Mask)
      (net 22 GND))
    (model Pin_Headers.3dshapes/Pin_Header_Straight_1x05.wrl
      (at (xyz 0 -0.2 0))
      (scale (xyz 1 1 1))
      (rotate (xyz 0 0 90))
    )
  )

  (dimension 57.912 (width 0.3) (layer Margin)
    (gr_text "57.912 mm" (at 143.256 62.15) (layer Margin)
      (effects (font (size 1.5 1.5) (thickness 0.3)))
    )
    (feature1 (pts (xy 172.212 70.104) (xy 172.212 60.8)))
    (feature2 (pts (xy 114.3 70.104) (xy 114.3 60.8)))
    (crossbar (pts (xy 114.3 63.5) (xy 172.212 63.5)))
    (arrow1a (pts (xy 172.212 63.5) (xy 171.085496 64.086421)))
    (arrow1b (pts (xy 172.212 63.5) (xy 171.085496 62.913579)))
    (arrow2a (pts (xy 114.3 63.5) (xy 115.426504 64.086421)))
    (arrow2b (pts (xy 114.3 63.5) (xy 115.426504 62.913579)))
  )
  (gr_line (start 114.3 125.984) (end 172.212 125.984) (angle 90) (layer Edge.Cuts) (width 0.15))
  (gr_line (start 114.3 70.104) (end 114.3 125.984) (angle 90) (layer Edge.Cuts) (width 0.15))
  (gr_line (start 172.212 70.104) (end 114.3 70.104) (angle 90) (layer Edge.Cuts) (width 0.15))
  (gr_line (start 172.212 125.984) (end 172.212 70.104) (angle 90) (layer Edge.Cuts) (width 0.15))
  (gr_line (start 114.3 125.984) (end 114.3 70.104) (angle 90) (layer Edge.Cuts) (width 0.15))
  (dimension 55.88 (width 0.3) (layer Margin)
    (gr_text "55.880 mm" (at 110.41 98.044 270) (layer Margin)
      (effects (font (size 1.5 1.5) (thickness 0.3)))
    )
    (feature1 (pts (xy 114.3 125.984) (xy 109.06 125.984)))
    (feature2 (pts (xy 114.3 70.104) (xy 109.06 70.104)))
    (crossbar (pts (xy 111.76 70.104) (xy 111.76 125.984)))
    (arrow1a (pts (xy 111.76 125.984) (xy 111.173579 124.857496)))
    (arrow1b (pts (xy 111.76 125.984) (xy 112.346421 124.857496)))
    (arrow2a (pts (xy 111.76 70.104) (xy 111.173579 71.230504)))
    (arrow2b (pts (xy 111.76 70.104) (xy 112.346421 71.230504)))
  )

  (segment (start 119.126 84.582) (end 115.951 84.582) (width 0.2) (layer B.Cu) (net 1) (status 10))
  (segment (start 145.43 124.699) (end 145.43 119.3) (width 0.2) (layer B.Cu) (net 1) (tstamp 5AF15DF1))
  (segment (start 144.653 125.476) (end 145.43 124.699) (width 0.2) (layer B.Cu) (net 1) (tstamp 5AF15DED))
  (segment (start 115.697 125.476) (end 144.653 125.476) (width 0.2) (layer B.Cu) (net 1) (tstamp 5AF15DE6))
  (segment (start 114.681 124.46) (end 115.697 125.476) (width 0.2) (layer B.Cu) (net 1) (tstamp 5AF15DE3))
  (segment (start 114.681 87.122) (end 114.681 124.46) (width 0.2) (layer B.Cu) (net 1) (tstamp 5AF15DD1))
  (segment (start 115.951 84.582) (end 114.681 87.122) (width 0.2) (layer B.Cu) (net 1) (tstamp 5AF15DD0))
  (segment (start 119.126 87.122) (end 116.332 87.122) (width 0.2) (layer B.Cu) (net 2) (status 10))
  (segment (start 144.78 124.46) (end 144.78 119.3) (width 0.2) (layer B.Cu) (net 2) (tstamp 5AF15E5D))
  (segment (start 144.399 124.841) (end 144.78 124.46) (width 0.2) (layer B.Cu) (net 2) (tstamp 5AF15E5C))
  (segment (start 116.205 124.841) (end 144.399 124.841) (width 0.2) (layer B.Cu) (net 2) (tstamp 5AF15E54))
  (segment (start 115.189 123.825) (end 116.205 124.841) (width 0.2) (layer B.Cu) (net 2) (tstamp 5AF15E4D))
  (segment (start 115.189 88.265) (end 115.189 123.825) (width 0.2) (layer B.Cu) (net 2) (tstamp 5AF15E4C))
  (segment (start 116.332 87.122) (end 115.189 88.265) (width 0.2) (layer B.Cu) (net 2) (tstamp 5AF15E49))
  (segment (start 156.972 104.775) (end 156.972 101.981) (width 0.2) (layer B.Cu) (net 3))
  (segment (start 150.516 95.525) (end 150.516 82.84) (width 0.2) (layer B.Cu) (net 3) (tstamp 5AF1816C))
  (segment (start 156.972 101.981) (end 150.516 95.525) (width 0.2) (layer B.Cu) (net 3) (tstamp 5AF1816A))
  (segment (start 150.516 82.84) (end 150.516 79.904) (width 0.2) (layer B.Cu) (net 3))
  (segment (start 148.717 78.105) (end 141.351 78.105) (width 0.2) (layer B.Cu) (net 3) (tstamp 5AF1751B))
  (segment (start 150.516 79.904) (end 148.717 78.105) (width 0.2) (layer B.Cu) (net 3) (tstamp 5AF17518))
  (segment (start 141.351 78.105) (end 140.716 78.74) (width 0.2) (layer B.Cu) (net 3) (tstamp 5AF1751C))
  (segment (start 151.115 83.439) (end 150.516 82.84) (width 0.2) (layer B.Cu) (net 3) (tstamp 5AF17513))
  (segment (start 140.716 78.74) (end 140.208 78.74) (width 0.2) (layer B.Cu) (net 3))
  (segment (start 158.115 78.74) (end 166.497 78.74) (width 0.2) (layer B.Cu) (net 4))
  (segment (start 167.915 80.158) (end 167.915 82.84) (width 0.2) (layer B.Cu) (net 4) (tstamp 5AF181A8))
  (segment (start 166.497 78.74) (end 167.915 80.158) (width 0.2) (layer B.Cu) (net 4) (tstamp 5AF181A3))
  (segment (start 162.052 104.775) (end 162.052 102.362) (width 0.2) (layer B.Cu) (net 4))
  (segment (start 154.813 82.042) (end 158.115 78.74) (width 0.2) (layer B.Cu) (net 4) (tstamp 5AF1818F))
  (segment (start 154.813 95.123) (end 154.813 82.042) (width 0.2) (layer B.Cu) (net 4) (tstamp 5AF1818C))
  (segment (start 162.052 102.362) (end 154.813 95.123) (width 0.2) (layer B.Cu) (net 4) (tstamp 5AF18188))
  (segment (start 158.115 78.74) (end 158.115 80.518) (width 0.2) (layer B.Cu) (net 4) (status 30))
  (segment (start 158.115 78.74) (end 158.115 80.264) (width 0.2) (layer B.Cu) (net 4) (status 30))
  (segment (start 152.76 113.248) (end 152.76 115.803) (width 0.2) (layer B.Cu) (net 5) (status 400000))
  (segment (start 154.305 117.348) (end 162.56 117.348) (width 0.2) (layer B.Cu) (net 5) (tstamp 5AF181E9) (status 800000))
  (segment (start 152.76 115.803) (end 154.305 117.348) (width 0.2) (layer B.Cu) (net 5) (tstamp 5AF181E1))
  (segment (start 159.512 104.775) (end 159.512 106.496) (width 0.2) (layer B.Cu) (net 5) (status 400000))
  (segment (start 159.512 106.496) (end 152.76 113.248) (width 0.2) (layer B.Cu) (net 5) (tstamp 5AF181D6) (status 800000))
  (segment (start 122.174 70.739) (end 122.174 88.646) (width 0.2) (layer B.Cu) (net 5))
  (segment (start 117.856 102.362) (end 116.84 101.346) (width 0.2) (layer B.Cu) (net 5) (tstamp 5AF17BC9))
  (segment (start 116.84 101.346) (end 116.84 91.948) (width 0.2) (layer B.Cu) (net 5) (tstamp 5AF17BCF))
  (segment (start 119.126 102.362) (end 117.856 102.362) (width 0.2) (layer B.Cu) (net 5))
  (segment (start 122.174 88.646) (end 119.888 90.932) (width 0.2) (layer B.Cu) (net 5) (tstamp 5AF17C14))
  (segment (start 119.888 90.932) (end 117.856 90.932) (width 0.2) (layer B.Cu) (net 5) (tstamp 5AF17C22))
  (segment (start 117.856 90.932) (end 116.84 91.948) (width 0.2) (layer B.Cu) (net 5) (tstamp 5AF17C27))
  (segment (start 171.958 71.501) (end 172.085 115.824) (width 0.2) (layer B.Cu) (net 5) (tstamp 5AF17269))
  (segment (start 171.069 70.612) (end 171.958 71.501) (width 0.2) (layer B.Cu) (net 5) (tstamp 5AF17267))
  (segment (start 122.301 70.612) (end 171.069 70.612) (width 0.2) (layer B.Cu) (net 5) (tstamp 5AF17260))
  (segment (start 122.174 70.739) (end 122.301 70.612) (width 0.2) (layer B.Cu) (net 5) (tstamp 5AF1725C))
  (segment (start 172.085 115.824) (end 169.799 115.824) (width 0.2) (layer B.Cu) (net 5))
  (segment (start 168.275 117.348) (end 162.687 117.348) (width 0.2) (layer B.Cu) (net 5) (tstamp 5AF172CF))
  (segment (start 169.799 115.824) (end 168.275 117.348) (width 0.2) (layer B.Cu) (net 5) (tstamp 5AF172C9))
  (segment (start 172.085 115.824) (end 172.085 115.824) (width 0.2) (layer B.Cu) (net 5) (tstamp 5AF17285))
  (segment (start 172.085 115.824) (end 172.085 115.824) (width 0.2) (layer B.Cu) (net 5) (tstamp 5AF17282))
  (segment (start 172.085 115.824) (end 172.085 115.824) (width 0.2) (layer B.Cu) (net 5) (tstamp 5AF17276))
  (segment (start 134.366 87.122) (end 135.128 87.122) (width 0.2) (layer B.Cu) (net 7) (status C00000))
  (segment (start 135.128 87.122) (end 141.605 93.599) (width 0.2) (layer B.Cu) (net 7) (tstamp 5AF1820A) (status C00000))
  (segment (start 146.304 93.726) (end 141.605 93.599) (width 0.2) (layer B.Cu) (net 7) (status 10))
  (segment (start 134.366 89.662) (end 135.128 89.662) (width 0.2) (layer B.Cu) (net 8) (status C00000))
  (segment (start 135.128 89.662) (end 141.605 96.139) (width 0.2) (layer B.Cu) (net 8) (tstamp 5AF1820D) (status C00000))
  (segment (start 146.304 96.266) (end 141.605 96.139) (width 0.2) (layer B.Cu) (net 8) (status 10))
  (segment (start 134.366 92.202) (end 135.128 92.202) (width 0.2) (layer B.Cu) (net 9) (status C00000))
  (segment (start 135.128 92.202) (end 141.605 98.679) (width 0.2) (layer B.Cu) (net 9) (tstamp 5AF18210) (status C00000))
  (segment (start 146.304 98.806) (end 141.605 98.679) (width 0.2) (layer B.Cu) (net 9) (status 10))
  (segment (start 132.152 121.92) (end 132.152 121.721) (width 0.2) (layer B.Cu) (net 10))
  (segment (start 132.152 121.721) (end 137.033 116.84) (width 0.2) (layer B.Cu) (net 10) (tstamp 5AF17AA2))
  (segment (start 137.033 116.84) (end 137.033 102.108) (width 0.2) (layer B.Cu) (net 10) (tstamp 5AF17AA9))
  (segment (start 137.033 102.108) (end 136.017 101.092) (width 0.2) (layer B.Cu) (net 10) (tstamp 5AF17AAE))
  (segment (start 136.017 101.092) (end 118.364 101.092) (width 0.2) (layer B.Cu) (net 10) (tstamp 5AF17AB1))
  (segment (start 118.364 101.092) (end 117.602 100.33) (width 0.2) (layer B.Cu) (net 10) (tstamp 5AF17AB9))
  (segment (start 117.602 100.33) (end 117.602 98.806) (width 0.2) (layer B.Cu) (net 10) (tstamp 5AF17ABB))
  (segment (start 117.602 98.806) (end 119.126 97.282) (width 0.2) (layer B.Cu) (net 10) (tstamp 5AF17AC0))
  (segment (start 128.524 73.025) (end 128.524 72.898) (width 0.2) (layer B.Cu) (net 11))
  (segment (start 170.18 114.3) (end 171.45 113.03) (width 0.2) (layer B.Cu) (net 11) (tstamp 5AF15D85))
  (segment (start 171.45 72.644) (end 171.45 113.03) (width 0.2) (layer B.Cu) (net 11) (tstamp 5AF15D82))
  (segment (start 170.688 71.882) (end 171.45 72.644) (width 0.2) (layer B.Cu) (net 11) (tstamp 5AF15D7F))
  (segment (start 133.223 83.439) (end 135.763 83.439) (width 0.2) (layer B.Cu) (net 11) (tstamp 5AF17EFF))
  (segment (start 135.763 83.439) (end 136.398 82.804) (width 0.2) (layer B.Cu) (net 11) (tstamp 5AF17F07))
  (segment (start 136.398 82.804) (end 136.398 81.534) (width 0.2) (layer B.Cu) (net 11) (tstamp 5AF17F0A))
  (segment (start 136.398 81.534) (end 134.366 79.502) (width 0.2) (layer B.Cu) (net 11) (tstamp 5AF17F0C))
  (segment (start 130.429 83.439) (end 133.223 83.439) (width 0.2) (layer B.Cu) (net 11) (tstamp 5AF17F52))
  (segment (start 128.524 81.534) (end 130.429 83.439) (width 0.2) (layer B.Cu) (net 11) (tstamp 5AF17F4D))
  (segment (start 128.524 73.025) (end 128.524 81.534) (width 0.2) (layer B.Cu) (net 11) (tstamp 5AF17F47))
  (segment (start 169.926 71.12) (end 170.688 71.882) (width 0.2) (layer B.Cu) (net 11) (tstamp 5AF17F86))
  (segment (start 130.302 71.12) (end 169.926 71.12) (width 0.2) (layer B.Cu) (net 11) (tstamp 5AF17F80))
  (segment (start 128.524 72.898) (end 130.302 71.12) (width 0.2) (layer B.Cu) (net 11) (tstamp 5AF17F7D))
  (segment (start 134.366 84.582) (end 135.128 84.582) (width 0.2) (layer B.Cu) (net 20) (status C00000))
  (segment (start 135.128 84.582) (end 141.605 91.059) (width 0.2) (layer B.Cu) (net 20) (tstamp 5AF18204) (status C00000))
  (segment (start 146.304 91.186) (end 141.605 91.059) (width 0.2) (layer B.Cu) (net 20) (status 10))
  (segment (start 142.739 72.263) (end 161.535 72.263) (width 0.6) (layer B.Cu) (net 21))
  (segment (start 161.535 72.263) (end 162.715 74.84) (width 0.6) (layer B.Cu) (net 21) (tstamp 5AF17FA1) (status 20))
  (segment (start 134.366 82.042) (end 131.064 82.042) (width 0.6) (layer B.Cu) (net 21))
  (segment (start 142.739 72.263) (end 145.316 74.84) (width 0.6) (layer B.Cu) (net 21) (tstamp 5AF17F98))
  (segment (start 130.937 72.263) (end 142.739 72.263) (width 0.6) (layer B.Cu) (net 21) (tstamp 5AF17F95))
  (segment (start 129.667 73.533) (end 130.937 72.263) (width 0.6) (layer B.Cu) (net 21) (tstamp 5AF17F94))
  (segment (start 129.667 80.645) (end 129.667 73.533) (width 0.6) (layer B.Cu) (net 21) (tstamp 5AF17F90))
  (segment (start 131.064 82.042) (end 129.667 80.645) (width 0.6) (layer B.Cu) (net 21) (tstamp 5AF17F8D))
  (segment (start 157.96 121.248) (end 150.077 121.248) (width 0.2) (layer B.Cu) (net 21))
  (segment (start 146.08 122.712) (end 146.08 119.3) (width 0.2) (layer B.Cu) (net 21) (tstamp 5AF17948))
  (segment (start 147.066 123.698) (end 146.08 122.712) (width 0.2) (layer B.Cu) (net 21) (tstamp 5AF17947))
  (segment (start 148.971 123.698) (end 147.066 123.698) (width 0.2) (layer B.Cu) (net 21) (tstamp 5AF17945))
  (segment (start 149.86 122.809) (end 148.971 123.698) (width 0.2) (layer B.Cu) (net 21) (tstamp 5AF17942))
  (segment (start 149.86 121.465) (end 149.86 122.809) (width 0.2) (layer B.Cu) (net 21) (tstamp 5AF17941))
  (segment (start 150.077 121.248) (end 149.86 121.465) (width 0.2) (layer B.Cu) (net 21) (tstamp 5AF1793A))
  (segment (start 123.571 122.555) (end 123.571 121.031) (width 0.6) (layer B.Cu) (net 21))
  (segment (start 134.431002 124.140998) (end 136.652 121.92) (width 0.6) (layer B.Cu) (net 21) (tstamp 5AF15FDF))
  (segment (start 128.712998 124.140998) (end 134.431002 124.140998) (width 0.6) (layer B.Cu) (net 21) (tstamp 5AF15FD3))
  (segment (start 127.762 123.19) (end 128.712998 124.140998) (width 0.6) (layer B.Cu) (net 21) (tstamp 5AF15FD1))
  (segment (start 127.762 121.158) (end 127.762 123.19) (width 0.6) (layer B.Cu) (net 21) (tstamp 5AF15FCB))
  (segment (start 127 120.396) (end 127.762 121.158) (width 0.6) (layer B.Cu) (net 21) (tstamp 5AF15FC7))
  (segment (start 124.206 120.396) (end 127 120.396) (width 0.6) (layer B.Cu) (net 21) (tstamp 5AF15FC4))
  (segment (start 123.571 121.031) (end 124.206 120.396) (width 0.6) (layer B.Cu) (net 21) (tstamp 5AF15FC2))

)
