G04 #@! TF.FileFunction,Soldermask,Bot*
%FSLAX46Y46*%
G04 Gerber Fmt 4.6, Leading zero omitted, Abs format (unit mm)*
G04 Created by KiCad (PCBNEW 4.0.5+dfsg1-4) date Wed Jun 13 14:41:34 2018*
%MOMM*%
%LPD*%
G01*
G04 APERTURE LIST*
%ADD10C,0.100000*%
%ADD11C,1.300000*%
%ADD12R,2.000000X2.000000*%
%ADD13C,2.000000*%
%ADD14C,2.400000*%
%ADD15R,2.400000X2.400000*%
%ADD16O,2.000000X2.000000*%
%ADD17C,2.500000*%
%ADD18C,2.150000*%
%ADD19C,2.398980*%
%ADD20R,2.432000X2.127200*%
%ADD21O,2.432000X2.127200*%
%ADD22R,2.700000X2.400000*%
%ADD23C,1.450000*%
%ADD24R,1.924000X2.940000*%
G04 APERTURE END LIST*
D10*
D11*
X156987600Y-91843200D03*
X152587600Y-91843200D03*
D12*
X146354800Y-121005600D03*
D13*
X146354800Y-118465600D03*
X146354800Y-115925600D03*
X146354800Y-113385600D03*
X146354800Y-110845600D03*
X146354800Y-108305600D03*
X146354800Y-105765600D03*
X146354800Y-103225600D03*
X146354800Y-100685600D03*
X146354800Y-98145600D03*
X146354800Y-95605600D03*
X146354800Y-93065600D03*
X131114800Y-93065600D03*
X131114800Y-95605600D03*
X131114800Y-98145600D03*
X131114800Y-100685600D03*
X131114800Y-103225600D03*
X131114800Y-105765600D03*
X131114800Y-108305600D03*
X131114800Y-110845600D03*
X131114800Y-113385600D03*
X131114800Y-115925600D03*
X131114800Y-118465600D03*
X131114800Y-121005600D03*
D14*
X158140400Y-119928640D03*
X158140400Y-112328960D03*
D15*
X139954000Y-120446800D03*
D14*
X137414000Y-120446800D03*
D12*
X160680400Y-104749600D03*
D16*
X158140400Y-104749600D03*
X155600400Y-104749600D03*
X153060400Y-104749600D03*
X150520400Y-104749600D03*
D12*
X150622000Y-108508800D03*
D16*
X153162000Y-108508800D03*
X155702000Y-108508800D03*
X158242000Y-108508800D03*
X160782000Y-108508800D03*
D17*
X130333200Y-90475600D03*
D18*
X131593200Y-87985600D03*
X136093200Y-87985600D03*
D17*
X137343200Y-90475600D03*
X140442400Y-90475600D03*
D18*
X141702400Y-87985600D03*
X146202400Y-87985600D03*
D17*
X147452400Y-90475600D03*
D19*
X133756400Y-115519200D03*
X143916400Y-115519200D03*
X150520400Y-100939600D03*
X160680400Y-100939600D03*
D20*
X163931600Y-100177600D03*
D21*
X163931600Y-102717600D03*
X163931600Y-105257600D03*
X163931600Y-107797600D03*
X163931600Y-110337600D03*
D22*
X160880800Y-119878800D03*
X166880800Y-119878800D03*
X160940800Y-112318800D03*
X166890800Y-112318800D03*
D23*
X161380800Y-116378800D03*
X166380800Y-116378800D03*
D22*
X166830000Y-90230000D03*
X160830000Y-90230000D03*
X166770000Y-97790000D03*
X160820000Y-97790000D03*
D23*
X166330000Y-93730000D03*
X161330000Y-93730000D03*
D22*
X149247600Y-119828000D03*
X155247600Y-119828000D03*
X149307600Y-112268000D03*
X155257600Y-112268000D03*
D23*
X149747600Y-116328000D03*
X154747600Y-116328000D03*
D24*
X142621000Y-111061500D03*
X140081000Y-111061500D03*
X137541000Y-111061500D03*
X135001000Y-111061500D03*
X135001000Y-94297500D03*
X137541000Y-94297500D03*
X140081000Y-94297500D03*
X142621000Y-94297500D03*
M02*
