G04 #@! TF.FileFunction,Legend,Bot*
%FSLAX46Y46*%
G04 Gerber Fmt 4.6, Leading zero omitted, Abs format (unit mm)*
G04 Created by KiCad (PCBNEW 4.0.5+dfsg1-4) date Wed Jun 13 14:41:34 2018*
%MOMM*%
%LPD*%
G01*
G04 APERTURE LIST*
%ADD10C,0.100000*%
%ADD11C,0.150000*%
%ADD12C,0.203200*%
%ADD13C,0.050000*%
G04 APERTURE END LIST*
D10*
D11*
X129844800Y-91795600D02*
X147624800Y-91795600D01*
X147624800Y-91795600D02*
X147624800Y-122275600D01*
X147624800Y-122275600D02*
X142544800Y-122275600D01*
X142544800Y-122275600D02*
X142544800Y-124815600D01*
X142544800Y-124815600D02*
X134924800Y-124815600D01*
X134924800Y-124815600D02*
X134924800Y-122275600D01*
X134924800Y-122275600D02*
X129844800Y-122275600D01*
X129844800Y-122275600D02*
X129844800Y-91795600D01*
X140153000Y-121760800D02*
X140153000Y-121560800D01*
X140153000Y-119166800D02*
X140153000Y-119346800D01*
X136925256Y-119477157D02*
G75*
G02X140153000Y-119160800I1727744J-1003643D01*
G01*
X137600994Y-119347732D02*
G75*
G02X139704000Y-119346800I1052006J-1133068D01*
G01*
X140140220Y-121787526D02*
G75*
G02X136903000Y-121440800I-1497220J1306726D01*
G01*
X139666889Y-121560053D02*
G75*
G02X137619000Y-121540800I-1013889J1079253D01*
G01*
X149182000Y-109908800D02*
X149182000Y-107108800D01*
X149182000Y-107108800D02*
X162222000Y-107108800D01*
X162222000Y-107108800D02*
X162222000Y-109908800D01*
X162222000Y-109908800D02*
X149182000Y-109908800D01*
X151892000Y-109908800D02*
X151892000Y-107108800D01*
X137490200Y-86715600D02*
X130193200Y-86715600D01*
X130193200Y-86715600D02*
X130193200Y-89285600D01*
X136093200Y-91015600D02*
X131593200Y-91015600D01*
X137490200Y-86715600D02*
X137490200Y-89285600D01*
X147599400Y-86715600D02*
X140302400Y-86715600D01*
X140302400Y-86715600D02*
X140302400Y-89285600D01*
X146202400Y-91015600D02*
X141702400Y-91015600D01*
X147599400Y-86715600D02*
X147599400Y-89285600D01*
X136296400Y-116789200D02*
X141376400Y-116789200D01*
X141376400Y-116789200D02*
X141376400Y-114249200D01*
X141376400Y-114249200D02*
X136296400Y-114249200D01*
X136296400Y-114249200D02*
X136296400Y-116789200D01*
X136296400Y-115519200D02*
X135026400Y-115519200D01*
X141376400Y-115519200D02*
X142646400Y-115519200D01*
X166380800Y-125878800D02*
X163880800Y-125878800D01*
X166880800Y-115378800D02*
X166880800Y-113628800D01*
X166880800Y-115378800D02*
X166880800Y-115628800D01*
X166880800Y-118628800D02*
X166880800Y-117128800D01*
X160880800Y-117128800D02*
X160880800Y-118628800D01*
X160880800Y-115628800D02*
X160880800Y-113628800D01*
X164130800Y-111878800D02*
X165330800Y-111878800D01*
X164130800Y-111878800D02*
X162630800Y-111878800D01*
X160880800Y-123378800D02*
X160880800Y-121128800D01*
X164630800Y-123378800D02*
X160880800Y-123378800D01*
X166880800Y-123378800D02*
X166880800Y-121128800D01*
X166880800Y-123378800D02*
X164630800Y-123378800D01*
X166380800Y-123378800D02*
X166380800Y-125878800D01*
X163880800Y-125878800D02*
X161380800Y-125878800D01*
X161380800Y-125878800D02*
X161380800Y-123378800D01*
X161330000Y-84230000D02*
X163830000Y-84230000D01*
X160830000Y-94730000D02*
X160830000Y-96480000D01*
X160830000Y-94730000D02*
X160830000Y-94480000D01*
X160830000Y-91480000D02*
X160830000Y-92980000D01*
X166830000Y-92980000D02*
X166830000Y-91480000D01*
X166830000Y-94480000D02*
X166830000Y-96480000D01*
X163580000Y-98230000D02*
X162380000Y-98230000D01*
X163580000Y-98230000D02*
X165080000Y-98230000D01*
X166830000Y-86730000D02*
X166830000Y-88980000D01*
X163080000Y-86730000D02*
X166830000Y-86730000D01*
X160830000Y-86730000D02*
X160830000Y-88980000D01*
X160830000Y-86730000D02*
X163080000Y-86730000D01*
X161330000Y-86730000D02*
X161330000Y-84230000D01*
X163830000Y-84230000D02*
X166330000Y-84230000D01*
X166330000Y-84230000D02*
X166330000Y-86730000D01*
X154747600Y-125828000D02*
X152247600Y-125828000D01*
X155247600Y-115328000D02*
X155247600Y-113578000D01*
X155247600Y-115328000D02*
X155247600Y-115578000D01*
X155247600Y-118578000D02*
X155247600Y-117078000D01*
X149247600Y-117078000D02*
X149247600Y-118578000D01*
X149247600Y-115578000D02*
X149247600Y-113578000D01*
X152497600Y-111828000D02*
X153697600Y-111828000D01*
X152497600Y-111828000D02*
X150997600Y-111828000D01*
X149247600Y-123328000D02*
X149247600Y-121078000D01*
X152997600Y-123328000D02*
X149247600Y-123328000D01*
X155247600Y-123328000D02*
X155247600Y-121078000D01*
X155247600Y-123328000D02*
X152997600Y-123328000D01*
X154747600Y-123328000D02*
X154747600Y-125828000D01*
X152247600Y-125828000D02*
X149747600Y-125828000D01*
X149747600Y-125828000D02*
X149747600Y-123328000D01*
D12*
X144653000Y-108839000D02*
G75*
G03X144970500Y-108521500I0J317500D01*
G01*
X144970500Y-108521500D02*
X144970500Y-96837500D01*
X144970500Y-96837500D02*
G75*
G03X144653000Y-96520000I-317500J0D01*
G01*
X132969000Y-96520000D02*
G75*
G03X132651500Y-96837500I0J-317500D01*
G01*
X132651500Y-96837500D02*
X132651500Y-108521500D01*
X132651500Y-108521500D02*
G75*
G03X132969000Y-108839000I317500J0D01*
G01*
D10*
X143220000Y-107442000D02*
G75*
G03X143220000Y-107442000I-599000J0D01*
G01*
D11*
X139663048Y-123959181D02*
X139663048Y-122959181D01*
X139424953Y-122959181D01*
X139282095Y-123006800D01*
X139186857Y-123102038D01*
X139139238Y-123197276D01*
X139091619Y-123387752D01*
X139091619Y-123530610D01*
X139139238Y-123721086D01*
X139186857Y-123816324D01*
X139282095Y-123911562D01*
X139424953Y-123959181D01*
X139663048Y-123959181D01*
X138139238Y-123006800D02*
X138234476Y-122959181D01*
X138377333Y-122959181D01*
X138520191Y-123006800D01*
X138615429Y-123102038D01*
X138663048Y-123197276D01*
X138710667Y-123387752D01*
X138710667Y-123530610D01*
X138663048Y-123721086D01*
X138615429Y-123816324D01*
X138520191Y-123911562D01*
X138377333Y-123959181D01*
X138282095Y-123959181D01*
X138139238Y-123911562D01*
X138091619Y-123863943D01*
X138091619Y-123530610D01*
X138282095Y-123530610D01*
X137901143Y-124054419D02*
X137139238Y-124054419D01*
X136377333Y-123959181D02*
X136948762Y-123959181D01*
X136663048Y-123959181D02*
X136663048Y-122959181D01*
X136758286Y-123102038D01*
X136853524Y-123197276D01*
X136948762Y-123244895D01*
X141905905Y-122639181D02*
X141905905Y-121639181D01*
X141334476Y-122639181D02*
X141763048Y-122067752D01*
X141334476Y-121639181D02*
X141905905Y-122210610D01*
X157662476Y-111361181D02*
X157995810Y-110884990D01*
X158233905Y-111361181D02*
X158233905Y-110361181D01*
X157852952Y-110361181D01*
X157757714Y-110408800D01*
X157710095Y-110456419D01*
X157662476Y-110551657D01*
X157662476Y-110694514D01*
X157710095Y-110789752D01*
X157757714Y-110837371D01*
X157852952Y-110884990D01*
X158233905Y-110884990D01*
X157233905Y-111361181D02*
X157233905Y-110361181D01*
X156662476Y-111361181D01*
X156662476Y-110361181D01*
X156233905Y-110456419D02*
X156186286Y-110408800D01*
X156091048Y-110361181D01*
X155852952Y-110361181D01*
X155757714Y-110408800D01*
X155710095Y-110456419D01*
X155662476Y-110551657D01*
X155662476Y-110646895D01*
X155710095Y-110789752D01*
X156281524Y-111361181D01*
X155662476Y-111361181D01*
X134926533Y-93040362D02*
X134783676Y-93087981D01*
X134545580Y-93087981D01*
X134450342Y-93040362D01*
X134402723Y-92992743D01*
X134355104Y-92897505D01*
X134355104Y-92802267D01*
X134402723Y-92707029D01*
X134450342Y-92659410D01*
X134545580Y-92611790D01*
X134736057Y-92564171D01*
X134831295Y-92516552D01*
X134878914Y-92468933D01*
X134926533Y-92373695D01*
X134926533Y-92278457D01*
X134878914Y-92183219D01*
X134831295Y-92135600D01*
X134736057Y-92087981D01*
X134497961Y-92087981D01*
X134355104Y-92135600D01*
X134021771Y-92087981D02*
X133783676Y-93087981D01*
X133593199Y-92373695D01*
X133402723Y-93087981D01*
X133164628Y-92087981D01*
X132259866Y-93087981D02*
X132831295Y-93087981D01*
X132545581Y-93087981D02*
X132545581Y-92087981D01*
X132640819Y-92230838D01*
X132736057Y-92326076D01*
X132831295Y-92373695D01*
X145035733Y-93040362D02*
X144892876Y-93087981D01*
X144654780Y-93087981D01*
X144559542Y-93040362D01*
X144511923Y-92992743D01*
X144464304Y-92897505D01*
X144464304Y-92802267D01*
X144511923Y-92707029D01*
X144559542Y-92659410D01*
X144654780Y-92611790D01*
X144845257Y-92564171D01*
X144940495Y-92516552D01*
X144988114Y-92468933D01*
X145035733Y-92373695D01*
X145035733Y-92278457D01*
X144988114Y-92183219D01*
X144940495Y-92135600D01*
X144845257Y-92087981D01*
X144607161Y-92087981D01*
X144464304Y-92135600D01*
X144130971Y-92087981D02*
X143892876Y-93087981D01*
X143702399Y-92373695D01*
X143511923Y-93087981D01*
X143273828Y-92087981D01*
X142940495Y-92183219D02*
X142892876Y-92135600D01*
X142797638Y-92087981D01*
X142559542Y-92087981D01*
X142464304Y-92135600D01*
X142416685Y-92183219D01*
X142369066Y-92278457D01*
X142369066Y-92373695D01*
X142416685Y-92516552D01*
X142988114Y-93087981D01*
X142369066Y-93087981D01*
X139251986Y-119471701D02*
X139585320Y-118995510D01*
X139823415Y-119471701D02*
X139823415Y-118471701D01*
X139442462Y-118471701D01*
X139347224Y-118519320D01*
X139299605Y-118566939D01*
X139251986Y-118662177D01*
X139251986Y-118805034D01*
X139299605Y-118900272D01*
X139347224Y-118947891D01*
X139442462Y-118995510D01*
X139823415Y-118995510D01*
X138871034Y-118566939D02*
X138823415Y-118519320D01*
X138728177Y-118471701D01*
X138490081Y-118471701D01*
X138394843Y-118519320D01*
X138347224Y-118566939D01*
X138299605Y-118662177D01*
X138299605Y-118757415D01*
X138347224Y-118900272D01*
X138918653Y-119471701D01*
X138299605Y-119471701D01*
X158873181Y-116675467D02*
X159587467Y-116675467D01*
X159730324Y-116627847D01*
X159825562Y-116532609D01*
X159873181Y-116389752D01*
X159873181Y-116294514D01*
X158968419Y-117104038D02*
X158920800Y-117151657D01*
X158873181Y-117246895D01*
X158873181Y-117484991D01*
X158920800Y-117580229D01*
X158968419Y-117627848D01*
X159063657Y-117675467D01*
X159158895Y-117675467D01*
X159301752Y-117627848D01*
X159873181Y-117056419D01*
X159873181Y-117675467D01*
X167742381Y-92766667D02*
X168456667Y-92766667D01*
X168599524Y-92719047D01*
X168694762Y-92623809D01*
X168742381Y-92480952D01*
X168742381Y-92385714D01*
X167742381Y-93147619D02*
X167742381Y-93766667D01*
X168123333Y-93433333D01*
X168123333Y-93576191D01*
X168170952Y-93671429D01*
X168218571Y-93719048D01*
X168313810Y-93766667D01*
X168551905Y-93766667D01*
X168647143Y-93719048D01*
X168694762Y-93671429D01*
X168742381Y-93576191D01*
X168742381Y-93290476D01*
X168694762Y-93195238D01*
X168647143Y-93147619D01*
X147239981Y-116624667D02*
X147954267Y-116624667D01*
X148097124Y-116577047D01*
X148192362Y-116481809D01*
X148239981Y-116338952D01*
X148239981Y-116243714D01*
X148239981Y-117624667D02*
X148239981Y-117053238D01*
X148239981Y-117338952D02*
X147239981Y-117338952D01*
X147382838Y-117243714D01*
X147478076Y-117148476D01*
X147525695Y-117053238D01*
D13*
X131771160Y-105361844D02*
X130936818Y-105361844D01*
X131532777Y-105639958D01*
X130936818Y-105918072D01*
X131771160Y-105918072D01*
X131771160Y-106315378D02*
X130936818Y-106315378D01*
X130936818Y-106633222D01*
X130976549Y-106712684D01*
X131016280Y-106752414D01*
X131095741Y-106792145D01*
X131214932Y-106792145D01*
X131294394Y-106752414D01*
X131334124Y-106712684D01*
X131373855Y-106633222D01*
X131373855Y-106315378D01*
X130936818Y-107070259D02*
X131771160Y-107626487D01*
X130936818Y-107626487D02*
X131771160Y-107070259D01*
X131771160Y-108381367D02*
X131771160Y-107904600D01*
X131771160Y-108142984D02*
X130936818Y-108142984D01*
X131056010Y-108063523D01*
X131135471Y-107984061D01*
X131175202Y-107904600D01*
X139209116Y-100755936D02*
X138535810Y-100755936D01*
X139016743Y-100980371D01*
X138535810Y-101204807D01*
X139209116Y-101204807D01*
X139209116Y-101525429D02*
X138535810Y-101525429D01*
X138535810Y-101781926D01*
X138567872Y-101846051D01*
X138599934Y-101878113D01*
X138664059Y-101910175D01*
X138760245Y-101910175D01*
X138824370Y-101878113D01*
X138856432Y-101846051D01*
X138888494Y-101781926D01*
X138888494Y-101525429D01*
X138535810Y-102134611D02*
X139209116Y-102583481D01*
X138535810Y-102583481D02*
X139209116Y-102134611D01*
X138535810Y-102743792D02*
X139209116Y-102968228D01*
X138535810Y-103192663D01*
X138535810Y-103352974D02*
X138535810Y-103801844D01*
X139209116Y-103513285D01*
X138535810Y-104186591D02*
X138535810Y-104250715D01*
X138567872Y-104314839D01*
X138599934Y-104346902D01*
X138664059Y-104378964D01*
X138792307Y-104411026D01*
X138952618Y-104411026D01*
X139080867Y-104378964D01*
X139144991Y-104346902D01*
X139177054Y-104314839D01*
X139209116Y-104250715D01*
X139209116Y-104186591D01*
X139177054Y-104122466D01*
X139144991Y-104090404D01*
X139080867Y-104058342D01*
X138952618Y-104026280D01*
X138792307Y-104026280D01*
X138664059Y-104058342D01*
X138599934Y-104090404D01*
X138567872Y-104122466D01*
X138535810Y-104186591D01*
X138535810Y-104827835D02*
X138535810Y-104891959D01*
X138567872Y-104956083D01*
X138599934Y-104988146D01*
X138664059Y-105020208D01*
X138792307Y-105052270D01*
X138952618Y-105052270D01*
X139080867Y-105020208D01*
X139144991Y-104988146D01*
X139177054Y-104956083D01*
X139209116Y-104891959D01*
X139209116Y-104827835D01*
X139177054Y-104763710D01*
X139144991Y-104731648D01*
X139080867Y-104699586D01*
X138952618Y-104667524D01*
X138792307Y-104667524D01*
X138664059Y-104699586D01*
X138599934Y-104731648D01*
X138567872Y-104763710D01*
X138535810Y-104827835D01*
X138535810Y-105276706D02*
X138535810Y-105725576D01*
X139209116Y-105437017D01*
X138567872Y-106334758D02*
X138535810Y-106270634D01*
X138535810Y-106174447D01*
X138567872Y-106078261D01*
X138631996Y-106014136D01*
X138696121Y-105982074D01*
X138824370Y-105950012D01*
X138920556Y-105950012D01*
X139048805Y-105982074D01*
X139112929Y-106014136D01*
X139177054Y-106078261D01*
X139209116Y-106174447D01*
X139209116Y-106238571D01*
X139177054Y-106334758D01*
X139144991Y-106366820D01*
X138920556Y-106366820D01*
X138920556Y-106238571D01*
X139209116Y-106655380D02*
X138535810Y-106655380D01*
X138535810Y-106911877D01*
X138567872Y-106976002D01*
X138599934Y-107008064D01*
X138664059Y-107040126D01*
X138760245Y-107040126D01*
X138824370Y-107008064D01*
X138856432Y-106976002D01*
X138888494Y-106911877D01*
X138888494Y-106655380D01*
M02*
