(kicad_pcb (version 4) (host pcbnew 4.0.5+dfsg1-4)

  (general
    (links 8)
    (no_connects 0)
    (area 130.251099 84.353599 203.43 125.653601)
    (thickness 1.6)
    (drawings 87)
    (tracks 58)
    (zones 0)
    (modules 9)
    (nets 6)
  )

  (page A4)
  (layers
    (0 F.Cu signal)
    (31 B.Cu signal)
    (32 B.Adhes user)
    (33 F.Adhes user)
    (34 B.Paste user)
    (35 F.Paste user)
    (36 B.SilkS user)
    (37 F.SilkS user)
    (38 B.Mask user)
    (39 F.Mask user)
    (40 Dwgs.User user)
    (41 Cmts.User user)
    (42 Eco1.User user)
    (43 Eco2.User user)
    (44 Edge.Cuts user)
    (45 Margin user)
    (46 B.CrtYd user)
    (47 F.CrtYd user)
    (48 B.Fab user)
    (49 F.Fab user)
  )

  (setup
    (last_trace_width 0.25)
    (trace_clearance 0.2)
    (zone_clearance 0.508)
    (zone_45_only no)
    (trace_min 0.2)
    (segment_width 0.2)
    (edge_width 0.1)
    (via_size 0.6)
    (via_drill 0.4)
    (via_min_size 0.4)
    (via_min_drill 0.3)
    (uvia_size 0.3)
    (uvia_drill 0.1)
    (uvias_allowed no)
    (uvia_min_size 0.2)
    (uvia_min_drill 0.1)
    (pcb_text_width 0.3)
    (pcb_text_size 1.5 1.5)
    (mod_edge_width 0.15)
    (mod_text_size 1 1)
    (mod_text_width 0.15)
    (pad_size 3.8 2)
    (pad_drill 0)
    (pad_to_mask_clearance 0)
    (aux_axis_origin 0 0)
    (visible_elements FFFFFF7F)
    (pcbplotparams
      (layerselection 0x3dfff_80000001)
      (usegerberextensions false)
      (excludeedgelayer true)
      (linewidth 0.100000)
      (plotframeref false)
      (viasonmask false)
      (mode 1)
      (useauxorigin false)
      (hpglpennumber 1)
      (hpglpenspeed 20)
      (hpglpendiameter 15)
      (hpglpenoverlay 2)
      (psnegative false)
      (psa4output false)
      (plotreference true)
      (plotvalue true)
      (plotinvisibletext false)
      (padsonsilk false)
      (subtractmaskfromsilk false)
      (outputformat 1)
      (mirror false)
      (drillshape 0)
      (scaleselection 1)
      (outputdirectory PCBPower/))
  )

  (net 0 "")
  (net 1 "Net-(P3-Pad1)")
  (net 2 "Net-(P3-Pad2)")
  (net 3 "Net-(P3-Pad3)")
  (net 4 "Net-(P3-Pad4)")
  (net 5 "Net-(P3-Pad5)")

  (net_class Default "This is the default net class."
    (clearance 0.2)
    (trace_width 0.25)
    (via_dia 0.6)
    (via_drill 0.4)
    (uvia_dia 0.3)
    (uvia_drill 0.1)
    (add_net "Net-(P3-Pad1)")
    (add_net "Net-(P3-Pad2)")
    (add_net "Net-(P3-Pad3)")
    (add_net "Net-(P3-Pad4)")
    (add_net "Net-(P3-Pad5)")
  )

  (module Pin_Headers:Pin_Header_Straight_1x05 (layer F.Cu) (tedit 54EA0684) (tstamp 5C359614)
    (at 165.1 99.06)
    (descr "Through hole pin header")
    (tags "pin header")
    (path /5AF96013)
    (fp_text reference P3 (at 0 -5.1) (layer F.SilkS)
      (effects (font (size 1 1) (thickness 0.15)))
    )
    (fp_text value CONN_01X05 (at 0 -3.1) (layer F.Fab)
      (effects (font (size 1 1) (thickness 0.15)))
    )
    (fp_line (start -1.55 0) (end -1.55 -1.55) (layer F.SilkS) (width 0.15))
    (fp_line (start -1.55 -1.55) (end 1.55 -1.55) (layer F.SilkS) (width 0.15))
    (fp_line (start 1.55 -1.55) (end 1.55 0) (layer F.SilkS) (width 0.15))
    (fp_line (start -1.75 -1.75) (end -1.75 11.95) (layer F.CrtYd) (width 0.05))
    (fp_line (start 1.75 -1.75) (end 1.75 11.95) (layer F.CrtYd) (width 0.05))
    (fp_line (start -1.75 -1.75) (end 1.75 -1.75) (layer F.CrtYd) (width 0.05))
    (fp_line (start -1.75 11.95) (end 1.75 11.95) (layer F.CrtYd) (width 0.05))
    (fp_line (start 1.27 1.27) (end 1.27 11.43) (layer F.SilkS) (width 0.15))
    (fp_line (start 1.27 11.43) (end -1.27 11.43) (layer F.SilkS) (width 0.15))
    (fp_line (start -1.27 11.43) (end -1.27 1.27) (layer F.SilkS) (width 0.15))
    (fp_line (start 1.27 1.27) (end -1.27 1.27) (layer F.SilkS) (width 0.15))
    (pad 1 thru_hole rect (at 0 0) (size 2.032 1.7272) (drill 1.016) (layers *.Cu *.Mask)
      (net 1 "Net-(P3-Pad1)"))
    (pad 2 thru_hole oval (at 0 2.54) (size 2.032 1.7272) (drill 1.016) (layers *.Cu *.Mask)
      (net 2 "Net-(P3-Pad2)"))
    (pad 3 thru_hole oval (at 0 5.08) (size 2.032 1.7272) (drill 1.016) (layers *.Cu *.Mask)
      (net 3 "Net-(P3-Pad3)"))
    (pad 4 thru_hole oval (at 0 7.62) (size 2.032 1.7272) (drill 1.016) (layers *.Cu *.Mask)
      (net 4 "Net-(P3-Pad4)"))
    (pad 5 thru_hole oval (at 0 10.16) (size 2.032 1.7272) (drill 1.016) (layers *.Cu *.Mask)
      (net 5 "Net-(P3-Pad5)"))
    (model Pin_Headers.3dshapes/Pin_Header_Straight_1x05.wrl
      (at (xyz 0 -0.2 0))
      (scale (xyz 1 1 1))
      (rotate (xyz 0 0 90))
    )
  )

  (module Measurement_Points:Test_Point_Keystone_5019_Minature (layer F.Cu) (tedit 56E5E83A) (tstamp 5C359631)
    (at 149.86 95.25 315)
    (descr "SMT Test Point- Micro Miniature 5019, http://www.keyelco.com/product-pdf.cfm?p=1357")
    (tags "Test Point")
    (path /5AF97085)
    (attr virtual)
    (fp_text reference PA1 (at 0 -2.25 315) (layer F.SilkS)
      (effects (font (size 1 1) (thickness 0.15)))
    )
    (fp_text value CONN_01X01 (at 0 2.25 315) (layer F.Fab)
      (effects (font (size 1 1) (thickness 0.15)))
    )
    (fp_line (start 0 0.5) (end 0 1) (layer F.Fab) (width 0.15))
    (fp_line (start 0 -1) (end 0 -0.5) (layer F.Fab) (width 0.15))
    (fp_line (start -1.9 -0.5) (end 1.9 -0.5) (layer F.Fab) (width 0.15))
    (fp_line (start 1.9 0.5) (end -1.9 0.5) (layer F.Fab) (width 0.15))
    (fp_line (start 1.25 -1) (end -1.25 -1) (layer F.Fab) (width 0.15))
    (fp_line (start -1.25 -1) (end -1.25 -0.5) (layer F.Fab) (width 0.15))
    (fp_line (start -1.25 -0.5) (end -1.75 -0.5) (layer F.Fab) (width 0.15))
    (fp_line (start -1.9 -0.5) (end -1.9 0.5) (layer F.Fab) (width 0.15))
    (fp_line (start -1.75 0.5) (end -1.25 0.5) (layer F.Fab) (width 0.15))
    (fp_line (start -1.25 0.5) (end -1.25 1) (layer F.Fab) (width 0.15))
    (fp_line (start -1.25 1) (end 1.25 1) (layer F.Fab) (width 0.15))
    (fp_line (start 1.25 1) (end 1.25 0.5) (layer F.Fab) (width 0.15))
    (fp_line (start 1.25 0.5) (end 1.75 0.5) (layer F.Fab) (width 0.15))
    (fp_line (start 1.9 0.5) (end 1.9 -0.5) (layer F.Fab) (width 0.15))
    (fp_line (start 1.75 -0.5) (end 1.25 -0.5) (layer F.Fab) (width 0.15))
    (fp_line (start 1.25 -0.5) (end 1.25 -1) (layer F.Fab) (width 0.15))
    (fp_line (start -2.35 -1.45) (end 2.35 -1.45) (layer F.CrtYd) (width 0.05))
    (fp_line (start 2.35 -1.45) (end 2.35 1.45) (layer F.CrtYd) (width 0.05))
    (fp_line (start 2.35 1.45) (end -2.35 1.45) (layer F.CrtYd) (width 0.05))
    (fp_line (start -2.35 1.45) (end -2.35 -1.45) (layer F.CrtYd) (width 0.05))
    (fp_line (start -2.1 -1.2) (end 2.1 -1.2) (layer F.SilkS) (width 0.15))
    (fp_line (start 2.1 -1.2) (end 2.1 1.2) (layer F.SilkS) (width 0.15))
    (fp_line (start 2.1 1.2) (end -2.1 1.2) (layer F.SilkS) (width 0.15))
    (fp_line (start -2.1 1.2) (end -2.1 -1.2) (layer F.SilkS) (width 0.15))
    (pad 1 smd rect (at 0 0 315) (size 3.8 2) (layers F.Cu F.Paste F.Mask)
      (net 5 "Net-(P3-Pad5)"))
  )

  (module Measurement_Points:Test_Point_Keystone_5019_Minature (layer F.Cu) (tedit 56E5E83A) (tstamp 5C35964E)
    (at 152.4 92.71 315)
    (descr "SMT Test Point- Micro Miniature 5019, http://www.keyelco.com/product-pdf.cfm?p=1357")
    (tags "Test Point")
    (path /5AF970E2)
    (attr virtual)
    (fp_text reference PA2 (at 0 -2.25 315) (layer F.SilkS)
      (effects (font (size 1 1) (thickness 0.15)))
    )
    (fp_text value CONN_01X01 (at 0 2.25 315) (layer F.Fab)
      (effects (font (size 1 1) (thickness 0.15)))
    )
    (fp_line (start 0 0.5) (end 0 1) (layer F.Fab) (width 0.15))
    (fp_line (start 0 -1) (end 0 -0.5) (layer F.Fab) (width 0.15))
    (fp_line (start -1.9 -0.5) (end 1.9 -0.5) (layer F.Fab) (width 0.15))
    (fp_line (start 1.9 0.5) (end -1.9 0.5) (layer F.Fab) (width 0.15))
    (fp_line (start 1.25 -1) (end -1.25 -1) (layer F.Fab) (width 0.15))
    (fp_line (start -1.25 -1) (end -1.25 -0.5) (layer F.Fab) (width 0.15))
    (fp_line (start -1.25 -0.5) (end -1.75 -0.5) (layer F.Fab) (width 0.15))
    (fp_line (start -1.9 -0.5) (end -1.9 0.5) (layer F.Fab) (width 0.15))
    (fp_line (start -1.75 0.5) (end -1.25 0.5) (layer F.Fab) (width 0.15))
    (fp_line (start -1.25 0.5) (end -1.25 1) (layer F.Fab) (width 0.15))
    (fp_line (start -1.25 1) (end 1.25 1) (layer F.Fab) (width 0.15))
    (fp_line (start 1.25 1) (end 1.25 0.5) (layer F.Fab) (width 0.15))
    (fp_line (start 1.25 0.5) (end 1.75 0.5) (layer F.Fab) (width 0.15))
    (fp_line (start 1.9 0.5) (end 1.9 -0.5) (layer F.Fab) (width 0.15))
    (fp_line (start 1.75 -0.5) (end 1.25 -0.5) (layer F.Fab) (width 0.15))
    (fp_line (start 1.25 -0.5) (end 1.25 -1) (layer F.Fab) (width 0.15))
    (fp_line (start -2.35 -1.45) (end 2.35 -1.45) (layer F.CrtYd) (width 0.05))
    (fp_line (start 2.35 -1.45) (end 2.35 1.45) (layer F.CrtYd) (width 0.05))
    (fp_line (start 2.35 1.45) (end -2.35 1.45) (layer F.CrtYd) (width 0.05))
    (fp_line (start -2.35 1.45) (end -2.35 -1.45) (layer F.CrtYd) (width 0.05))
    (fp_line (start -2.1 -1.2) (end 2.1 -1.2) (layer F.SilkS) (width 0.15))
    (fp_line (start 2.1 -1.2) (end 2.1 1.2) (layer F.SilkS) (width 0.15))
    (fp_line (start 2.1 1.2) (end -2.1 1.2) (layer F.SilkS) (width 0.15))
    (fp_line (start -2.1 1.2) (end -2.1 -1.2) (layer F.SilkS) (width 0.15))
    (pad 1 smd rect (at 0 0 315) (size 3.8 2) (layers F.Cu F.Paste F.Mask)
      (net 1 "Net-(P3-Pad1)"))
  )

  (module Measurement_Points:Test_Point_Keystone_5019_Minature (layer F.Cu) (tedit 56E5E83A) (tstamp 5C35966B)
    (at 135.89 101.6 45)
    (descr "SMT Test Point- Micro Miniature 5019, http://www.keyelco.com/product-pdf.cfm?p=1357")
    (tags "Test Point")
    (path /5AF97229)
    (attr virtual)
    (fp_text reference PB1 (at 0 -2.25 45) (layer F.SilkS)
      (effects (font (size 1 1) (thickness 0.15)))
    )
    (fp_text value CONN_01X01 (at 0 2.25 45) (layer F.Fab)
      (effects (font (size 1 1) (thickness 0.15)))
    )
    (fp_line (start 0 0.5) (end 0 1) (layer F.Fab) (width 0.15))
    (fp_line (start 0 -1) (end 0 -0.5) (layer F.Fab) (width 0.15))
    (fp_line (start -1.9 -0.5) (end 1.9 -0.5) (layer F.Fab) (width 0.15))
    (fp_line (start 1.9 0.5) (end -1.9 0.5) (layer F.Fab) (width 0.15))
    (fp_line (start 1.25 -1) (end -1.25 -1) (layer F.Fab) (width 0.15))
    (fp_line (start -1.25 -1) (end -1.25 -0.5) (layer F.Fab) (width 0.15))
    (fp_line (start -1.25 -0.5) (end -1.75 -0.5) (layer F.Fab) (width 0.15))
    (fp_line (start -1.9 -0.5) (end -1.9 0.5) (layer F.Fab) (width 0.15))
    (fp_line (start -1.75 0.5) (end -1.25 0.5) (layer F.Fab) (width 0.15))
    (fp_line (start -1.25 0.5) (end -1.25 1) (layer F.Fab) (width 0.15))
    (fp_line (start -1.25 1) (end 1.25 1) (layer F.Fab) (width 0.15))
    (fp_line (start 1.25 1) (end 1.25 0.5) (layer F.Fab) (width 0.15))
    (fp_line (start 1.25 0.5) (end 1.75 0.5) (layer F.Fab) (width 0.15))
    (fp_line (start 1.9 0.5) (end 1.9 -0.5) (layer F.Fab) (width 0.15))
    (fp_line (start 1.75 -0.5) (end 1.25 -0.5) (layer F.Fab) (width 0.15))
    (fp_line (start 1.25 -0.5) (end 1.25 -1) (layer F.Fab) (width 0.15))
    (fp_line (start -2.35 -1.45) (end 2.35 -1.45) (layer F.CrtYd) (width 0.05))
    (fp_line (start 2.35 -1.45) (end 2.35 1.45) (layer F.CrtYd) (width 0.05))
    (fp_line (start 2.35 1.45) (end -2.35 1.45) (layer F.CrtYd) (width 0.05))
    (fp_line (start -2.35 1.45) (end -2.35 -1.45) (layer F.CrtYd) (width 0.05))
    (fp_line (start -2.1 -1.2) (end 2.1 -1.2) (layer F.SilkS) (width 0.15))
    (fp_line (start 2.1 -1.2) (end 2.1 1.2) (layer F.SilkS) (width 0.15))
    (fp_line (start 2.1 1.2) (end -2.1 1.2) (layer F.SilkS) (width 0.15))
    (fp_line (start -2.1 1.2) (end -2.1 -1.2) (layer F.SilkS) (width 0.15))
    (pad 1 smd rect (at 0 0 45) (size 3.8 2) (layers F.Cu F.Paste F.Mask)
      (net 5 "Net-(P3-Pad5)"))
  )

  (module Measurement_Points:Test_Point_Keystone_5019_Minature (layer F.Cu) (tedit 56E5E83A) (tstamp 5C359688)
    (at 138.43 104.14 45)
    (descr "SMT Test Point- Micro Miniature 5019, http://www.keyelco.com/product-pdf.cfm?p=1357")
    (tags "Test Point")
    (path /5AF97261)
    (attr virtual)
    (fp_text reference PB2 (at 0 -2.25 45) (layer F.SilkS)
      (effects (font (size 1 1) (thickness 0.15)))
    )
    (fp_text value CONN_01X01 (at 0 2.25 45) (layer F.Fab)
      (effects (font (size 1 1) (thickness 0.15)))
    )
    (fp_line (start 0 0.5) (end 0 1) (layer F.Fab) (width 0.15))
    (fp_line (start 0 -1) (end 0 -0.5) (layer F.Fab) (width 0.15))
    (fp_line (start -1.9 -0.5) (end 1.9 -0.5) (layer F.Fab) (width 0.15))
    (fp_line (start 1.9 0.5) (end -1.9 0.5) (layer F.Fab) (width 0.15))
    (fp_line (start 1.25 -1) (end -1.25 -1) (layer F.Fab) (width 0.15))
    (fp_line (start -1.25 -1) (end -1.25 -0.5) (layer F.Fab) (width 0.15))
    (fp_line (start -1.25 -0.5) (end -1.75 -0.5) (layer F.Fab) (width 0.15))
    (fp_line (start -1.9 -0.5) (end -1.9 0.5) (layer F.Fab) (width 0.15))
    (fp_line (start -1.75 0.5) (end -1.25 0.5) (layer F.Fab) (width 0.15))
    (fp_line (start -1.25 0.5) (end -1.25 1) (layer F.Fab) (width 0.15))
    (fp_line (start -1.25 1) (end 1.25 1) (layer F.Fab) (width 0.15))
    (fp_line (start 1.25 1) (end 1.25 0.5) (layer F.Fab) (width 0.15))
    (fp_line (start 1.25 0.5) (end 1.75 0.5) (layer F.Fab) (width 0.15))
    (fp_line (start 1.9 0.5) (end 1.9 -0.5) (layer F.Fab) (width 0.15))
    (fp_line (start 1.75 -0.5) (end 1.25 -0.5) (layer F.Fab) (width 0.15))
    (fp_line (start 1.25 -0.5) (end 1.25 -1) (layer F.Fab) (width 0.15))
    (fp_line (start -2.35 -1.45) (end 2.35 -1.45) (layer F.CrtYd) (width 0.05))
    (fp_line (start 2.35 -1.45) (end 2.35 1.45) (layer F.CrtYd) (width 0.05))
    (fp_line (start 2.35 1.45) (end -2.35 1.45) (layer F.CrtYd) (width 0.05))
    (fp_line (start -2.35 1.45) (end -2.35 -1.45) (layer F.CrtYd) (width 0.05))
    (fp_line (start -2.1 -1.2) (end 2.1 -1.2) (layer F.SilkS) (width 0.15))
    (fp_line (start 2.1 -1.2) (end 2.1 1.2) (layer F.SilkS) (width 0.15))
    (fp_line (start 2.1 1.2) (end -2.1 1.2) (layer F.SilkS) (width 0.15))
    (fp_line (start -2.1 1.2) (end -2.1 -1.2) (layer F.SilkS) (width 0.15))
    (pad 1 smd rect (at 0 0 45) (size 3.8 2) (layers F.Cu F.Paste F.Mask)
      (net 2 "Net-(P3-Pad2)"))
  )

  (module Measurement_Points:Test_Point_Keystone_5019_Minature (layer F.Cu) (tedit 56E5E83A) (tstamp 5C3596A5)
    (at 157.48 106.68 45)
    (descr "SMT Test Point- Micro Miniature 5019, http://www.keyelco.com/product-pdf.cfm?p=1357")
    (tags "Test Point")
    (path /5AF97290)
    (attr virtual)
    (fp_text reference PC1 (at 0 -2.25 45) (layer F.SilkS)
      (effects (font (size 1 1) (thickness 0.15)))
    )
    (fp_text value CONN_01X01 (at 0 2.25 45) (layer F.Fab)
      (effects (font (size 1 1) (thickness 0.15)))
    )
    (fp_line (start 0 0.5) (end 0 1) (layer F.Fab) (width 0.15))
    (fp_line (start 0 -1) (end 0 -0.5) (layer F.Fab) (width 0.15))
    (fp_line (start -1.9 -0.5) (end 1.9 -0.5) (layer F.Fab) (width 0.15))
    (fp_line (start 1.9 0.5) (end -1.9 0.5) (layer F.Fab) (width 0.15))
    (fp_line (start 1.25 -1) (end -1.25 -1) (layer F.Fab) (width 0.15))
    (fp_line (start -1.25 -1) (end -1.25 -0.5) (layer F.Fab) (width 0.15))
    (fp_line (start -1.25 -0.5) (end -1.75 -0.5) (layer F.Fab) (width 0.15))
    (fp_line (start -1.9 -0.5) (end -1.9 0.5) (layer F.Fab) (width 0.15))
    (fp_line (start -1.75 0.5) (end -1.25 0.5) (layer F.Fab) (width 0.15))
    (fp_line (start -1.25 0.5) (end -1.25 1) (layer F.Fab) (width 0.15))
    (fp_line (start -1.25 1) (end 1.25 1) (layer F.Fab) (width 0.15))
    (fp_line (start 1.25 1) (end 1.25 0.5) (layer F.Fab) (width 0.15))
    (fp_line (start 1.25 0.5) (end 1.75 0.5) (layer F.Fab) (width 0.15))
    (fp_line (start 1.9 0.5) (end 1.9 -0.5) (layer F.Fab) (width 0.15))
    (fp_line (start 1.75 -0.5) (end 1.25 -0.5) (layer F.Fab) (width 0.15))
    (fp_line (start 1.25 -0.5) (end 1.25 -1) (layer F.Fab) (width 0.15))
    (fp_line (start -2.35 -1.45) (end 2.35 -1.45) (layer F.CrtYd) (width 0.05))
    (fp_line (start 2.35 -1.45) (end 2.35 1.45) (layer F.CrtYd) (width 0.05))
    (fp_line (start 2.35 1.45) (end -2.35 1.45) (layer F.CrtYd) (width 0.05))
    (fp_line (start -2.35 1.45) (end -2.35 -1.45) (layer F.CrtYd) (width 0.05))
    (fp_line (start -2.1 -1.2) (end 2.1 -1.2) (layer F.SilkS) (width 0.15))
    (fp_line (start 2.1 -1.2) (end 2.1 1.2) (layer F.SilkS) (width 0.15))
    (fp_line (start 2.1 1.2) (end -2.1 1.2) (layer F.SilkS) (width 0.15))
    (fp_line (start -2.1 1.2) (end -2.1 -1.2) (layer F.SilkS) (width 0.15))
    (pad 1 smd rect (at 0 0 45) (size 3.8 2) (layers F.Cu F.Paste F.Mask)
      (net 5 "Net-(P3-Pad5)"))
  )

  (module Measurement_Points:Test_Point_Keystone_5019_Minature (layer F.Cu) (tedit 56E5E83A) (tstamp 5C3596C2)
    (at 160.02 109.22 45)
    (descr "SMT Test Point- Micro Miniature 5019, http://www.keyelco.com/product-pdf.cfm?p=1357")
    (tags "Test Point")
    (path /5AF972C2)
    (attr virtual)
    (fp_text reference PC2 (at 0 -2.25 45) (layer F.SilkS)
      (effects (font (size 1 1) (thickness 0.15)))
    )
    (fp_text value CONN_01X01 (at 0 2.25 45) (layer F.Fab)
      (effects (font (size 1 1) (thickness 0.15)))
    )
    (fp_line (start 0 0.5) (end 0 1) (layer F.Fab) (width 0.15))
    (fp_line (start 0 -1) (end 0 -0.5) (layer F.Fab) (width 0.15))
    (fp_line (start -1.9 -0.5) (end 1.9 -0.5) (layer F.Fab) (width 0.15))
    (fp_line (start 1.9 0.5) (end -1.9 0.5) (layer F.Fab) (width 0.15))
    (fp_line (start 1.25 -1) (end -1.25 -1) (layer F.Fab) (width 0.15))
    (fp_line (start -1.25 -1) (end -1.25 -0.5) (layer F.Fab) (width 0.15))
    (fp_line (start -1.25 -0.5) (end -1.75 -0.5) (layer F.Fab) (width 0.15))
    (fp_line (start -1.9 -0.5) (end -1.9 0.5) (layer F.Fab) (width 0.15))
    (fp_line (start -1.75 0.5) (end -1.25 0.5) (layer F.Fab) (width 0.15))
    (fp_line (start -1.25 0.5) (end -1.25 1) (layer F.Fab) (width 0.15))
    (fp_line (start -1.25 1) (end 1.25 1) (layer F.Fab) (width 0.15))
    (fp_line (start 1.25 1) (end 1.25 0.5) (layer F.Fab) (width 0.15))
    (fp_line (start 1.25 0.5) (end 1.75 0.5) (layer F.Fab) (width 0.15))
    (fp_line (start 1.9 0.5) (end 1.9 -0.5) (layer F.Fab) (width 0.15))
    (fp_line (start 1.75 -0.5) (end 1.25 -0.5) (layer F.Fab) (width 0.15))
    (fp_line (start 1.25 -0.5) (end 1.25 -1) (layer F.Fab) (width 0.15))
    (fp_line (start -2.35 -1.45) (end 2.35 -1.45) (layer F.CrtYd) (width 0.05))
    (fp_line (start 2.35 -1.45) (end 2.35 1.45) (layer F.CrtYd) (width 0.05))
    (fp_line (start 2.35 1.45) (end -2.35 1.45) (layer F.CrtYd) (width 0.05))
    (fp_line (start -2.35 1.45) (end -2.35 -1.45) (layer F.CrtYd) (width 0.05))
    (fp_line (start -2.1 -1.2) (end 2.1 -1.2) (layer F.SilkS) (width 0.15))
    (fp_line (start 2.1 -1.2) (end 2.1 1.2) (layer F.SilkS) (width 0.15))
    (fp_line (start 2.1 1.2) (end -2.1 1.2) (layer F.SilkS) (width 0.15))
    (fp_line (start -2.1 1.2) (end -2.1 -1.2) (layer F.SilkS) (width 0.15))
    (pad 1 smd rect (at 0 0 45) (size 3.8 2) (layers F.Cu F.Paste F.Mask)
      (net 3 "Net-(P3-Pad3)"))
  )

  (module Measurement_Points:Test_Point_Keystone_5019_Minature (layer F.Cu) (tedit 56E5E83A) (tstamp 5C3596DF)
    (at 147.32 114.3 315)
    (descr "SMT Test Point- Micro Miniature 5019, http://www.keyelco.com/product-pdf.cfm?p=1357")
    (tags "Test Point")
    (path /5AF972F5)
    (attr virtual)
    (fp_text reference PD1 (at 0 -2.25 315) (layer F.SilkS)
      (effects (font (size 1 1) (thickness 0.15)))
    )
    (fp_text value CONN_01X01 (at 0 2.25 315) (layer F.Fab)
      (effects (font (size 1 1) (thickness 0.15)))
    )
    (fp_line (start 0 0.5) (end 0 1) (layer F.Fab) (width 0.15))
    (fp_line (start 0 -1) (end 0 -0.5) (layer F.Fab) (width 0.15))
    (fp_line (start -1.9 -0.5) (end 1.9 -0.5) (layer F.Fab) (width 0.15))
    (fp_line (start 1.9 0.5) (end -1.9 0.5) (layer F.Fab) (width 0.15))
    (fp_line (start 1.25 -1) (end -1.25 -1) (layer F.Fab) (width 0.15))
    (fp_line (start -1.25 -1) (end -1.25 -0.5) (layer F.Fab) (width 0.15))
    (fp_line (start -1.25 -0.5) (end -1.75 -0.5) (layer F.Fab) (width 0.15))
    (fp_line (start -1.9 -0.5) (end -1.9 0.5) (layer F.Fab) (width 0.15))
    (fp_line (start -1.75 0.5) (end -1.25 0.5) (layer F.Fab) (width 0.15))
    (fp_line (start -1.25 0.5) (end -1.25 1) (layer F.Fab) (width 0.15))
    (fp_line (start -1.25 1) (end 1.25 1) (layer F.Fab) (width 0.15))
    (fp_line (start 1.25 1) (end 1.25 0.5) (layer F.Fab) (width 0.15))
    (fp_line (start 1.25 0.5) (end 1.75 0.5) (layer F.Fab) (width 0.15))
    (fp_line (start 1.9 0.5) (end 1.9 -0.5) (layer F.Fab) (width 0.15))
    (fp_line (start 1.75 -0.5) (end 1.25 -0.5) (layer F.Fab) (width 0.15))
    (fp_line (start 1.25 -0.5) (end 1.25 -1) (layer F.Fab) (width 0.15))
    (fp_line (start -2.35 -1.45) (end 2.35 -1.45) (layer F.CrtYd) (width 0.05))
    (fp_line (start 2.35 -1.45) (end 2.35 1.45) (layer F.CrtYd) (width 0.05))
    (fp_line (start 2.35 1.45) (end -2.35 1.45) (layer F.CrtYd) (width 0.05))
    (fp_line (start -2.35 1.45) (end -2.35 -1.45) (layer F.CrtYd) (width 0.05))
    (fp_line (start -2.1 -1.2) (end 2.1 -1.2) (layer F.SilkS) (width 0.15))
    (fp_line (start 2.1 -1.2) (end 2.1 1.2) (layer F.SilkS) (width 0.15))
    (fp_line (start 2.1 1.2) (end -2.1 1.2) (layer F.SilkS) (width 0.15))
    (fp_line (start -2.1 1.2) (end -2.1 -1.2) (layer F.SilkS) (width 0.15))
    (pad 1 smd rect (at 0 0 315) (size 3.8 2) (layers F.Cu F.Paste F.Mask)
      (net 4 "Net-(P3-Pad4)"))
  )

  (module Measurement_Points:Test_Point_Keystone_5019_Minature (layer F.Cu) (tedit 56E5E83A) (tstamp 5C3596FC)
    (at 144.78 116.84 315)
    (descr "SMT Test Point- Micro Miniature 5019, http://www.keyelco.com/product-pdf.cfm?p=1357")
    (tags "Test Point")
    (path /5AF9735F)
    (attr virtual)
    (fp_text reference PD2 (at 0 -2.25 315) (layer F.SilkS)
      (effects (font (size 1 1) (thickness 0.15)))
    )
    (fp_text value CONN_01X01 (at 0 2.25 315) (layer F.Fab)
      (effects (font (size 1 1) (thickness 0.15)))
    )
    (fp_line (start 0 0.5) (end 0 1) (layer F.Fab) (width 0.15))
    (fp_line (start 0 -1) (end 0 -0.5) (layer F.Fab) (width 0.15))
    (fp_line (start -1.9 -0.5) (end 1.9 -0.5) (layer F.Fab) (width 0.15))
    (fp_line (start 1.9 0.5) (end -1.9 0.5) (layer F.Fab) (width 0.15))
    (fp_line (start 1.25 -1) (end -1.25 -1) (layer F.Fab) (width 0.15))
    (fp_line (start -1.25 -1) (end -1.25 -0.5) (layer F.Fab) (width 0.15))
    (fp_line (start -1.25 -0.5) (end -1.75 -0.5) (layer F.Fab) (width 0.15))
    (fp_line (start -1.9 -0.5) (end -1.9 0.5) (layer F.Fab) (width 0.15))
    (fp_line (start -1.75 0.5) (end -1.25 0.5) (layer F.Fab) (width 0.15))
    (fp_line (start -1.25 0.5) (end -1.25 1) (layer F.Fab) (width 0.15))
    (fp_line (start -1.25 1) (end 1.25 1) (layer F.Fab) (width 0.15))
    (fp_line (start 1.25 1) (end 1.25 0.5) (layer F.Fab) (width 0.15))
    (fp_line (start 1.25 0.5) (end 1.75 0.5) (layer F.Fab) (width 0.15))
    (fp_line (start 1.9 0.5) (end 1.9 -0.5) (layer F.Fab) (width 0.15))
    (fp_line (start 1.75 -0.5) (end 1.25 -0.5) (layer F.Fab) (width 0.15))
    (fp_line (start 1.25 -0.5) (end 1.25 -1) (layer F.Fab) (width 0.15))
    (fp_line (start -2.35 -1.45) (end 2.35 -1.45) (layer F.CrtYd) (width 0.05))
    (fp_line (start 2.35 -1.45) (end 2.35 1.45) (layer F.CrtYd) (width 0.05))
    (fp_line (start 2.35 1.45) (end -2.35 1.45) (layer F.CrtYd) (width 0.05))
    (fp_line (start -2.35 1.45) (end -2.35 -1.45) (layer F.CrtYd) (width 0.05))
    (fp_line (start -2.1 -1.2) (end 2.1 -1.2) (layer F.SilkS) (width 0.15))
    (fp_line (start 2.1 -1.2) (end 2.1 1.2) (layer F.SilkS) (width 0.15))
    (fp_line (start 2.1 1.2) (end -2.1 1.2) (layer F.SilkS) (width 0.15))
    (fp_line (start -2.1 1.2) (end -2.1 -1.2) (layer F.SilkS) (width 0.15))
    (pad 1 smd rect (at 0 0 315) (size 3.8 2) (layers F.Cu F.Paste F.Mask)
      (net 5 "Net-(P3-Pad5)"))
  )

  (dimension 35.56 (width 0.3) (layer Margin)
    (gr_text "35.560 mm" (at 148.59 137.24) (layer Margin)
      (effects (font (size 1.5 1.5) (thickness 0.3)))
    )
    (feature1 (pts (xy 166.37 120.65) (xy 166.37 138.59)))
    (feature2 (pts (xy 130.81 120.65) (xy 130.81 138.59)))
    (crossbar (pts (xy 130.81 135.89) (xy 166.37 135.89)))
    (arrow1a (pts (xy 166.37 135.89) (xy 165.243496 136.476421)))
    (arrow1b (pts (xy 166.37 135.89) (xy 165.243496 135.303579)))
    (arrow2a (pts (xy 130.81 135.89) (xy 131.936504 136.476421)))
    (arrow2b (pts (xy 130.81 135.89) (xy 131.936504 135.303579)))
  )
  (dimension 36.83 (width 0.3) (layer Margin)
    (gr_text "36.830 mm" (at 116.76 104.775 270) (layer Margin)
      (effects (font (size 1.5 1.5) (thickness 0.3)))
    )
    (feature1 (pts (xy 133.35 123.19) (xy 115.41 123.19)))
    (feature2 (pts (xy 133.35 86.36) (xy 115.41 86.36)))
    (crossbar (pts (xy 118.11 86.36) (xy 118.11 123.19)))
    (arrow1a (pts (xy 118.11 123.19) (xy 117.523579 122.063496)))
    (arrow1b (pts (xy 118.11 123.19) (xy 118.696421 122.063496)))
    (arrow2a (pts (xy 118.11 86.36) (xy 117.523579 87.486504)))
    (arrow2b (pts (xy 118.11 86.36) (xy 118.696421 87.486504)))
  )
  (gr_line (start 156.412264 95.678222) (end 148.62297 87.888929) (layer Margin) (width 0.1))
  (gr_line (start 144.402995 92.108904) (end 148.62297 87.888929) (layer Margin) (width 0.1))
  (gr_line (start 152.192288 99.898198) (end 144.402995 92.108904) (layer Margin) (width 0.1))
  (gr_arc (start 148.5011 105.0036) (end 152.192288 99.898198) (angle -71.73410154) (layer Margin) (width 0.1))
  (gr_line (start 144.809867 99.89823) (end 138.612332 93.700694) (layer Margin) (width 0.1))
  (gr_line (start 137.198156 95.11487) (end 138.612332 93.700694) (layer Margin) (width 0.1))
  (gr_line (start 137.198156 95.11487) (end 139.175722 97.092436) (layer Margin) (width 0.1))
  (gr_line (start 139.175722 97.092436) (end 131.386429 104.88173) (layer Margin) (width 0.1))
  (gr_line (start 135.606404 109.101705) (end 131.386429 104.88173) (layer Margin) (width 0.1))
  (gr_line (start 143.395698 101.312412) (end 135.606404 109.101705) (layer Margin) (width 0.1))
  (gr_arc (start 148.5011 105.0036) (end 143.395698 101.312412) (angle -71.73410154) (layer Margin) (width 0.1))
  (gr_line (start 143.39573 108.694833) (end 137.198194 114.892368) (layer Margin) (width 0.1))
  (gr_line (start 138.61237 116.306544) (end 137.198194 114.892368) (layer Margin) (width 0.1))
  (gr_line (start 138.61237 116.306544) (end 140.589936 114.328978) (layer Margin) (width 0.1))
  (gr_line (start 140.589936 114.328978) (end 148.37923 122.118271) (layer Margin) (width 0.1))
  (gr_line (start 152.599205 117.898296) (end 148.37923 122.118271) (layer Margin) (width 0.1))
  (gr_line (start 144.809912 110.109002) (end 152.599205 117.898296) (layer Margin) (width 0.1))
  (gr_arc (start 148.5011 105.0036) (end 144.809912 110.109002) (angle -71.73410154) (layer Margin) (width 0.1))
  (gr_line (start 152.192333 110.10897) (end 158.389868 116.306506) (layer Margin) (width 0.1))
  (gr_line (start 159.804044 114.89233) (end 158.389868 116.306506) (layer Margin) (width 0.1))
  (gr_line (start 159.804044 114.89233) (end 157.826478 112.914764) (layer Margin) (width 0.1))
  (gr_line (start 157.826478 112.914764) (end 165.615771 105.12547) (layer Margin) (width 0.1))
  (gr_line (start 161.395796 100.905495) (end 165.615771 105.12547) (layer Margin) (width 0.1))
  (gr_line (start 153.606502 108.694788) (end 161.395796 100.905495) (layer Margin) (width 0.1))
  (gr_arc (start 148.5011 105.0036) (end 153.606502 108.694788) (angle -71.73410154) (layer Margin) (width 0.1))
  (gr_line (start 153.60647 101.312367) (end 159.804006 95.114832) (layer Margin) (width 0.1))
  (gr_line (start 158.38983 93.700656) (end 159.804006 95.114832) (layer Margin) (width 0.1))
  (gr_line (start 158.38983 93.700656) (end 156.412264 95.678222) (layer Margin) (width 0.1))
  (gr_circle (center 161.5011 92.0036) (end 163.4011 92.0036) (layer Margin) (width 0.1))
  (gr_circle (center 135.5011 92.0036) (end 137.4011 92.0036) (layer Margin) (width 0.1))
  (gr_circle (center 135.5011 118.0036) (end 137.4011 118.0036) (layer Margin) (width 0.1))
  (gr_circle (center 161.5011 118.0036) (end 163.4011 118.0036) (layer Margin) (width 0.1))
  (gr_line (start 138.5011 86.4036) (end 138.5011 84.4036) (layer Margin) (width 0.1))
  (gr_line (start 143.5011 84.4036) (end 138.5011 84.4036) (layer Margin) (width 0.1))
  (gr_line (start 143.5011 86.4036) (end 143.5011 84.4036) (layer Margin) (width 0.1))
  (gr_line (start 143.5011 86.4036) (end 153.5011 86.4036) (layer Margin) (width 0.1))
  (gr_line (start 153.5011 86.4036) (end 153.5011 84.4036) (layer Margin) (width 0.1))
  (gr_line (start 153.5011 84.4036) (end 158.5011 84.4036) (layer Margin) (width 0.1))
  (gr_line (start 158.5011 86.4036) (end 158.5011 84.4036) (layer Margin) (width 0.1))
  (gr_line (start 158.5011 86.4036) (end 163.7011 86.4036) (layer Margin) (width 0.1))
  (gr_line (start 166.7011 89.4036) (end 163.7011 86.4036) (layer Margin) (width 0.1))
  (gr_line (start 166.7011 89.4036) (end 166.7011 120.6036) (layer Margin) (width 0.1))
  (gr_line (start 163.7011 123.6036) (end 166.7011 120.6036) (layer Margin) (width 0.1))
  (gr_line (start 158.5011 123.6036) (end 163.7011 123.6036) (layer Margin) (width 0.1))
  (gr_line (start 158.5011 123.6036) (end 158.5011 125.6036) (layer Margin) (width 0.1))
  (gr_line (start 153.5011 125.6036) (end 158.5011 125.6036) (layer Margin) (width 0.1))
  (gr_line (start 153.5011 123.6036) (end 153.5011 125.6036) (layer Margin) (width 0.1))
  (gr_line (start 143.5011 123.6036) (end 153.5011 123.6036) (layer Margin) (width 0.1))
  (gr_line (start 143.5011 123.6036) (end 143.5011 125.6036) (layer Margin) (width 0.1))
  (gr_line (start 143.5011 125.6036) (end 138.5011 125.6036) (layer Margin) (width 0.1))
  (gr_line (start 138.5011 123.6036) (end 138.5011 125.6036) (layer Margin) (width 0.1))
  (gr_line (start 133.3011 123.6036) (end 138.5011 123.6036) (layer Margin) (width 0.1))
  (gr_line (start 130.3011 120.6036) (end 133.3011 123.6036) (layer Margin) (width 0.1))
  (gr_line (start 130.3011 89.4036) (end 130.3011 120.6036) (layer Margin) (width 0.1))
  (gr_line (start 133.3011 86.4036) (end 130.3011 89.4036) (layer Margin) (width 0.1))
  (gr_line (start 133.3011 86.4036) (end 138.5011 86.4036) (layer Margin) (width 0.1))
  (gr_arc (start 148.5011 105.0036) (end 152.192288 99.898198) (angle -71.73410154) (layer Edge.Cuts) (width 0.1))
  (gr_line (start 144.809867 99.89823) (end 138.612332 93.700694) (layer Edge.Cuts) (width 0.1))
  (gr_line (start 137.198156 95.11487) (end 138.612332 93.700694) (layer Edge.Cuts) (width 0.1))
  (gr_line (start 137.198156 95.11487) (end 143.395698 101.312412) (layer Edge.Cuts) (width 0.1))
  (gr_arc (start 148.5011 105.0036) (end 143.395698 101.312412) (angle -71.73410154) (layer Edge.Cuts) (width 0.1))
  (gr_line (start 143.39573 108.694833) (end 137.198194 114.892368) (layer Edge.Cuts) (width 0.1))
  (gr_line (start 138.61237 116.306544) (end 137.198194 114.892368) (layer Edge.Cuts) (width 0.1))
  (gr_line (start 138.61237 116.306544) (end 144.809912 110.109002) (layer Edge.Cuts) (width 0.1))
  (gr_arc (start 148.5011 105.0036) (end 144.809912 110.109002) (angle -71.73410154) (layer Edge.Cuts) (width 0.1))
  (gr_line (start 152.192333 110.10897) (end 158.389868 116.306506) (layer Edge.Cuts) (width 0.1))
  (gr_line (start 159.804044 114.89233) (end 158.389868 116.306506) (layer Edge.Cuts) (width 0.1))
  (gr_line (start 159.804044 114.89233) (end 153.606502 108.694788) (layer Edge.Cuts) (width 0.1))
  (gr_arc (start 148.5011 105.0036) (end 153.606502 108.694788) (angle -71.73410154) (layer Edge.Cuts) (width 0.1))
  (gr_line (start 153.60647 101.312367) (end 159.804006 95.114832) (layer Edge.Cuts) (width 0.1))
  (gr_line (start 158.38983 93.700656) (end 159.804006 95.114832) (layer Edge.Cuts) (width 0.1))
  (gr_line (start 158.38983 93.700656) (end 152.192288 99.898198) (layer Edge.Cuts) (width 0.1))
  (gr_circle (center 161.5011 92.0036) (end 163.4011 92.0036) (layer Edge.Cuts) (width 0.1))
  (gr_circle (center 135.5011 92.0036) (end 137.4011 92.0036) (layer Edge.Cuts) (width 0.1))
  (gr_circle (center 135.5011 118.0036) (end 137.4011 118.0036) (layer Edge.Cuts) (width 0.1))
  (gr_circle (center 161.5011 118.0036) (end 163.4011 118.0036) (layer Edge.Cuts) (width 0.1))
  (gr_line (start 166.7011 89.4036) (end 163.7011 86.4036) (layer Edge.Cuts) (width 0.1))
  (gr_line (start 166.7011 89.4036) (end 166.7011 120.6036) (layer Edge.Cuts) (width 0.1))
  (gr_line (start 163.7011 123.6036) (end 166.7011 120.6036) (layer Edge.Cuts) (width 0.1))
  (gr_line (start 133.3011 123.6036) (end 163.7011 123.6036) (layer Edge.Cuts) (width 0.1))
  (gr_line (start 130.3011 120.6036) (end 133.3011 123.6036) (layer Edge.Cuts) (width 0.1))
  (gr_line (start 130.3011 89.4036) (end 130.3011 120.6036) (layer Edge.Cuts) (width 0.1))
  (gr_line (start 133.3011 86.4036) (end 130.3011 89.4036) (layer Edge.Cuts) (width 0.1))
  (gr_line (start 133.3011 86.4036) (end 163.7011 86.4036) (layer Edge.Cuts) (width 0.1))
  (dimension 17.78 (width 0.3) (layer Margin)
    (gr_text "17.780 mm" (at 196.93 95.25 270) (layer Margin)
      (effects (font (size 1.5 1.5) (thickness 0.3)))
    )
    (feature1 (pts (xy 163.83 104.14) (xy 198.28 104.14)))
    (feature2 (pts (xy 163.83 86.36) (xy 198.28 86.36)))
    (crossbar (pts (xy 195.58 86.36) (xy 195.58 104.14)))
    (arrow1a (pts (xy 195.58 104.14) (xy 194.993579 103.013496)))
    (arrow1b (pts (xy 195.58 104.14) (xy 196.166421 103.013496)))
    (arrow2a (pts (xy 195.58 86.36) (xy 194.993579 87.486504)))
    (arrow2b (pts (xy 195.58 86.36) (xy 196.166421 87.486504)))
  )

  (segment (start 152.4 92.71) (end 156.21 88.9) (width 0.25) (layer F.Cu) (net 1))
  (segment (start 165.1 90.17) (end 165.1 99.06) (width 0.25) (layer F.Cu) (net 1) (tstamp 5C35B538))
  (segment (start 163.83 88.9) (end 165.1 90.17) (width 0.25) (layer F.Cu) (net 1) (tstamp 5C35B536))
  (segment (start 156.21 88.9) (end 163.83 88.9) (width 0.25) (layer F.Cu) (net 1) (tstamp 5C35B534))
  (segment (start 160.02 87.63) (end 162.56 87.63) (width 0.25) (layer B.Cu) (net 2))
  (segment (start 140.97 101.6) (end 140.97 100.33) (width 0.25) (layer F.Cu) (net 2) (tstamp 5C35B4C6))
  (via (at 140.97 100.33) (size 0.6) (drill 0.4) (layers F.Cu B.Cu) (net 2))
  (segment (start 140.97 100.33) (end 138.43 97.79) (width 0.25) (layer B.Cu) (net 2) (tstamp 5C35B4E7))
  (segment (start 138.43 97.79) (end 135.89 97.79) (width 0.25) (layer B.Cu) (net 2) (tstamp 5C35B4E8))
  (segment (start 135.89 97.79) (end 132.08 93.98) (width 0.25) (layer B.Cu) (net 2) (tstamp 5C35B4ED))
  (segment (start 132.08 93.98) (end 132.08 90.17) (width 0.25) (layer B.Cu) (net 2) (tstamp 5C35B4F0))
  (segment (start 132.08 90.17) (end 134.62 87.63) (width 0.25) (layer B.Cu) (net 2) (tstamp 5C35B4F2))
  (segment (start 134.62 87.63) (end 160.02 87.63) (width 0.25) (layer B.Cu) (net 2) (tstamp 5C35B4F5))
  (segment (start 138.43 104.14) (end 140.97 101.6) (width 0.25) (layer F.Cu) (net 2))
  (segment (start 163.83 101.6) (end 165.1 101.6) (width 0.25) (layer B.Cu) (net 2) (tstamp 5C35B54C))
  (segment (start 161.29 99.06) (end 163.83 101.6) (width 0.25) (layer B.Cu) (net 2) (tstamp 5C35B548))
  (segment (start 161.29 96.52) (end 161.29 99.06) (width 0.25) (layer B.Cu) (net 2) (tstamp 5C35B546))
  (segment (start 165.1 92.71) (end 161.29 96.52) (width 0.25) (layer B.Cu) (net 2) (tstamp 5C35B544))
  (segment (start 165.1 90.17) (end 165.1 92.71) (width 0.25) (layer B.Cu) (net 2) (tstamp 5C35B541))
  (segment (start 162.56 87.63) (end 165.1 90.17) (width 0.25) (layer B.Cu) (net 2) (tstamp 5C35B53E))
  (segment (start 160.02 109.22) (end 162.56 106.68) (width 0.25) (layer F.Cu) (net 3))
  (segment (start 162.56 106.68) (end 165.1 104.14) (width 0.25) (layer B.Cu) (net 3) (tstamp 5C35B455))
  (via (at 162.56 106.68) (size 0.6) (drill 0.4) (layers F.Cu B.Cu) (net 3))
  (segment (start 147.32 114.3) (end 149.86 116.84) (width 0.25) (layer F.Cu) (net 4))
  (segment (start 163.83 106.68) (end 165.1 106.68) (width 0.25) (layer B.Cu) (net 4) (tstamp 5C35B4AE))
  (segment (start 161.29 109.22) (end 163.83 106.68) (width 0.25) (layer B.Cu) (net 4) (tstamp 5C35B4AC))
  (segment (start 161.29 111.76) (end 161.29 109.22) (width 0.25) (layer B.Cu) (net 4) (tstamp 5C35B4AA))
  (segment (start 165.1 115.57) (end 161.29 111.76) (width 0.25) (layer B.Cu) (net 4) (tstamp 5C35B4A4))
  (segment (start 165.1 119.38) (end 165.1 115.57) (width 0.25) (layer B.Cu) (net 4) (tstamp 5C35B4A2))
  (segment (start 162.56 121.92) (end 165.1 119.38) (width 0.25) (layer B.Cu) (net 4) (tstamp 5C35B4A0))
  (segment (start 160.02 121.92) (end 162.56 121.92) (width 0.25) (layer B.Cu) (net 4) (tstamp 5C35B49E))
  (segment (start 157.48 119.38) (end 160.02 121.92) (width 0.25) (layer B.Cu) (net 4) (tstamp 5C35B49C))
  (segment (start 152.4 119.38) (end 157.48 119.38) (width 0.25) (layer B.Cu) (net 4) (tstamp 5C35B491))
  (segment (start 149.86 116.84) (end 152.4 119.38) (width 0.25) (layer B.Cu) (net 4) (tstamp 5C35B490))
  (via (at 149.86 116.84) (size 0.6) (drill 0.4) (layers F.Cu B.Cu) (net 4))
  (segment (start 157.48 106.68) (end 156.21 107.95) (width 0.25) (layer F.Cu) (net 5) (status C00000))
  (segment (start 156.21 107.95) (end 156.21 110.49) (width 0.25) (layer F.Cu) (net 5) (tstamp 5C35B7A7) (status 400000))
  (segment (start 156.21 110.49) (end 158.75 113.03) (width 0.25) (layer F.Cu) (net 5) (tstamp 5C35B7AA))
  (segment (start 158.75 113.03) (end 161.29 113.03) (width 0.25) (layer F.Cu) (net 5) (tstamp 5C35B7AC))
  (segment (start 161.29 113.03) (end 165.1 109.22) (width 0.25) (layer F.Cu) (net 5) (tstamp 5C35B7B0) (status 800000))
  (segment (start 165.1 119.38) (end 165.1 116.84) (width 0.25) (layer F.Cu) (net 5) (tstamp 5C35B589))
  (segment (start 162.56 121.92) (end 165.1 119.38) (width 0.25) (layer F.Cu) (net 5) (tstamp 5C35B586))
  (segment (start 161.29 121.92) (end 162.56 121.92) (width 0.25) (layer F.Cu) (net 5) (tstamp 5C35B585))
  (segment (start 149.86 121.92) (end 161.29 121.92) (width 0.25) (layer F.Cu) (net 5) (tstamp 5C35B581))
  (segment (start 144.78 116.84) (end 149.86 121.92) (width 0.25) (layer F.Cu) (net 5))
  (segment (start 143.51 116.84) (end 144.78 116.84) (width 0.25) (layer F.Cu) (net 5) (tstamp 5C35B57C))
  (segment (start 138.43 121.92) (end 143.51 116.84) (width 0.25) (layer F.Cu) (net 5) (tstamp 5C35B57A))
  (segment (start 134.62 121.92) (end 138.43 121.92) (width 0.25) (layer F.Cu) (net 5) (tstamp 5C35B578))
  (segment (start 132.08 119.38) (end 134.62 121.92) (width 0.25) (layer F.Cu) (net 5) (tstamp 5C35B573))
  (segment (start 132.08 105.41) (end 132.08 119.38) (width 0.25) (layer F.Cu) (net 5) (tstamp 5C35B56D))
  (segment (start 135.89 101.6) (end 132.08 105.41) (width 0.25) (layer F.Cu) (net 5))
  (segment (start 165.1 116.84) (end 165.1 109.22) (width 0.25) (layer F.Cu) (net 5) (tstamp 5C35B591))
  (segment (start 149.86 95.25) (end 147.32 95.25) (width 0.25) (layer F.Cu) (net 5))
  (segment (start 132.08 97.79) (end 135.89 101.6) (width 0.25) (layer F.Cu) (net 5) (tstamp 5C35B567))
  (segment (start 132.08 90.17) (end 132.08 97.79) (width 0.25) (layer F.Cu) (net 5) (tstamp 5C35B565))
  (segment (start 134.62 87.63) (end 132.08 90.17) (width 0.25) (layer F.Cu) (net 5) (tstamp 5C35B563))
  (segment (start 139.7 87.63) (end 134.62 87.63) (width 0.25) (layer F.Cu) (net 5) (tstamp 5C35B562))
  (segment (start 147.32 95.25) (end 139.7 87.63) (width 0.25) (layer F.Cu) (net 5) (tstamp 5C35B55F))

  (zone (net 5) (net_name "Net-(P3-Pad5)") (layer F.Cu) (tstamp 5C35B810) (hatch edge 0.508)
    (connect_pads (clearance 0.508))
    (min_thickness 0.254)
    (fill yes (arc_segments 16) (thermal_gap 0.508) (thermal_bridge_width 0.508))
    (polygon
      (pts
        (xy 166.497 89.535) (xy 166.497 120.523) (xy 163.576 123.444) (xy 133.604 123.444) (xy 133.35 123.317)
        (xy 130.556 120.523) (xy 130.556 89.408) (xy 133.35 86.614) (xy 163.576 86.614)
      )
    )
    (filled_polygon
      (pts
        (xy 166.0161 89.687336) (xy 166.0161 97.54896) (xy 165.86 97.54896) (xy 165.86 90.17) (xy 165.802148 89.879161)
        (xy 165.802148 89.87916) (xy 165.637401 89.632599) (xy 164.367401 88.362599) (xy 164.120839 88.197852) (xy 163.83 88.14)
        (xy 156.21 88.14) (xy 155.919161 88.197852) (xy 155.672599 88.362599) (xy 153.027515 91.007683) (xy 152.221413 90.201581)
        (xy 152.02371 90.066496) (xy 151.772548 90.012012) (xy 151.519977 90.059536) (xy 151.305795 90.201581) (xy 149.891581 91.615795)
        (xy 149.756496 91.813498) (xy 149.702012 92.06466) (xy 149.749536 92.317231) (xy 149.891581 92.531413) (xy 152.578587 95.218419)
        (xy 152.77629 95.353504) (xy 153.027452 95.407988) (xy 153.280023 95.360464) (xy 153.494205 95.218419) (xy 154.908419 93.804205)
        (xy 155.043504 93.606502) (xy 155.097988 93.35534) (xy 155.050464 93.102769) (xy 154.908419 92.888587) (xy 154.102317 92.082485)
        (xy 156.524802 89.66) (xy 160.445071 89.66) (xy 159.673229 90.175729) (xy 159.112871 91.014363) (xy 158.9161 92.0036)
        (xy 159.112871 92.992837) (xy 159.673229 93.831471) (xy 160.511863 94.391829) (xy 161.5011 94.5886) (xy 162.490337 94.391829)
        (xy 163.328971 93.831471) (xy 163.889329 92.992837) (xy 164.0861 92.0036) (xy 163.889329 91.014363) (xy 163.328971 90.175729)
        (xy 162.557129 89.66) (xy 163.515198 89.66) (xy 164.34 90.484802) (xy 164.34 97.54896) (xy 164.084 97.54896)
        (xy 163.848683 97.593238) (xy 163.632559 97.73231) (xy 163.487569 97.94451) (xy 163.43656 98.1964) (xy 163.43656 99.9236)
        (xy 163.480838 100.158917) (xy 163.61991 100.375041) (xy 163.83211 100.520031) (xy 163.873439 100.5284) (xy 163.855585 100.54033)
        (xy 163.530729 101.026511) (xy 163.416655 101.6) (xy 163.530729 102.173489) (xy 163.855585 102.65967) (xy 164.170366 102.87)
        (xy 163.855585 103.08033) (xy 163.530729 103.566511) (xy 163.416655 104.14) (xy 163.530729 104.713489) (xy 163.855585 105.19967)
        (xy 164.170366 105.41) (xy 163.855585 105.62033) (xy 163.530729 106.106511) (xy 163.46703 106.426748) (xy 163.353117 106.151057)
        (xy 163.090327 105.887808) (xy 162.746799 105.745162) (xy 162.374833 105.744838) (xy 162.031057 105.886883) (xy 161.767808 106.149673)
        (xy 161.625162 106.493201) (xy 161.625121 106.540077) (xy 161.283911 106.881287) (xy 161.114205 106.711581) (xy 160.916502 106.576496)
        (xy 160.66534 106.522012) (xy 160.412769 106.569536) (xy 160.198587 106.711581) (xy 157.511581 109.398587) (xy 157.376496 109.59629)
        (xy 157.322012 109.847452) (xy 157.369536 110.100023) (xy 157.511581 110.314205) (xy 158.925795 111.728419) (xy 159.123498 111.863504)
        (xy 159.37466 111.917988) (xy 159.627231 111.870464) (xy 159.841413 111.728419) (xy 161.990806 109.579026) (xy 163.492642 109.579026)
        (xy 163.495291 109.594791) (xy 163.749268 110.122036) (xy 164.18568 110.511954) (xy 164.738087 110.705184) (xy 164.973 110.560924)
        (xy 164.973 109.347) (xy 163.613783 109.347) (xy 163.492642 109.579026) (xy 161.990806 109.579026) (xy 162.528419 109.041413)
        (xy 162.663504 108.84371) (xy 162.717988 108.592548) (xy 162.670464 108.339977) (xy 162.528419 108.125795) (xy 162.358713 107.956089)
        (xy 162.69968 107.615122) (xy 162.745167 107.615162) (xy 163.088943 107.473117) (xy 163.352192 107.210327) (xy 163.467099 106.933601)
        (xy 163.530729 107.253489) (xy 163.855585 107.73967) (xy 164.165069 107.946461) (xy 163.749268 108.317964) (xy 163.495291 108.845209)
        (xy 163.492642 108.860974) (xy 163.613783 109.093) (xy 164.973 109.093) (xy 164.973 109.073) (xy 165.227 109.073)
        (xy 165.227 109.093) (xy 165.247 109.093) (xy 165.247 109.347) (xy 165.227 109.347) (xy 165.227 110.560924)
        (xy 165.461913 110.705184) (xy 166.01432 110.511954) (xy 166.0161 110.510364) (xy 166.0161 120.319864) (xy 163.417364 122.9186)
        (xy 133.584836 122.9186) (xy 130.9861 120.319864) (xy 130.9861 118.0036) (xy 132.9161 118.0036) (xy 133.112871 118.992837)
        (xy 133.673229 119.831471) (xy 134.511863 120.391829) (xy 135.5011 120.5886) (xy 136.490337 120.391829) (xy 137.328971 119.831471)
        (xy 137.889329 118.992837) (xy 138.0861 118.0036) (xy 138.080147 117.973669) (xy 143.825936 117.973669) (xy 143.825936 118.198175)
        (xy 145.056697 119.428936) (xy 145.290086 119.525609) (xy 145.542705 119.52561) (xy 145.776094 119.428937) (xy 145.954723 119.250309)
        (xy 146.37046 118.834571) (xy 146.37046 118.610065) (xy 144.78 117.019605) (xy 143.825936 117.973669) (xy 138.080147 117.973669)
        (xy 137.889329 117.014363) (xy 137.328971 116.175729) (xy 136.490337 115.615371) (xy 135.5011 115.4186) (xy 134.511863 115.615371)
        (xy 133.673229 116.175729) (xy 133.112871 117.014363) (xy 132.9161 118.0036) (xy 130.9861 118.0036) (xy 130.9861 104.767452)
        (xy 135.732012 104.767452) (xy 135.779536 105.020023) (xy 135.921581 105.234205) (xy 137.335795 106.648419) (xy 137.533498 106.783504)
        (xy 137.78466 106.837988) (xy 138.037231 106.790464) (xy 138.251413 106.648419) (xy 140.938419 103.961413) (xy 141.073504 103.76371)
        (xy 141.127988 103.512548) (xy 141.080464 103.259977) (xy 140.938419 103.045795) (xy 140.768713 102.876089) (xy 141.507401 102.137401)
        (xy 141.672148 101.89084) (xy 141.68364 101.833066) (xy 141.73 101.6) (xy 141.73 100.892463) (xy 141.762192 100.860327)
        (xy 141.824595 100.710045) (xy 142.525644 101.411094) (xy 142.494995 101.460849) (xy 141.638852 103.765076) (xy 141.59643 104.028962)
        (xy 141.687247 106.485421) (xy 141.687247 106.485422) (xy 141.749038 106.745454) (xy 142.574609 108.547218) (xy 136.713826 114.408)
        (xy 136.565337 114.63023) (xy 136.513194 114.892368) (xy 136.565337 115.154506) (xy 136.713826 115.376736) (xy 138.128002 116.790912)
        (xy 138.350232 116.939401) (xy 138.61237 116.991544) (xy 138.874508 116.939401) (xy 139.096738 116.790912) (xy 139.810355 116.077295)
        (xy 142.09439 116.077295) (xy 142.094391 116.329914) (xy 142.191064 116.563303) (xy 143.421825 117.794064) (xy 143.646331 117.794064)
        (xy 144.600395 116.84) (xy 144.959605 116.84) (xy 146.550065 118.43046) (xy 146.774571 118.43046) (xy 147.190309 118.014723)
        (xy 147.201431 118.0036) (xy 158.9161 118.0036) (xy 159.112871 118.992837) (xy 159.673229 119.831471) (xy 160.511863 120.391829)
        (xy 161.5011 120.5886) (xy 162.490337 120.391829) (xy 163.328971 119.831471) (xy 163.889329 118.992837) (xy 164.0861 118.0036)
        (xy 163.889329 117.014363) (xy 163.328971 116.175729) (xy 162.490337 115.615371) (xy 161.5011 115.4186) (xy 160.511863 115.615371)
        (xy 159.673229 116.175729) (xy 159.112871 117.014363) (xy 158.9161 118.0036) (xy 147.201431 118.0036) (xy 147.368937 117.836094)
        (xy 147.46561 117.602705) (xy 147.465609 117.350086) (xy 147.368936 117.116697) (xy 146.138175 115.885936) (xy 145.913669 115.885936)
        (xy 144.959605 116.84) (xy 144.600395 116.84) (xy 143.009935 115.24954) (xy 142.785429 115.24954) (xy 142.369691 115.665277)
        (xy 142.191063 115.843906) (xy 142.09439 116.077295) (xy 139.810355 116.077295) (xy 141.042221 114.845429) (xy 143.18954 114.845429)
        (xy 143.18954 115.069935) (xy 144.78 116.660395) (xy 145.734064 115.706331) (xy 145.734064 115.481825) (xy 144.503303 114.251064)
        (xy 144.269914 114.154391) (xy 144.017295 114.15439) (xy 143.783906 114.251063) (xy 143.605277 114.429691) (xy 143.18954 114.845429)
        (xy 141.042221 114.845429) (xy 144.908594 110.979056) (xy 144.958349 111.009705) (xy 146.599572 111.619507) (xy 146.439977 111.649536)
        (xy 146.225795 111.791581) (xy 144.811581 113.205795) (xy 144.676496 113.403498) (xy 144.622012 113.65466) (xy 144.669536 113.907231)
        (xy 144.811581 114.121413) (xy 147.498587 116.808419) (xy 147.69629 116.943504) (xy 147.947452 116.997988) (xy 148.200023 116.950464)
        (xy 148.414205 116.808419) (xy 148.583911 116.638713) (xy 148.924878 116.97968) (xy 148.924838 117.025167) (xy 149.066883 117.368943)
        (xy 149.329673 117.632192) (xy 149.673201 117.774838) (xy 150.045167 117.775162) (xy 150.388943 117.633117) (xy 150.652192 117.370327)
        (xy 150.794838 117.026799) (xy 150.795162 116.654833) (xy 150.653117 116.311057) (xy 150.390327 116.047808) (xy 150.046799 115.905162)
        (xy 149.999923 115.905121) (xy 149.658713 115.563911) (xy 149.828419 115.394205) (xy 149.963504 115.196502) (xy 150.017988 114.94534)
        (xy 149.970464 114.692769) (xy 149.828419 114.478587) (xy 147.187954 111.838122) (xy 147.262576 111.865848) (xy 147.526461 111.90827)
        (xy 147.526462 111.90827) (xy 149.982921 111.817453) (xy 149.982922 111.817453) (xy 150.242954 111.755662) (xy 152.044718 110.930091)
        (xy 157.9055 116.790874) (xy 158.12773 116.939363) (xy 158.389868 116.991506) (xy 158.652006 116.939363) (xy 158.874236 116.790874)
        (xy 160.288412 115.376698) (xy 160.436901 115.154468) (xy 160.489044 114.89233) (xy 160.436901 114.630192) (xy 160.288412 114.407962)
        (xy 154.476556 108.596106) (xy 154.507205 108.546351) (xy 154.54298 108.450065) (xy 155.88954 108.450065) (xy 155.88954 108.674571)
        (xy 156.305277 109.090309) (xy 156.483906 109.268937) (xy 156.717295 109.36561) (xy 156.969914 109.365609) (xy 157.203303 109.268936)
        (xy 158.434064 108.038175) (xy 158.434064 107.813669) (xy 157.48 106.859605) (xy 155.88954 108.450065) (xy 154.54298 108.450065)
        (xy 154.859165 107.599085) (xy 154.891063 107.676094) (xy 155.069691 107.854723) (xy 155.485429 108.27046) (xy 155.709935 108.27046)
        (xy 157.300395 106.68) (xy 157.659605 106.68) (xy 158.613669 107.634064) (xy 158.838175 107.634064) (xy 160.068936 106.403303)
        (xy 160.165609 106.169914) (xy 160.16561 105.917295) (xy 160.068937 105.683906) (xy 159.890309 105.505277) (xy 159.474571 105.08954)
        (xy 159.250065 105.08954) (xy 157.659605 106.68) (xy 157.300395 106.68) (xy 156.346331 105.725936) (xy 156.121825 105.725936)
        (xy 155.220101 106.62766) (xy 155.363348 106.242124) (xy 155.40577 105.978239) (xy 155.40577 105.978238) (xy 155.381502 105.321825)
        (xy 156.525936 105.321825) (xy 156.525936 105.546331) (xy 157.48 106.500395) (xy 159.07046 104.909935) (xy 159.07046 104.685429)
        (xy 158.654723 104.269691) (xy 158.476094 104.091063) (xy 158.242705 103.99439) (xy 157.990086 103.994391) (xy 157.756697 104.091064)
        (xy 156.525936 105.321825) (xy 155.381502 105.321825) (xy 155.314953 103.521778) (xy 155.276876 103.361544) (xy 155.253161 103.261745)
        (xy 154.427591 101.459982) (xy 160.288374 95.5992) (xy 160.436863 95.37697) (xy 160.489006 95.114832) (xy 160.436863 94.852694)
        (xy 160.288374 94.630464) (xy 158.874198 93.216288) (xy 158.651968 93.067799) (xy 158.38983 93.015656) (xy 158.127692 93.067799)
        (xy 157.905462 93.216288) (xy 152.093606 99.028144) (xy 152.043851 98.997495) (xy 149.739624 98.141352) (xy 149.475738 98.09893)
        (xy 147.019278 98.189747) (xy 146.759245 98.251539) (xy 144.957482 99.077109) (xy 142.264043 96.383669) (xy 148.905936 96.383669)
        (xy 148.905936 96.608175) (xy 150.136697 97.838936) (xy 150.370086 97.935609) (xy 150.622705 97.93561) (xy 150.856094 97.838937)
        (xy 151.034723 97.660309) (xy 151.45046 97.244571) (xy 151.45046 97.020065) (xy 149.86 95.429605) (xy 148.905936 96.383669)
        (xy 142.264043 96.383669) (xy 140.367669 94.487295) (xy 147.17439 94.487295) (xy 147.174391 94.739914) (xy 147.271064 94.973303)
        (xy 148.501825 96.204064) (xy 148.726331 96.204064) (xy 149.680395 95.25) (xy 150.039605 95.25) (xy 151.630065 96.84046)
        (xy 151.854571 96.84046) (xy 152.270309 96.424723) (xy 152.448937 96.246094) (xy 152.54561 96.012705) (xy 152.545609 95.760086)
        (xy 152.448936 95.526697) (xy 151.218175 94.295936) (xy 150.993669 94.295936) (xy 150.039605 95.25) (xy 149.680395 95.25)
        (xy 148.089935 93.65954) (xy 147.865429 93.65954) (xy 147.449691 94.075277) (xy 147.271063 94.253906) (xy 147.17439 94.487295)
        (xy 140.367669 94.487295) (xy 139.135803 93.255429) (xy 148.26954 93.255429) (xy 148.26954 93.479935) (xy 149.86 95.070395)
        (xy 150.814064 94.116331) (xy 150.814064 93.891825) (xy 149.583303 92.661064) (xy 149.349914 92.564391) (xy 149.097295 92.56439)
        (xy 148.863906 92.661063) (xy 148.685277 92.839691) (xy 148.26954 93.255429) (xy 139.135803 93.255429) (xy 139.0967 93.216326)
        (xy 138.87447 93.067837) (xy 138.612332 93.015694) (xy 138.350194 93.067837) (xy 138.127964 93.216326) (xy 136.713788 94.630502)
        (xy 136.565299 94.852732) (xy 136.513156 95.11487) (xy 136.565299 95.377008) (xy 136.713788 95.599238) (xy 140.589923 99.475373)
        (xy 140.441057 99.536883) (xy 140.177808 99.799673) (xy 140.035162 100.143201) (xy 140.034838 100.515167) (xy 140.176883 100.858943)
        (xy 140.21 100.892118) (xy 140.21 101.285198) (xy 139.693911 101.801287) (xy 139.524205 101.631581) (xy 139.326502 101.496496)
        (xy 139.07534 101.442012) (xy 138.822769 101.489536) (xy 138.608587 101.631581) (xy 135.921581 104.318587) (xy 135.786496 104.51629)
        (xy 135.732012 104.767452) (xy 130.9861 104.767452) (xy 130.9861 103.370065) (xy 134.29954 103.370065) (xy 134.29954 103.594571)
        (xy 134.715277 104.010309) (xy 134.893906 104.188937) (xy 135.127295 104.28561) (xy 135.379914 104.285609) (xy 135.613303 104.188936)
        (xy 136.844064 102.958175) (xy 136.844064 102.733669) (xy 135.89 101.779605) (xy 134.29954 103.370065) (xy 130.9861 103.370065)
        (xy 130.9861 102.362705) (xy 133.20439 102.362705) (xy 133.301063 102.596094) (xy 133.479691 102.774723) (xy 133.895429 103.19046)
        (xy 134.119935 103.19046) (xy 135.710395 101.6) (xy 136.069605 101.6) (xy 137.023669 102.554064) (xy 137.248175 102.554064)
        (xy 138.478936 101.323303) (xy 138.575609 101.089914) (xy 138.57561 100.837295) (xy 138.478937 100.603906) (xy 138.300309 100.425277)
        (xy 137.884571 100.00954) (xy 137.660065 100.00954) (xy 136.069605 101.6) (xy 135.710395 101.6) (xy 134.756331 100.645936)
        (xy 134.531825 100.645936) (xy 133.301064 101.876697) (xy 133.204391 102.110086) (xy 133.20439 102.362705) (xy 130.9861 102.362705)
        (xy 130.9861 100.241825) (xy 134.935936 100.241825) (xy 134.935936 100.466331) (xy 135.89 101.420395) (xy 137.48046 99.829935)
        (xy 137.48046 99.605429) (xy 137.064723 99.189691) (xy 136.886094 99.011063) (xy 136.652705 98.91439) (xy 136.400086 98.914391)
        (xy 136.166697 99.011064) (xy 134.935936 100.241825) (xy 130.9861 100.241825) (xy 130.9861 92.0036) (xy 132.9161 92.0036)
        (xy 133.112871 92.992837) (xy 133.673229 93.831471) (xy 134.511863 94.391829) (xy 135.5011 94.5886) (xy 136.490337 94.391829)
        (xy 137.328971 93.831471) (xy 137.889329 92.992837) (xy 138.0861 92.0036) (xy 137.889329 91.014363) (xy 137.328971 90.175729)
        (xy 136.490337 89.615371) (xy 135.5011 89.4186) (xy 134.511863 89.615371) (xy 133.673229 90.175729) (xy 133.112871 91.014363)
        (xy 132.9161 92.0036) (xy 130.9861 92.0036) (xy 130.9861 89.687336) (xy 133.584836 87.0886) (xy 163.417364 87.0886)
      )
    )
  )
)
