G04 #@! TF.FileFunction,Drawing*
%FSLAX46Y46*%
G04 Gerber Fmt 4.6, Leading zero omitted, Abs format (unit mm)*
G04 Created by KiCad (PCBNEW 4.0.5+dfsg1-4) date Wed Jun 13 14:41:34 2018*
%MOMM*%
%LPD*%
G01*
G04 APERTURE LIST*
%ADD10C,0.100000*%
%ADD11C,0.050800*%
%ADD12C,0.381000*%
G04 APERTURE END LIST*
D10*
D11*
X145034000Y-102171500D02*
X148971000Y-102171500D01*
X148971000Y-102171500D02*
X148971000Y-102806500D01*
X148971000Y-102806500D02*
X151511000Y-102171500D01*
X151511000Y-102171500D02*
X151511000Y-99631500D01*
X151511000Y-99631500D02*
X148971000Y-98996500D01*
X148971000Y-98996500D02*
X148971000Y-99631500D01*
X148971000Y-99631500D02*
X145034000Y-99631500D01*
X148971000Y-102171500D02*
X148971000Y-99631500D01*
D12*
G36*
X143129000Y-112029720D02*
X143129000Y-108902500D01*
X142283950Y-108902500D01*
X142283950Y-112029720D01*
X143129000Y-112029720D01*
G37*
X143129000Y-112029720D02*
X143129000Y-108902500D01*
X142283950Y-108902500D01*
X142283950Y-112029720D01*
X143129000Y-112029720D01*
G36*
X142284820Y-93789500D02*
X142284820Y-96132780D01*
X143129000Y-96132780D01*
X143129000Y-93789500D01*
X142284820Y-93789500D01*
G37*
X142284820Y-93789500D02*
X142284820Y-96132780D01*
X143129000Y-96132780D01*
X143129000Y-93789500D01*
X142284820Y-93789500D01*
G36*
X140589000Y-112009530D02*
X140589000Y-108902500D01*
X139610719Y-108902500D01*
X139610719Y-112009530D01*
X140589000Y-112009530D01*
G37*
X140589000Y-112009530D02*
X140589000Y-108902500D01*
X139610719Y-108902500D01*
X139610719Y-112009530D01*
X140589000Y-112009530D01*
G36*
X138049000Y-112002400D02*
X138049000Y-108902500D01*
X136946410Y-108902500D01*
X136946410Y-112002400D01*
X138049000Y-112002400D01*
G37*
X138049000Y-112002400D02*
X138049000Y-108902500D01*
X136946410Y-108902500D01*
X136946410Y-112002400D01*
X138049000Y-112002400D01*
G36*
X135509000Y-112052760D02*
X135509000Y-108902500D01*
X134258300Y-108902500D01*
X134258300Y-112052760D01*
X135509000Y-112052760D01*
G37*
X135509000Y-112052760D02*
X135509000Y-108902500D01*
X134258300Y-108902500D01*
X134258300Y-112052760D01*
X135509000Y-112052760D01*
G36*
X139613386Y-93789500D02*
X139613386Y-96126660D01*
X140589000Y-96126660D01*
X140589000Y-93789500D01*
X139613386Y-93789500D01*
G37*
X139613386Y-93789500D02*
X139613386Y-96126660D01*
X140589000Y-96126660D01*
X140589000Y-93789500D01*
X139613386Y-93789500D01*
G36*
X136937190Y-93789500D02*
X136937190Y-96121290D01*
X138049000Y-96121290D01*
X138049000Y-93789500D01*
X136937190Y-93789500D01*
G37*
X136937190Y-93789500D02*
X136937190Y-96121290D01*
X138049000Y-96121290D01*
X138049000Y-93789500D01*
X136937190Y-93789500D01*
G36*
X134288930Y-93789500D02*
X134288930Y-96162450D01*
X135509000Y-96162450D01*
X135509000Y-93789500D01*
X134288930Y-93789500D01*
G37*
X134288930Y-93789500D02*
X134288930Y-96162450D01*
X135509000Y-96162450D01*
X135509000Y-93789500D01*
X134288930Y-93789500D01*
M02*
