(kicad_pcb (version 4) (host pcbnew 4.0.5+dfsg1-4)

  (general
    (links 35)
    (no_connects 0)
    (area 103.910001 60.8 173.9045 127.673001)
    (thickness 1.6)
    (drawings 7)
    (tracks 185)
    (zones 0)
    (modules 11)
    (nets 25)
  )

  (page A4)
  (layers
    (0 F.Cu signal)
    (31 B.Cu mixed)
    (32 B.Adhes user)
    (33 F.Adhes user)
    (34 B.Paste user)
    (35 F.Paste user)
    (36 B.SilkS user)
    (37 F.SilkS user)
    (38 B.Mask user)
    (39 F.Mask user)
    (40 Dwgs.User user)
    (41 Cmts.User user)
    (42 Eco1.User user)
    (43 Eco2.User user)
    (44 Edge.Cuts user)
    (45 Margin user)
    (46 B.CrtYd user)
    (47 F.CrtYd user)
    (48 B.Fab user)
    (49 F.Fab user)
  )

  (setup
    (last_trace_width 0.6)
    (user_trace_width 0.2)
    (user_trace_width 0.6)
    (trace_clearance 0.5)
    (zone_clearance 0.508)
    (zone_45_only no)
    (trace_min 0.2)
    (segment_width 0.2)
    (edge_width 0.15)
    (via_size 1.8)
    (via_drill 0.85)
    (via_min_size 0.4)
    (via_min_drill 0.3)
    (uvia_size 0.3)
    (uvia_drill 0.1)
    (uvias_allowed no)
    (uvia_min_size 0.2)
    (uvia_min_drill 0.1)
    (pcb_text_width 0.3)
    (pcb_text_size 1.5 1.5)
    (mod_edge_width 0.15)
    (mod_text_size 1 1)
    (mod_text_width 0.15)
    (pad_size 1.8 1.8)
    (pad_drill 1.3)
    (pad_to_mask_clearance 0.2)
    (aux_axis_origin 0 0)
    (visible_elements FFFFFF7F)
    (pcbplotparams
      (layerselection 0x00030_80000001)
      (usegerberextensions true)
      (excludeedgelayer true)
      (linewidth 0.100000)
      (plotframeref false)
      (viasonmask false)
      (mode 1)
      (useauxorigin false)
      (hpglpennumber 1)
      (hpglpenspeed 20)
      (hpglpendiameter 15)
      (hpglpenoverlay 2)
      (psnegative false)
      (psa4output false)
      (plotreference true)
      (plotvalue true)
      (plotinvisibletext false)
      (padsonsilk false)
      (subtractmaskfromsilk false)
      (outputformat 1)
      (mirror false)
      (drillshape 0)
      (scaleselection 1)
      (outputdirectory output/flipMouse/))
  )

  (net 0 "")
  (net 1 "Net-(J1-Pad1)")
  (net 2 "Net-(J2-Pad1)")
  (net 3 "Net-(J3-Pad1)")
  (net 4 "Net-(MPX1-Pad4)")
  (net 5 "Net-(P1-Pad2)")
  (net 6 "Net-(P1-Pad3)")
  (net 7 "Net-(P1-Pad4)")
  (net 8 "Net-(RN2-Pad2)")
  (net 9 "Net-(SW1-Pad1)")
  (net 10 "Net-(U1-Pad1)")
  (net 11 "Net-(U1-Pad2)")
  (net 12 "Net-(U1-Pad7)")
  (net 13 "Net-(U1-Pad8)")
  (net 14 "Net-(U1-Pad14)")
  (net 15 "Net-(U1-Pad15)")
  (net 16 "Net-(U1-Pad16)")
  (net 17 "Net-(U1-Pad24)")
  (net 18 "Net-(P1-Pad1)")
  (net 19 +5V)
  (net 20 GND)
  (net 21 "Net-(U1-Pad3)")
  (net 22 "Net-(U1-Pad4)")
  (net 23 "Net-(P2-Pad2)")
  (net 24 "Net-(P2-Pad3)")

  (net_class Default "This is the default net class."
    (clearance 0.5)
    (trace_width 0.6)
    (via_dia 1.8)
    (via_drill 0.85)
    (uvia_dia 0.3)
    (uvia_drill 0.1)
    (add_net +5V)
    (add_net GND)
    (add_net "Net-(J1-Pad1)")
    (add_net "Net-(J2-Pad1)")
    (add_net "Net-(J3-Pad1)")
    (add_net "Net-(MPX1-Pad4)")
    (add_net "Net-(P1-Pad1)")
    (add_net "Net-(P1-Pad2)")
    (add_net "Net-(P1-Pad3)")
    (add_net "Net-(P1-Pad4)")
    (add_net "Net-(P2-Pad2)")
    (add_net "Net-(P2-Pad3)")
    (add_net "Net-(RN2-Pad2)")
    (add_net "Net-(SW1-Pad1)")
    (add_net "Net-(U1-Pad1)")
    (add_net "Net-(U1-Pad14)")
    (add_net "Net-(U1-Pad15)")
    (add_net "Net-(U1-Pad16)")
    (add_net "Net-(U1-Pad2)")
    (add_net "Net-(U1-Pad24)")
    (add_net "Net-(U1-Pad3)")
    (add_net "Net-(U1-Pad4)")
    (add_net "Net-(U1-Pad7)")
    (add_net "Net-(U1-Pad8)")
  )

  (module Connectors:Stereo_Jack_3.5mm_Switch_Ledino_KB3SPRS (layer F.Cu) (tedit 5AF1A097) (tstamp 5AF01EF0)
    (at 162.56 117.348 90)
    (descr https://www.reichelt.de/index.html?ACTION=7&LA=3&OPEN=0&INDEX=0&FILENAME=C160%252FKB3SPRS.pdf)
    (tags "jack stereo TRS")
    (path /5AED63DF)
    (fp_text reference J3 (at -3.5 2.3 90) (layer F.SilkS)
      (effects (font (size 1 1) (thickness 0.15)))
    )
    (fp_text value "JACK External Switch" (at 2.3 -12.2 90) (layer F.Fab)
      (effects (font (size 1 1) (thickness 0.15)))
    )
    (fp_line (start -9.3 -7.6) (end -9.3 -1.6) (layer F.Fab) (width 0.1))
    (fp_line (start -9.3 -1.6) (end -5.7 -1.6) (layer F.Fab) (width 0.1))
    (fp_line (start -9.3 -7.6) (end -5.7 -7.6) (layer F.Fab) (width 0.1))
    (fp_line (start -5.7 -10.7) (end -5.7 0.9) (layer F.Fab) (width 0.1))
    (fp_line (start -5.7 0.9) (end 8.6 0.9) (layer F.Fab) (width 0.1))
    (fp_line (start 8.6 0.9) (end 8.6 -10.7) (layer F.Fab) (width 0.1))
    (fp_line (start 8.6 -10.7) (end -5.7 -10.7) (layer F.Fab) (width 0.1))
    (fp_text user %R (at 2.7 -4.6 90) (layer F.Fab)
      (effects (font (size 1 1) (thickness 0.15)))
    )
    (fp_line (start -9.8 2) (end 9.1 2) (layer F.CrtYd) (width 0.05))
    (fp_line (start 9.1 -11.4) (end -9.8 -11.4) (layer F.CrtYd) (width 0.05))
    (fp_line (start -5.8 -10.8) (end 2.2 -10.8) (layer F.SilkS) (width 0.15))
    (fp_line (start 6 -10.8) (end 8.7 -10.8) (layer F.SilkS) (width 0.15))
    (fp_line (start 8.7 -10.8) (end 8.7 1) (layer F.SilkS) (width 0.15))
    (fp_line (start 8.7 1) (end 8.6 1) (layer F.SilkS) (width 0.15))
    (fp_line (start 6 1) (end 1.9 1) (layer F.SilkS) (width 0.15))
    (fp_line (start -1.9 1) (end -5.8 1) (layer F.SilkS) (width 0.15))
    (fp_line (start -5.8 1) (end -5.8 -10.8) (layer F.SilkS) (width 0.15))
    (fp_line (start -5.8 -7.7) (end -9.4 -7.7) (layer F.SilkS) (width 0.15))
    (fp_line (start -9.4 -7.7) (end -9.4 -1.5) (layer F.SilkS) (width 0.15))
    (fp_line (start -9.4 -1.5) (end -5.8 -1.5) (layer F.SilkS) (width 0.15))
    (fp_line (start -9.8 -11.4) (end -9.8 2) (layer F.CrtYd) (width 0.05))
    (fp_line (start 9.1 2) (end 9.1 -11.4) (layer F.CrtYd) (width 0.05))
    (pad 1 thru_hole oval (at 0 0 90) (size 4 2.2) (drill 1.3) (layers *.Cu *.Mask)
      (net 3 "Net-(J3-Pad1)"))
    (pad 4 thru_hole oval (at 7.3 -0.5 180) (size 4 2.2) (drill 1.3) (layers *.Cu *.Mask))
    (pad 5 thru_hole oval (at 2.9 -7.1 90) (size 4 2.2) (drill 1.3) (layers *.Cu *.Mask)
      (clearance 0.4))
    (pad 2 thru_hole oval (at 4.1 -9.8 90) (size 4 2.2) (drill 1.3) (layers *.Cu *.Mask)
      (net 3 "Net-(J3-Pad1)") (clearance 0.4))
    (pad 3 thru_hole oval (at -3.9 -4.6 90) (size 2.2 4) (drill 1.3) (layers *.Cu *.Mask)
      (net 19 +5V))
    (model ${KISYS3DMOD}/Connectors.3dshapes/Stereo_Jack_3.5mm_Switch_Ledino_KB3SPRS.wrl
      (at (xyz 0 0 0))
      (scale (xyz 1 1 1))
      (rotate (xyz 0 0 0))
    )
  )

  (module promicro:ProMicro (layer F.Cu) (tedit 5AF43A23) (tstamp 5AF01F43)
    (at 126.746 88.392 270)
    (descr "Pro Micro footprint")
    (tags "promicro ProMicro")
    (path /5AEC1DA8)
    (fp_text reference U1 (at 0 -10.16 270) (layer F.SilkS) hide
      (effects (font (size 1 1) (thickness 0.15)))
    )
    (fp_text value ProMicro (at 0 10.16 270) (layer F.Fab)
      (effects (font (size 1 1) (thickness 0.15)))
    )
    (fp_line (start 15.24 -8.89) (end 15.24 8.89) (layer B.SilkS) (width 0.15))
    (fp_line (start 15.24 8.89) (end -15.24 8.89) (layer B.SilkS) (width 0.15))
    (fp_line (start -15.24 8.89) (end -15.24 3.81) (layer B.SilkS) (width 0.15))
    (fp_line (start -15.24 3.81) (end -17.78 3.81) (layer B.SilkS) (width 0.15))
    (fp_line (start -17.78 3.81) (end -17.78 -3.81) (layer B.SilkS) (width 0.15))
    (fp_line (start -17.78 -3.81) (end -15.24 -3.81) (layer B.SilkS) (width 0.15))
    (fp_line (start -15.24 -3.81) (end -15.24 -8.89) (layer B.SilkS) (width 0.15))
    (fp_line (start -15.24 -8.89) (end 15.24 -8.89) (layer B.SilkS) (width 0.15))
    (fp_line (start -15.24 8.89) (end 15.24 8.89) (layer F.SilkS) (width 0.15))
    (fp_line (start -15.24 8.89) (end -15.24 3.81) (layer F.SilkS) (width 0.15))
    (fp_line (start -15.24 3.81) (end -17.78 3.81) (layer F.SilkS) (width 0.15))
    (fp_line (start -17.78 3.81) (end -17.78 -3.81) (layer F.SilkS) (width 0.15))
    (fp_line (start -17.78 -3.81) (end -15.24 -3.81) (layer F.SilkS) (width 0.15))
    (fp_line (start -15.24 -3.81) (end -15.24 -8.89) (layer F.SilkS) (width 0.15))
    (fp_line (start -15.24 -8.89) (end 15.24 -8.89) (layer F.SilkS) (width 0.15))
    (fp_line (start 15.24 -8.89) (end 15.24 8.89) (layer F.SilkS) (width 0.15))
    (pad 1 thru_hole rect (at -13.97 7.62 270) (size 1.8 1.8) (drill 1.1) (layers *.Cu *.Mask F.SilkS)
      (net 10 "Net-(U1-Pad1)"))
    (pad 2 thru_hole circle (at -11.43 7.62 270) (size 1.8 1.8) (drill 1.1) (layers *.Cu *.Mask F.SilkS)
      (net 11 "Net-(U1-Pad2)"))
    (pad 3 thru_hole circle (at -8.89 7.62 270) (size 1.8 1.8) (drill 1.1) (layers *.Cu *.Mask F.SilkS)
      (net 21 "Net-(U1-Pad3)"))
    (pad 4 thru_hole circle (at -6.35 7.62 270) (size 1.8 1.8) (drill 1.1) (layers *.Cu *.Mask F.SilkS)
      (net 22 "Net-(U1-Pad4)"))
    (pad 5 thru_hole circle (at -3.81 7.62 270) (size 1.8 1.8) (drill 1.1) (layers *.Cu *.Mask F.SilkS)
      (net 23 "Net-(P2-Pad2)"))
    (pad 6 thru_hole circle (at -1.27 7.62 270) (size 1.8 1.8) (drill 1.1) (layers *.Cu *.Mask F.SilkS)
      (net 24 "Net-(P2-Pad3)"))
    (pad 7 thru_hole circle (at 1.27 7.62 270) (size 1.8 1.8) (drill 1.1) (layers *.Cu *.Mask F.SilkS)
      (net 12 "Net-(U1-Pad7)"))
    (pad 8 thru_hole circle (at 3.81 7.62 270) (size 1.8 1.8) (drill 1.1) (layers *.Cu *.Mask F.SilkS)
      (net 13 "Net-(U1-Pad8)"))
    (pad 9 thru_hole circle (at 6.35 7.62 270) (size 1.8 1.8) (drill 1.1) (layers *.Cu *.Mask F.SilkS)
      (net 1 "Net-(J1-Pad1)"))
    (pad 10 thru_hole circle (at 8.89 7.62 270) (size 1.8 1.8) (drill 1.1) (layers *.Cu *.Mask F.SilkS)
      (net 8 "Net-(RN2-Pad2)"))
    (pad 11 thru_hole circle (at 11.43 7.62 270) (size 1.8 1.8) (drill 1.1) (layers *.Cu *.Mask F.SilkS)
      (net 2 "Net-(J2-Pad1)"))
    (pad 12 thru_hole circle (at 13.97 7.62 270) (size 1.8 1.8) (drill 1.1) (layers *.Cu *.Mask F.SilkS)
      (net 3 "Net-(J3-Pad1)"))
    (pad 13 thru_hole circle (at 13.97 -7.62 270) (size 1.8 1.8) (drill 1.1) (layers *.Cu *.Mask F.SilkS)
      (net 4 "Net-(MPX1-Pad4)"))
    (pad 14 thru_hole circle (at 11.43 -7.62 270) (size 1.8 1.8) (drill 1.1) (layers *.Cu *.Mask F.SilkS)
      (net 14 "Net-(U1-Pad14)"))
    (pad 15 thru_hole circle (at 8.89 -7.62 270) (size 1.8 1.8) (drill 1.1) (layers *.Cu *.Mask F.SilkS)
      (net 15 "Net-(U1-Pad15)"))
    (pad 16 thru_hole circle (at 6.35 -7.62 270) (size 1.8 1.8) (drill 1.1) (layers *.Cu *.Mask F.SilkS)
      (net 16 "Net-(U1-Pad16)"))
    (pad 17 thru_hole circle (at 3.81 -7.62 270) (size 1.8 1.8) (drill 1.1) (layers *.Cu *.Mask F.SilkS)
      (net 7 "Net-(P1-Pad4)"))
    (pad 18 thru_hole circle (at 1.27 -7.62 270) (size 1.8 1.8) (drill 1.1) (layers *.Cu *.Mask F.SilkS)
      (net 6 "Net-(P1-Pad3)"))
    (pad 19 thru_hole circle (at -1.27 -7.62 270) (size 1.8 1.8) (drill 1.1) (layers *.Cu *.Mask F.SilkS)
      (net 5 "Net-(P1-Pad2)"))
    (pad 20 thru_hole circle (at -3.81 -7.62 270) (size 1.8 1.8) (drill 1.1) (layers *.Cu *.Mask F.SilkS)
      (net 18 "Net-(P1-Pad1)"))
    (pad 21 thru_hole circle (at -6.35 -7.62 270) (size 1.8 1.8) (drill 1.1) (layers *.Cu *.Mask F.SilkS)
      (net 19 +5V))
    (pad 22 thru_hole circle (at -8.89 -7.62 270) (size 1.8 1.8) (drill 1.1) (layers *.Cu *.Mask F.SilkS)
      (net 9 "Net-(SW1-Pad1)"))
    (pad 23 thru_hole circle (at -11.43 -7.62 270) (size 1.8 1.8) (drill 1.1) (layers *.Cu *.Mask F.SilkS)
      (net 20 GND))
    (pad 24 thru_hole circle (at -13.97 -7.62 270) (size 1.8 1.8) (drill 1.1) (layers *.Cu *.Mask F.SilkS)
      (net 17 "Net-(U1-Pad24)"))
  )

  (module Connectors:Stereo_Jack_3.5mm_Switch_Ledino_KB3SPRS (layer F.Cu) (tedit 5AF1A059) (tstamp 5AF01EDE)
    (at 140.716 78.74 270)
    (descr https://www.reichelt.de/index.html?ACTION=7&LA=3&OPEN=0&INDEX=0&FILENAME=C160%252FKB3SPRS.pdf)
    (tags "jack stereo TRS")
    (path /5AED5077)
    (fp_text reference J1 (at -3.5 2.3 270) (layer F.SilkS)
      (effects (font (size 1 1) (thickness 0.15)))
    )
    (fp_text value "JACK External Switch" (at 2.3 -12.2 270) (layer F.Fab)
      (effects (font (size 1 1) (thickness 0.15)))
    )
    (fp_line (start -9.3 -7.6) (end -9.3 -1.6) (layer F.Fab) (width 0.1))
    (fp_line (start -9.3 -1.6) (end -5.7 -1.6) (layer F.Fab) (width 0.1))
    (fp_line (start -9.3 -7.6) (end -5.7 -7.6) (layer F.Fab) (width 0.1))
    (fp_line (start -5.7 -10.7) (end -5.7 0.9) (layer F.Fab) (width 0.1))
    (fp_line (start -5.7 0.9) (end 8.6 0.9) (layer F.Fab) (width 0.1))
    (fp_line (start 8.6 0.9) (end 8.6 -10.7) (layer F.Fab) (width 0.1))
    (fp_line (start 8.6 -10.7) (end -5.7 -10.7) (layer F.Fab) (width 0.1))
    (fp_text user %R (at 2.7 -4.6 270) (layer F.Fab)
      (effects (font (size 1 1) (thickness 0.15)))
    )
    (fp_line (start -9.8 2) (end 9.1 2) (layer F.CrtYd) (width 0.05))
    (fp_line (start 9.1 -11.4) (end -9.8 -11.4) (layer F.CrtYd) (width 0.05))
    (fp_line (start -5.8 -10.8) (end 2.2 -10.8) (layer F.SilkS) (width 0.15))
    (fp_line (start 6 -10.8) (end 8.7 -10.8) (layer F.SilkS) (width 0.15))
    (fp_line (start 8.7 -10.8) (end 8.7 1) (layer F.SilkS) (width 0.15))
    (fp_line (start 8.7 1) (end 8.6 1) (layer F.SilkS) (width 0.15))
    (fp_line (start 6 1) (end 1.9 1) (layer F.SilkS) (width 0.15))
    (fp_line (start -1.9 1) (end -5.8 1) (layer F.SilkS) (width 0.15))
    (fp_line (start -5.8 1) (end -5.8 -10.8) (layer F.SilkS) (width 0.15))
    (fp_line (start -5.8 -7.7) (end -9.4 -7.7) (layer F.SilkS) (width 0.15))
    (fp_line (start -9.4 -7.7) (end -9.4 -1.5) (layer F.SilkS) (width 0.15))
    (fp_line (start -9.4 -1.5) (end -5.8 -1.5) (layer F.SilkS) (width 0.15))
    (fp_line (start -9.8 -11.4) (end -9.8 2) (layer F.CrtYd) (width 0.05))
    (fp_line (start 9.1 2) (end 9.1 -11.4) (layer F.CrtYd) (width 0.05))
    (pad 1 thru_hole oval (at 0 0 270) (size 4 2.2) (drill 1.3) (layers *.Cu *.Mask)
      (net 1 "Net-(J1-Pad1)"))
    (pad 4 thru_hole oval (at 7.3 -0.5) (size 4 2.2) (drill 1.3) (layers *.Cu *.Mask))
    (pad 5 thru_hole oval (at 2.9 -7.1 270) (size 4 2.2) (drill 1.3) (layers *.Cu *.Mask)
      (clearance 0.4))
    (pad 2 thru_hole oval (at 4.1 -9.8 270) (size 4 2.2) (drill 1.3) (layers *.Cu *.Mask)
      (net 1 "Net-(J1-Pad1)") (clearance 0.4))
    (pad 3 thru_hole oval (at -3.9 -4.6 270) (size 2.2 4) (drill 1.3) (layers *.Cu *.Mask)
      (net 19 +5V))
    (model ${KISYS3DMOD}/Connectors.3dshapes/Stereo_Jack_3.5mm_Switch_Ledino_KB3SPRS.wrl
      (at (xyz 0 0 0))
      (scale (xyz 1 1 1))
      (rotate (xyz 0 0 0))
    )
  )

  (module Connectors:Stereo_Jack_3.5mm_Switch_Ledino_KB3SPRS (layer F.Cu) (tedit 5AF1A07B) (tstamp 5AF01EE7)
    (at 158.115 78.74 270)
    (descr https://www.reichelt.de/index.html?ACTION=7&LA=3&OPEN=0&INDEX=0&FILENAME=C160%252FKB3SPRS.pdf)
    (tags "jack stereo TRS")
    (path /5AED50FD)
    (fp_text reference J2 (at -3.5 2.3 270) (layer F.SilkS)
      (effects (font (size 1 1) (thickness 0.15)))
    )
    (fp_text value "JACK External Switch" (at 2.3 -12.2 270) (layer F.Fab)
      (effects (font (size 1 1) (thickness 0.15)))
    )
    (fp_line (start -9.3 -7.6) (end -9.3 -1.6) (layer F.Fab) (width 0.1))
    (fp_line (start -9.3 -1.6) (end -5.7 -1.6) (layer F.Fab) (width 0.1))
    (fp_line (start -9.3 -7.6) (end -5.7 -7.6) (layer F.Fab) (width 0.1))
    (fp_line (start -5.7 -10.7) (end -5.7 0.9) (layer F.Fab) (width 0.1))
    (fp_line (start -5.7 0.9) (end 8.6 0.9) (layer F.Fab) (width 0.1))
    (fp_line (start 8.6 0.9) (end 8.6 -10.7) (layer F.Fab) (width 0.1))
    (fp_line (start 8.6 -10.7) (end -5.7 -10.7) (layer F.Fab) (width 0.1))
    (fp_text user %R (at 5.207 -3.81 270) (layer F.Fab)
      (effects (font (size 1 1) (thickness 0.15)))
    )
    (fp_line (start -9.8 2) (end 9.1 2) (layer F.CrtYd) (width 0.05))
    (fp_line (start 9.1 -11.4) (end -9.8 -11.4) (layer F.CrtYd) (width 0.05))
    (fp_line (start -5.8 -10.8) (end 2.2 -10.8) (layer F.SilkS) (width 0.15))
    (fp_line (start 6 -10.8) (end 8.7 -10.8) (layer F.SilkS) (width 0.15))
    (fp_line (start 8.7 -10.8) (end 8.7 1) (layer F.SilkS) (width 0.15))
    (fp_line (start 8.7 1) (end 8.6 1) (layer F.SilkS) (width 0.15))
    (fp_line (start 6 1) (end 1.9 1) (layer F.SilkS) (width 0.15))
    (fp_line (start -1.9 1) (end -5.8 1) (layer F.SilkS) (width 0.15))
    (fp_line (start -5.8 1) (end -5.8 -10.8) (layer F.SilkS) (width 0.15))
    (fp_line (start -5.8 -7.7) (end -9.4 -7.7) (layer F.SilkS) (width 0.15))
    (fp_line (start -9.4 -7.7) (end -9.4 -1.5) (layer F.SilkS) (width 0.15))
    (fp_line (start -9.4 -1.5) (end -5.8 -1.5) (layer F.SilkS) (width 0.15))
    (fp_line (start -9.8 -11.4) (end -9.8 2) (layer F.CrtYd) (width 0.05))
    (fp_line (start 9.1 2) (end 9.1 -11.4) (layer F.CrtYd) (width 0.05))
    (pad 1 thru_hole oval (at 0 0 270) (size 4 2.2) (drill 1.3) (layers *.Cu *.Mask)
      (net 2 "Net-(J2-Pad1)"))
    (pad 4 thru_hole oval (at 7.3 -0.5) (size 4 2.2) (drill 1.3) (layers *.Cu *.Mask))
    (pad 5 thru_hole oval (at 2.9 -7.1 270) (size 4 2.2) (drill 1.3) (layers *.Cu *.Mask)
      (clearance 0.4))
    (pad 2 thru_hole oval (at 4.1 -9.8 270) (size 4 2.2) (drill 1.3) (layers *.Cu *.Mask)
      (net 2 "Net-(J2-Pad1)") (clearance 0.4))
    (pad 3 thru_hole oval (at -3.9 -4.6 270) (size 2.2 4) (drill 1.3) (layers *.Cu *.Mask)
      (net 19 +5V))
    (model ${KISYS3DMOD}/Connectors.3dshapes/Stereo_Jack_3.5mm_Switch_Ledino_KB3SPRS.wrl
      (at (xyz 0 0 0))
      (scale (xyz 1 1 1))
      (rotate (xyz 0 0 0))
    )
  )

  (module SOP8-1369:SOP8-1369 (layer B.Cu) (tedit 0) (tstamp 5AF01EFC)
    (at 122.301 114.173 90)
    (descr "<b>SOP 8  (CASE 1369-01)</b>")
    (path /5AED4843)
    (attr smd)
    (fp_text reference MPX1 (at -4.17224 -7.41728 90) (layer B.SilkS)
      (effects (font (size 0.834342 0.834342) (thickness 0.05)) (justify mirror))
    )
    (fp_text value MPXV7007GP (at -1.2025 0.093525 90) (layer B.SilkS)
      (effects (font (size 0.673306 0.673306) (thickness 0.05)) (justify mirror))
    )
    (fp_arc (start -5.842 5.842) (end -5.842 6.1595) (angle 90) (layer B.SilkS) (width 0.2032))
    (fp_line (start -5.842 6.1595) (end 5.842 6.1595) (layer B.SilkS) (width 0.2032))
    (fp_arc (start 5.842 5.842) (end 6.1595 5.842) (angle 90) (layer B.SilkS) (width 0.2032))
    (fp_arc (start 5.842 -5.842) (end 5.842 -6.1595) (angle 90) (layer B.SilkS) (width 0.2032))
    (fp_line (start 5.842 -6.1595) (end -5.842 -6.1595) (layer B.SilkS) (width 0.2032))
    (fp_arc (start -5.842 -5.842) (end -6.1595 -5.842) (angle 90) (layer B.SilkS) (width 0.2032))
    (fp_line (start -3.81 6.223) (end -3.81 10.16) (layer Dwgs.User) (width 0.0508))
    (fp_line (start -3.81 10.16) (end -4.445 10.16) (layer Dwgs.User) (width 0.0508))
    (fp_line (start -4.445 10.16) (end -3.81 12.7) (layer Dwgs.User) (width 0.0508))
    (fp_line (start -3.81 12.7) (end -1.27 12.7) (layer Dwgs.User) (width 0.0508))
    (fp_line (start -1.27 12.7) (end -0.635 10.16) (layer Dwgs.User) (width 0.0508))
    (fp_line (start -0.635 10.16) (end -1.27 10.16) (layer Dwgs.User) (width 0.0508))
    (fp_line (start -1.27 10.16) (end -1.27 6.223) (layer Dwgs.User) (width 0.0508))
    (fp_line (start -3.81 10.16) (end -1.27 10.16) (layer Dwgs.User) (width 0.0508))
    (fp_circle (center -4.7625 3.81) (end -4.1635 3.81) (layer B.SilkS) (width 0))
    (fp_poly (pts (xy -9.35022 4.318) (xy -6.223 4.318) (xy -6.223 3.47295) (xy -9.35022 3.47295)) (layer Dwgs.User) (width 0.381))
    (fp_poly (pts (xy 8.89 3.47382) (xy 6.54672 3.47382) (xy 6.54672 4.318) (xy 8.89 4.318)) (layer Dwgs.User) (width 0.381))
    (fp_poly (pts (xy -9.33003 1.778) (xy -6.223 1.778) (xy -6.223 0.799719) (xy -9.33003 0.799719)) (layer Dwgs.User) (width 0.381))
    (fp_poly (pts (xy -9.3229 -0.762) (xy -6.223 -0.762) (xy -6.223 -1.86459) (xy -9.3229 -1.86459)) (layer Dwgs.User) (width 0.381))
    (fp_poly (pts (xy -9.37326 -3.302) (xy -6.223 -3.302) (xy -6.223 -4.5527) (xy -9.37326 -4.5527)) (layer Dwgs.User) (width 0.381))
    (fp_poly (pts (xy 8.89 0.802386) (xy 6.55284 0.802386) (xy 6.55284 1.778) (xy 8.89 1.778)) (layer Dwgs.User) (width 0.381))
    (fp_poly (pts (xy 8.89 -1.87381) (xy 6.55821 -1.87381) (xy 6.55821 -0.762) (xy 8.89 -0.762)) (layer Dwgs.User) (width 0.381))
    (fp_poly (pts (xy 8.89 -4.52207) (xy 6.51705 -4.52207) (xy 6.51705 -3.302) (xy 8.89 -3.302)) (layer Dwgs.User) (width 0.381))
    (pad 1 smd rect (at -8.382 3.81 90) (size 2.54 1.524) (layers B.Cu B.Paste B.Mask))
    (pad 2 smd rect (at -8.382 1.27 90) (size 2.54 1.524) (layers B.Cu B.Paste B.Mask)
      (net 19 +5V))
    (pad 3 smd rect (at -8.382 -1.27 90) (size 2.54 1.524) (layers B.Cu B.Paste B.Mask)
      (net 20 GND))
    (pad 4 smd rect (at -8.382 -3.81 90) (size 2.54 1.524) (layers B.Cu B.Paste B.Mask)
      (net 4 "Net-(MPX1-Pad4)"))
    (pad 5 smd rect (at 8.382 -3.81 90) (size 2.54 1.524) (layers B.Cu B.Paste B.Mask))
    (pad 6 smd rect (at 8.382 -1.27 90) (size 2.54 1.524) (layers B.Cu B.Paste B.Mask))
    (pad 7 smd rect (at 8.382 1.27 90) (size 2.54 1.524) (layers B.Cu B.Paste B.Mask))
    (pad 8 smd rect (at 8.382 3.81 90) (size 2.54 1.524) (layers B.Cu B.Paste B.Mask))
  )

  (module Resistors_THT:Resistor_Array_SIP5 (layer F.Cu) (tedit 5AF43A74) (tstamp 5AF01F0E)
    (at 141.605 101.219 90)
    (descr "5-pin Resistor SIP pack")
    (tags R)
    (path /5AEC2168)
    (fp_text reference RN1 (at 6.35 -2.4 90) (layer F.SilkS)
      (effects (font (size 1 1) (thickness 0.15)))
    )
    (fp_text value "RNet 10k" (at 6.35 2.4 90) (layer F.Fab)
      (effects (font (size 1 1) (thickness 0.15)))
    )
    (fp_line (start -1.29 -1.25) (end -1.29 1.25) (layer F.Fab) (width 0.1))
    (fp_line (start -1.29 1.25) (end 11.45 1.25) (layer F.Fab) (width 0.1))
    (fp_line (start 11.45 1.25) (end 11.45 -1.25) (layer F.Fab) (width 0.1))
    (fp_line (start 11.45 -1.25) (end -1.29 -1.25) (layer F.Fab) (width 0.1))
    (fp_line (start 1.27 -1.25) (end 1.27 1.25) (layer F.Fab) (width 0.1))
    (fp_line (start -1.44 -1.4) (end -1.44 1.4) (layer F.SilkS) (width 0.15))
    (fp_line (start -1.44 1.4) (end 11.6 1.4) (layer F.SilkS) (width 0.15))
    (fp_line (start 11.6 1.4) (end 11.6 -1.4) (layer F.SilkS) (width 0.15))
    (fp_line (start 11.6 -1.4) (end -1.44 -1.4) (layer F.SilkS) (width 0.15))
    (fp_line (start 1.27 -1.4) (end 1.27 1.4) (layer F.SilkS) (width 0.15))
    (fp_line (start -1.7 -1.65) (end -1.7 1.65) (layer F.CrtYd) (width 0.05))
    (fp_line (start -1.7 1.65) (end 11.9 1.65) (layer F.CrtYd) (width 0.05))
    (fp_line (start 11.9 1.65) (end 11.9 -1.65) (layer F.CrtYd) (width 0.05))
    (fp_line (start 11.9 -1.65) (end -1.7 -1.65) (layer F.CrtYd) (width 0.05))
    (pad 1 thru_hole rect (at 0 0 90) (size 1.8 1.8) (drill 0.8) (layers *.Cu *.Mask)
      (net 19 +5V))
    (pad 2 thru_hole oval (at 2.54 0 90) (size 1.8 1.8) (drill 0.8) (layers *.Cu *.Mask)
      (net 7 "Net-(P1-Pad4)"))
    (pad 3 thru_hole oval (at 5.08 0 90) (size 1.8 1.8) (drill 0.8) (layers *.Cu *.Mask)
      (net 6 "Net-(P1-Pad3)"))
    (pad 4 thru_hole oval (at 7.62 0 90) (size 1.8 1.8) (drill 0.8) (layers *.Cu *.Mask)
      (net 5 "Net-(P1-Pad2)"))
    (pad 5 thru_hole oval (at 10.16 0 90) (size 1.8 1.8) (drill 0.8) (layers *.Cu *.Mask)
      (net 18 "Net-(P1-Pad1)"))
    (model Resistors_ThroughHole.3dshapes/Resistor_Array_SIP5.wrl
      (at (xyz 0 0 0))
      (scale (xyz 0.393701 0.393701 0.393701))
      (rotate (xyz 0 0 0))
    )
  )

  (module Resistors_THT:Resistor_Array_SIP5 (layer F.Cu) (tedit 5AF43A1D) (tstamp 5AF01F17)
    (at 152.146 103.251)
    (descr "5-pin Resistor SIP pack")
    (tags R)
    (path /5AED69C9)
    (fp_text reference RN2 (at 6.35 -2.4) (layer F.SilkS)
      (effects (font (size 1 1) (thickness 0.15)))
    )
    (fp_text value "RNet 10k" (at 6.35 2.4) (layer F.Fab)
      (effects (font (size 1 1) (thickness 0.15)))
    )
    (fp_line (start -1.29 -1.25) (end -1.29 1.25) (layer F.Fab) (width 0.1))
    (fp_line (start -1.29 1.25) (end 11.45 1.25) (layer F.Fab) (width 0.1))
    (fp_line (start 11.45 1.25) (end 11.45 -1.25) (layer F.Fab) (width 0.1))
    (fp_line (start 11.45 -1.25) (end -1.29 -1.25) (layer F.Fab) (width 0.1))
    (fp_line (start 1.27 -1.25) (end 1.27 1.25) (layer F.Fab) (width 0.1))
    (fp_line (start -1.44 -1.4) (end -1.44 1.4) (layer F.SilkS) (width 0.15))
    (fp_line (start -1.44 1.4) (end 11.6 1.4) (layer F.SilkS) (width 0.15))
    (fp_line (start 11.6 1.4) (end 11.6 -1.4) (layer F.SilkS) (width 0.15))
    (fp_line (start 11.6 -1.4) (end -1.44 -1.4) (layer F.SilkS) (width 0.15))
    (fp_line (start 1.27 -1.4) (end 1.27 1.4) (layer F.SilkS) (width 0.15))
    (fp_line (start -1.7 -1.65) (end -1.7 1.65) (layer F.CrtYd) (width 0.05))
    (fp_line (start -1.7 1.65) (end 11.9 1.65) (layer F.CrtYd) (width 0.05))
    (fp_line (start 11.9 1.65) (end 11.9 -1.65) (layer F.CrtYd) (width 0.05))
    (fp_line (start 11.9 -1.65) (end -1.7 -1.65) (layer F.CrtYd) (width 0.05))
    (pad 1 thru_hole rect (at 0 0) (size 1.8 1.8) (drill 0.8) (layers *.Cu *.Mask)
      (net 20 GND))
    (pad 2 thru_hole oval (at 2.54 0) (size 1.8 1.8) (drill 0.8) (layers *.Cu *.Mask)
      (net 8 "Net-(RN2-Pad2)"))
    (pad 3 thru_hole oval (at 5.08 0) (size 1.8 1.8) (drill 0.8) (layers *.Cu *.Mask)
      (net 1 "Net-(J1-Pad1)"))
    (pad 4 thru_hole oval (at 7.62 0) (size 1.8 1.8) (drill 0.8) (layers *.Cu *.Mask)
      (net 3 "Net-(J3-Pad1)"))
    (pad 5 thru_hole oval (at 10.16 0) (size 1.8 1.8) (drill 0.8) (layers *.Cu *.Mask)
      (net 2 "Net-(J2-Pad1)"))
    (model Resistors_ThroughHole.3dshapes/Resistor_Array_SIP5.wrl
      (at (xyz 0 0 0))
      (scale (xyz 0.393701 0.393701 0.393701))
      (rotate (xyz 0 0 0))
    )
  )

  (module Buttons_Switches_THT:SW_Tactile_SPST_Angled (layer F.Cu) (tedit 5AF43B22) (tstamp 5AF01F1F)
    (at 170.18 114.3 270)
    (descr "tactile switch SPST right angle, 1825027-2")
    (tags "tactile switch SPST angled 1825027-2")
    (path /5AED5B84)
    (fp_text reference SW1 (at 2.5 4.65 270) (layer F.SilkS)
      (effects (font (size 1 1) (thickness 0.15)))
    )
    (fp_text value RST (at 1.9685 -2.3495 270) (layer F.Fab)
      (effects (font (size 1 1) (thickness 0.15)))
    )
    (fp_line (start -2.5 -1.5) (end 7.05 -1.5) (layer F.CrtYd) (width 0.05))
    (fp_line (start 7.05 -1.5) (end 7.05 3.8) (layer F.CrtYd) (width 0.05))
    (fp_line (start 7.05 3.8) (end -2.5 3.8) (layer F.CrtYd) (width 0.05))
    (fp_line (start -2.5 3.8) (end -2.5 -1.5) (layer F.CrtYd) (width 0.05))
    (fp_line (start -1.397 -1.27) (end 5.9 -1.27) (layer F.SilkS) (width 0.15))
    (fp_line (start 5.9 -1.27) (end 5.9 1.3) (layer F.SilkS) (width 0.15))
    (fp_line (start 0 3.03) (end 4.5 3.03) (layer F.SilkS) (width 0.15))
    (fp_line (start -1.397 -1.27) (end -1.397 1.3) (layer F.SilkS) (width 0.15))
    (pad "" thru_hole circle (at 5.76 2.49 270) (size 1.8 1.8) (drill 1.3) (layers *.Cu *.Mask))
    (pad 2 thru_hole circle (at 4.5 0 270) (size 1.8 1.8) (drill 0.99) (layers *.Cu *.Mask)
      (net 20 GND))
    (pad 1 thru_hole circle (at 0 0 270) (size 1.8 1.8) (drill 0.99) (layers *.Cu *.Mask)
      (net 9 "Net-(SW1-Pad1)"))
    (pad "" thru_hole circle (at -1.25 2.49 270) (size 1.8 1.8) (drill 1.3) (layers *.Cu *.Mask))
    (model Buttons_Switches_ThroughHole.3dshapes/SW_Tactile_SPST_Angled.wrl
      (at (xyz 0.09 0.1 0.1575))
      (scale (xyz 0.39 0.39 0.39))
      (rotate (xyz -90 0 180))
    )
  )

  (module Buttons_Switches_THT:SW_Tactile_SPST_Angled (layer F.Cu) (tedit 5AF43BF8) (tstamp 5AF01F27)
    (at 136.652 121.92 180)
    (descr "tactile switch SPST right angle, 1825027-2")
    (tags "tactile switch SPST angled 1825027-2")
    (path /5AED5CBF)
    (fp_text reference SW2 (at 2.5 4.65 180) (layer F.SilkS)
      (effects (font (size 1 1) (thickness 0.15)))
    )
    (fp_text value "Mode Selector" (at 1.9685 -2.3495 180) (layer F.Fab)
      (effects (font (size 1 1) (thickness 0.15)))
    )
    (fp_line (start -2.5 -1.5) (end 7.05 -1.5) (layer F.CrtYd) (width 0.05))
    (fp_line (start 7.05 -1.5) (end 7.05 3.8) (layer F.CrtYd) (width 0.05))
    (fp_line (start 7.05 3.8) (end -2.5 3.8) (layer F.CrtYd) (width 0.05))
    (fp_line (start -2.5 3.8) (end -2.5 -1.5) (layer F.CrtYd) (width 0.05))
    (fp_line (start -1.397 -1.27) (end 5.9 -1.27) (layer F.SilkS) (width 0.15))
    (fp_line (start 5.9 -1.27) (end 5.9 1.3) (layer F.SilkS) (width 0.15))
    (fp_line (start 0 3.03) (end 4.5 3.03) (layer F.SilkS) (width 0.15))
    (fp_line (start -1.397 -1.27) (end -1.397 1.3) (layer F.SilkS) (width 0.15))
    (pad "" thru_hole circle (at 5.76 2.49 180) (size 1.8 1.8) (drill 1.3) (layers *.Cu *.Mask))
    (pad 2 thru_hole circle (at 4.5 0 180) (size 1.8 1.8) (drill 0.99) (layers *.Cu *.Mask)
      (net 8 "Net-(RN2-Pad2)"))
    (pad 1 thru_hole circle (at 0 0 180) (size 1.8 1.8) (drill 0.99) (layers *.Cu *.Mask)
      (net 19 +5V))
    (pad "" thru_hole circle (at -1.25 2.49 180) (size 1.8 1.8) (drill 1.3) (layers *.Cu *.Mask))
    (model Buttons_Switches_ThroughHole.3dshapes/SW_Tactile_SPST_Angled.wrl
      (at (xyz 0.09 0.1 0.1575))
      (scale (xyz 0.39 0.39 0.39))
      (rotate (xyz -90 0 180))
    )
  )

  (module Pin_Headers:Pin_Header_Straight_1x05 (layer F.Cu) (tedit 5AF43A42) (tstamp 5AF01F05)
    (at 146.304 91.186)
    (descr "Through hole pin header")
    (tags "pin header")
    (path /5AF14E8A)
    (fp_text reference P1 (at 0 -5.1) (layer F.SilkS)
      (effects (font (size 1 1) (thickness 0.15)))
    )
    (fp_text value CONN_01X05 (at 0 -3.1) (layer F.Fab)
      (effects (font (size 1 1) (thickness 0.15)))
    )
    (fp_line (start -1.55 0) (end -1.55 -1.55) (layer F.SilkS) (width 0.15))
    (fp_line (start -1.55 -1.55) (end 1.55 -1.55) (layer F.SilkS) (width 0.15))
    (fp_line (start 1.55 -1.55) (end 1.55 0) (layer F.SilkS) (width 0.15))
    (fp_line (start -1.75 -1.75) (end -1.75 11.95) (layer F.CrtYd) (width 0.05))
    (fp_line (start 1.75 -1.75) (end 1.75 11.95) (layer F.CrtYd) (width 0.05))
    (fp_line (start -1.75 -1.75) (end 1.75 -1.75) (layer F.CrtYd) (width 0.05))
    (fp_line (start -1.75 11.95) (end 1.75 11.95) (layer F.CrtYd) (width 0.05))
    (fp_line (start 1.27 1.27) (end 1.27 11.43) (layer F.SilkS) (width 0.15))
    (fp_line (start 1.27 11.43) (end -1.27 11.43) (layer F.SilkS) (width 0.15))
    (fp_line (start -1.27 11.43) (end -1.27 1.27) (layer F.SilkS) (width 0.15))
    (fp_line (start 1.27 1.27) (end -1.27 1.27) (layer F.SilkS) (width 0.15))
    (pad 1 thru_hole rect (at 0 0) (size 1.8 1.8) (drill 1.016) (layers *.Cu *.Mask)
      (net 18 "Net-(P1-Pad1)"))
    (pad 2 thru_hole oval (at 0 2.54) (size 1.8 1.8) (drill 1.016) (layers *.Cu *.Mask)
      (net 5 "Net-(P1-Pad2)"))
    (pad 3 thru_hole oval (at 0 5.08) (size 1.8 1.8) (drill 1.016) (layers *.Cu *.Mask)
      (net 6 "Net-(P1-Pad3)"))
    (pad 4 thru_hole oval (at 0 7.62) (size 1.8 1.8) (drill 1.016) (layers *.Cu *.Mask)
      (net 7 "Net-(P1-Pad4)"))
    (pad 5 thru_hole oval (at 0 10.16) (size 1.8 1.8) (drill 1.016) (layers *.Cu *.Mask)
      (net 20 GND))
    (model Pin_Headers.3dshapes/Pin_Header_Straight_1x05.wrl
      (at (xyz 0 -0.2 0))
      (scale (xyz 1 1 1))
      (rotate (xyz 0 0 90))
    )
  )

  (module Pin_Headers:Pin_Header_Straight_1x04 (layer F.Cu) (tedit 5AF43A7F) (tstamp 5AF190D1)
    (at 137.922 107.188)
    (descr "Through hole pin header")
    (tags "pin header")
    (path /5AF191A8)
    (fp_text reference P2 (at 0 -5.1) (layer F.SilkS)
      (effects (font (size 1 1) (thickness 0.15)))
    )
    (fp_text value CONN_I2C (at 0 -3.1) (layer F.Fab)
      (effects (font (size 1 1) (thickness 0.15)))
    )
    (fp_line (start -1.75 -1.75) (end -1.75 9.4) (layer F.CrtYd) (width 0.05))
    (fp_line (start 1.75 -1.75) (end 1.75 9.4) (layer F.CrtYd) (width 0.05))
    (fp_line (start -1.75 -1.75) (end 1.75 -1.75) (layer F.CrtYd) (width 0.05))
    (fp_line (start -1.75 9.4) (end 1.75 9.4) (layer F.CrtYd) (width 0.05))
    (fp_line (start -1.27 1.27) (end -1.27 8.89) (layer F.SilkS) (width 0.15))
    (fp_line (start 1.27 1.27) (end 1.27 8.89) (layer F.SilkS) (width 0.15))
    (fp_line (start 1.55 -1.55) (end 1.55 0) (layer F.SilkS) (width 0.15))
    (fp_line (start -1.27 8.89) (end 1.27 8.89) (layer F.SilkS) (width 0.15))
    (fp_line (start 1.27 1.27) (end -1.27 1.27) (layer F.SilkS) (width 0.15))
    (fp_line (start -1.55 0) (end -1.55 -1.55) (layer F.SilkS) (width 0.15))
    (fp_line (start -1.55 -1.55) (end 1.55 -1.55) (layer F.SilkS) (width 0.15))
    (pad 1 thru_hole rect (at 0 0) (size 2.2 2.2) (drill 1.016) (layers *.Cu *.Mask)
      (net 19 +5V))
    (pad 2 thru_hole oval (at 0 2.54) (size 2.2 2.2) (drill 1.016) (layers *.Cu *.Mask)
      (net 23 "Net-(P2-Pad2)"))
    (pad 3 thru_hole oval (at 0 5.08) (size 2.2 2.2) (drill 1.016) (layers *.Cu *.Mask)
      (net 24 "Net-(P2-Pad3)"))
    (pad 4 thru_hole oval (at 0 7.62) (size 1.8 1.8) (drill 1.016) (layers *.Cu *.Mask)
      (net 20 GND))
    (model Pin_Headers.3dshapes/Pin_Header_Straight_1x04.wrl
      (at (xyz 0 -0.15 0))
      (scale (xyz 1 1 1))
      (rotate (xyz 0 0 90))
    )
  )

  (dimension 57.912 (width 0.3) (layer Margin)
    (gr_text "57.912 mm" (at 143.256 62.15) (layer Margin)
      (effects (font (size 1.5 1.5) (thickness 0.3)))
    )
    (feature1 (pts (xy 172.212 70.104) (xy 172.212 60.8)))
    (feature2 (pts (xy 114.3 70.104) (xy 114.3 60.8)))
    (crossbar (pts (xy 114.3 63.5) (xy 172.212 63.5)))
    (arrow1a (pts (xy 172.212 63.5) (xy 171.085496 64.086421)))
    (arrow1b (pts (xy 172.212 63.5) (xy 171.085496 62.913579)))
    (arrow2a (pts (xy 114.3 63.5) (xy 115.426504 64.086421)))
    (arrow2b (pts (xy 114.3 63.5) (xy 115.426504 62.913579)))
  )
  (gr_line (start 114.3 125.984) (end 172.212 125.984) (angle 90) (layer Edge.Cuts) (width 0.15))
  (gr_line (start 114.3 70.104) (end 114.3 125.984) (angle 90) (layer Edge.Cuts) (width 0.15))
  (gr_line (start 172.212 70.104) (end 114.3 70.104) (angle 90) (layer Edge.Cuts) (width 0.15))
  (gr_line (start 172.212 125.984) (end 172.212 70.104) (angle 90) (layer Edge.Cuts) (width 0.15))
  (gr_line (start 114.3 125.984) (end 114.3 70.104) (angle 90) (layer Edge.Cuts) (width 0.15))
  (dimension 55.88 (width 0.3) (layer Margin)
    (gr_text "55.880 mm" (at 110.41 98.044 270) (layer Margin)
      (effects (font (size 1.5 1.5) (thickness 0.3)))
    )
    (feature1 (pts (xy 114.3 125.984) (xy 109.06 125.984)))
    (feature2 (pts (xy 114.3 70.104) (xy 109.06 70.104)))
    (crossbar (pts (xy 111.76 70.104) (xy 111.76 125.984)))
    (arrow1a (pts (xy 111.76 125.984) (xy 111.173579 124.857496)))
    (arrow1b (pts (xy 111.76 125.984) (xy 112.346421 124.857496)))
    (arrow2a (pts (xy 111.76 70.104) (xy 111.173579 71.230504)))
    (arrow2b (pts (xy 111.76 70.104) (xy 112.346421 71.230504)))
  )

  (segment (start 172.085 115.824) (end 172.085 115.824) (width 0.2) (layer B.Cu) (net 0) (tstamp 5AF17285))
  (segment (start 172.085 115.824) (end 172.085 115.824) (width 0.2) (layer B.Cu) (net 0) (tstamp 5AF17282))
  (segment (start 172.085 115.824) (end 172.085 115.824) (width 0.2) (layer B.Cu) (net 0) (tstamp 5AF17276))
  (segment (start 150.516 82.84) (end 150.516 90.784) (width 0.6) (layer B.Cu) (net 1))
  (segment (start 157.226 97.536) (end 157.226 103.251) (width 0.6) (layer B.Cu) (net 1) (tstamp 5AF19C21))
  (via (at 157.226 97.536) (size 2.1) (drill 1) (layers F.Cu B.Cu) (net 1))
  (segment (start 150.495 90.805) (end 157.226 97.536) (width 0.6) (layer F.Cu) (net 1) (tstamp 5AF19C1A))
  (via (at 150.495 90.805) (size 2.1) (drill 1) (layers F.Cu B.Cu) (net 1))
  (segment (start 150.516 90.784) (end 150.495 90.805) (width 0.6) (layer B.Cu) (net 1) (tstamp 5AF19C11))
  (segment (start 140.716 78.74) (end 149.098 78.74) (width 0.6) (layer B.Cu) (net 1))
  (segment (start 150.516 80.158) (end 150.516 82.84) (width 0.6) (layer B.Cu) (net 1) (tstamp 5AF195E0))
  (segment (start 149.098 78.74) (end 150.516 80.158) (width 0.6) (layer B.Cu) (net 1) (tstamp 5AF195D8))
  (segment (start 119.126 94.742) (end 122.301 94.742) (width 0.6) (layer B.Cu) (net 1))
  (segment (start 140.716 75.565) (end 140.716 78.74) (width 0.6) (layer B.Cu) (net 1) (tstamp 5AF195CB))
  (segment (start 136.779 71.628) (end 140.716 75.565) (width 0.6) (layer B.Cu) (net 1) (tstamp 5AF195CA))
  (via (at 136.779 71.628) (size 2.1) (drill 1) (layers F.Cu B.Cu) (net 1))
  (segment (start 132.842 71.628) (end 136.779 71.628) (width 0.6) (layer F.Cu) (net 1) (tstamp 5AF195C2))
  (segment (start 129.159 75.311) (end 132.842 71.628) (width 0.6) (layer F.Cu) (net 1) (tstamp 5AF195BE))
  (segment (start 129.159 87.884) (end 129.159 75.311) (width 0.6) (layer F.Cu) (net 1) (tstamp 5AF195B3))
  (segment (start 122.301 94.742) (end 129.159 87.884) (width 0.6) (layer F.Cu) (net 1) (tstamp 5AF195B2))
  (via (at 122.301 94.742) (size 2.1) (drill 1) (layers F.Cu B.Cu) (net 1))
  (segment (start 141.351 78.105) (end 140.716 78.74) (width 0.2) (layer B.Cu) (net 1) (tstamp 5AF1751C))
  (segment (start 151.115 83.439) (end 150.516 82.84) (width 0.2) (layer B.Cu) (net 1) (tstamp 5AF17513))
  (segment (start 140.716 78.74) (end 140.208 78.74) (width 0.2) (layer B.Cu) (net 1))
  (segment (start 116.713 99.949) (end 116.713 119.253) (width 0.6) (layer F.Cu) (net 2))
  (segment (start 116.713 119.253) (end 122.428 124.968) (width 0.6) (layer F.Cu) (net 2) (tstamp 5AF19EC9))
  (segment (start 122.428 124.968) (end 143.764 124.968) (width 0.6) (layer F.Cu) (net 2) (tstamp 5AF19ECF))
  (segment (start 143.764 124.968) (end 144.399 124.333) (width 0.6) (layer F.Cu) (net 2) (tstamp 5AF19EDC))
  (segment (start 144.399 124.333) (end 161.798 124.333) (width 0.6) (layer F.Cu) (net 2) (tstamp 5AF19EDD))
  (segment (start 161.798 124.333) (end 165.735 120.396) (width 0.6) (layer F.Cu) (net 2) (tstamp 5AF19F18))
  (segment (start 165.735 120.396) (end 165.735 103.251) (width 0.6) (layer F.Cu) (net 2) (tstamp 5AF19F20))
  (via (at 165.735 103.251) (size 2.1) (drill 1) (layers F.Cu B.Cu) (net 2))
  (segment (start 165.735 103.251) (end 162.306 103.251) (width 0.6) (layer B.Cu) (net 2) (tstamp 5AF19F4D))
  (via (at 116.713 99.949) (size 2.1) (drill 1) (layers F.Cu B.Cu) (net 2))
  (segment (start 116.713 99.949) (end 116.84 99.822) (width 0.6) (layer B.Cu) (net 2) (tstamp 5AF3DEEB))
  (segment (start 116.84 99.822) (end 119.126 99.822) (width 0.6) (layer B.Cu) (net 2) (tstamp 5AF3DEEC))
  (segment (start 116.586 99.822) (end 116.713 99.949) (width 0.6) (layer F.Cu) (net 2) (tstamp 5AF19EBB))
  (segment (start 162.306 103.251) (end 162.052 95.377) (width 0.6) (layer B.Cu) (net 2) (status 10))
  (segment (start 162.052 95.377) (end 167.915 89.514) (width 0.6) (layer B.Cu) (net 2) (tstamp 5AF1972B))
  (segment (start 167.915 89.514) (end 167.915 82.84) (width 0.6) (layer B.Cu) (net 2) (tstamp 5AF19730))
  (segment (start 158.115 78.74) (end 166.751 78.74) (width 0.6) (layer B.Cu) (net 2))
  (segment (start 167.915 79.904) (end 167.915 82.84) (width 0.6) (layer B.Cu) (net 2) (tstamp 5AF19723))
  (segment (start 166.751 78.74) (end 167.915 79.904) (width 0.6) (layer B.Cu) (net 2) (tstamp 5AF1971E))
  (segment (start 158.115 78.74) (end 158.115 80.518) (width 0.2) (layer B.Cu) (net 2) (status 30))
  (segment (start 158.115 78.74) (end 158.115 80.264) (width 0.2) (layer B.Cu) (net 2) (status 30))
  (segment (start 119.126 102.362) (end 121.793 102.362) (width 0.6) (layer B.Cu) (net 3))
  (segment (start 149.606 116.84) (end 152.76 113.686) (width 0.6) (layer B.Cu) (net 3) (tstamp 5AF19D49))
  (via (at 149.606 116.84) (size 2.1) (drill 1) (layers F.Cu B.Cu) (net 3))
  (segment (start 142.705002 123.740998) (end 149.606 116.84) (width 0.6) (layer F.Cu) (net 3) (tstamp 5AF19D3F))
  (segment (start 128.185998 123.740998) (end 142.705002 123.740998) (width 0.6) (layer F.Cu) (net 3) (tstamp 5AF19D38))
  (segment (start 124.079 119.634) (end 128.185998 123.740998) (width 0.6) (layer F.Cu) (net 3) (tstamp 5AF19D1F))
  (segment (start 124.079 104.648) (end 124.079 119.634) (width 0.6) (layer F.Cu) (net 3) (tstamp 5AF19D18))
  (segment (start 121.92 102.489) (end 124.079 104.648) (width 0.6) (layer F.Cu) (net 3) (tstamp 5AF19D17))
  (via (at 121.92 102.489) (size 2.1) (drill 1) (layers F.Cu B.Cu) (net 3))
  (segment (start 121.793 102.362) (end 121.92 102.489) (width 0.6) (layer B.Cu) (net 3) (tstamp 5AF19D12))
  (segment (start 152.76 113.686) (end 152.76 113.248) (width 0.6) (layer B.Cu) (net 3) (tstamp 5AF19D4A))
  (segment (start 152.76 113.248) (end 152.76 111.527) (width 0.6) (layer B.Cu) (net 3))
  (segment (start 152.76 111.527) (end 159.766 103.251) (width 0.6) (layer B.Cu) (net 3) (tstamp 5AF19A23) (status 20))
  (segment (start 162.56 117.348) (end 154.305 117.348) (width 0.6) (layer B.Cu) (net 3))
  (segment (start 152.76 115.803) (end 152.76 113.248) (width 0.6) (layer B.Cu) (net 3) (tstamp 5AF1973E))
  (segment (start 154.305 117.348) (end 152.76 115.803) (width 0.6) (layer B.Cu) (net 3) (tstamp 5AF19738))
  (segment (start 134.366 102.362) (end 137.668 102.362) (width 0.6) (layer B.Cu) (net 4))
  (segment (start 118.491 115.951) (end 118.491 122.555) (width 0.6) (layer B.Cu) (net 4) (tstamp 5AF198EC))
  (segment (start 124.714 109.728) (end 118.491 115.951) (width 0.6) (layer B.Cu) (net 4) (tstamp 5AF198E6))
  (segment (start 130.302 109.728) (end 124.714 109.728) (width 0.6) (layer B.Cu) (net 4) (tstamp 5AF198D0))
  (segment (start 130.175 109.855) (end 130.302 109.728) (width 0.6) (layer B.Cu) (net 4) (tstamp 5AF198CF))
  (via (at 130.175 109.855) (size 2.1) (drill 1) (layers F.Cu B.Cu) (net 4))
  (segment (start 137.668 102.362) (end 130.175 109.855) (width 0.6) (layer F.Cu) (net 4) (tstamp 5AF1989B))
  (via (at 137.668 102.362) (size 2.1) (drill 1) (layers F.Cu B.Cu) (net 4))
  (segment (start 141.605 93.599) (end 146.177 93.599) (width 0.6) (layer B.Cu) (net 5))
  (segment (start 146.177 93.599) (end 146.304 93.726) (width 0.6) (layer B.Cu) (net 5) (tstamp 5AF19341))
  (segment (start 134.366 87.122) (end 135.128 87.122) (width 0.6) (layer B.Cu) (net 5))
  (segment (start 135.128 87.122) (end 141.605 93.599) (width 0.6) (layer B.Cu) (net 5) (tstamp 5AF19332))
  (segment (start 141.605 96.139) (end 146.177 96.139) (width 0.6) (layer B.Cu) (net 6))
  (segment (start 146.177 96.139) (end 146.304 96.266) (width 0.6) (layer B.Cu) (net 6) (tstamp 5AF1933E))
  (segment (start 134.366 89.662) (end 135.128 89.662) (width 0.6) (layer B.Cu) (net 6))
  (segment (start 135.128 89.662) (end 141.605 96.139) (width 0.6) (layer B.Cu) (net 6) (tstamp 5AF19335))
  (segment (start 141.605 98.679) (end 146.177 98.679) (width 0.6) (layer B.Cu) (net 7))
  (segment (start 146.177 98.679) (end 146.304 98.806) (width 0.6) (layer B.Cu) (net 7) (tstamp 5AF1933B))
  (segment (start 134.366 92.202) (end 135.128 92.202) (width 0.6) (layer B.Cu) (net 7))
  (segment (start 135.128 92.202) (end 141.605 98.679) (width 0.6) (layer B.Cu) (net 7) (tstamp 5AF19338))
  (segment (start 154.94 106.299) (end 154.686 106.299) (width 0.6) (layer F.Cu) (net 8))
  (segment (start 154.686 106.299) (end 154.432 106.553) (width 0.6) (layer F.Cu) (net 8) (tstamp 5AF3DF11))
  (via (at 154.432 106.553) (size 2.1) (drill 1) (layers F.Cu B.Cu) (net 8))
  (segment (start 154.432 106.553) (end 154.686 106.299) (width 0.6) (layer B.Cu) (net 8) (tstamp 5AF3DF14))
  (segment (start 154.686 106.299) (end 154.686 103.251) (width 0.6) (layer B.Cu) (net 8) (tstamp 5AF3DF15))
  (segment (start 154.813 106.299) (end 154.94 106.299) (width 0.6) (layer F.Cu) (net 8))
  (segment (start 154.94 106.299) (end 159.639 106.299) (width 0.6) (layer F.Cu) (net 8) (tstamp 5AF3DF0F))
  (segment (start 159.639 106.299) (end 159.766 106.426) (width 0.6) (layer F.Cu) (net 8) (tstamp 5AF19DBB))
  (via (at 159.766 106.426) (size 2.1) (drill 1) (layers F.Cu B.Cu) (net 8))
  (segment (start 159.766 106.426) (end 164.846 106.426) (width 0.6) (layer B.Cu) (net 8) (tstamp 5AF19DC1))
  (segment (start 164.846 106.426) (end 165.735 107.315) (width 0.6) (layer B.Cu) (net 8) (tstamp 5AF19DC2))
  (segment (start 165.735 107.315) (end 165.735 107.696) (width 0.6) (layer B.Cu) (net 8) (tstamp 5AF19DC6))
  (segment (start 165.735 122.682) (end 165.735 107.696) (width 0.6) (layer B.Cu) (net 8))
  (segment (start 134.535998 123.867998) (end 164.549002 123.867998) (width 0.6) (layer B.Cu) (net 8) (tstamp 5AF1991C))
  (segment (start 164.549002 123.867998) (end 165.735 122.682) (width 0.6) (layer B.Cu) (net 8) (tstamp 5AF1991E))
  (segment (start 134.535998 123.867998) (end 132.588 121.92) (width 0.6) (layer B.Cu) (net 8) (tstamp 5AF1991A) (status 20))
  (segment (start 119.126 97.282) (end 122.047 97.282) (width 0.6) (layer B.Cu) (net 8))
  (segment (start 129.286 121.92) (end 132.152 121.92) (width 0.6) (layer B.Cu) (net 8) (tstamp 5AF19ABC) (status 20))
  (segment (start 126.365 118.999) (end 129.286 121.92) (width 0.6) (layer B.Cu) (net 8) (tstamp 5AF19ABB))
  (via (at 126.365 118.999) (size 2.1) (drill 1) (layers F.Cu B.Cu) (net 8))
  (segment (start 126.365 101.6) (end 126.365 118.999) (width 0.6) (layer F.Cu) (net 8) (tstamp 5AF19AB3))
  (segment (start 122.301 97.536) (end 126.365 101.6) (width 0.6) (layer F.Cu) (net 8) (tstamp 5AF19AB2))
  (via (at 122.301 97.536) (size 2.1) (drill 1) (layers F.Cu B.Cu) (net 8))
  (segment (start 122.047 97.282) (end 122.301 97.536) (width 0.6) (layer B.Cu) (net 8) (tstamp 5AF19AAE))
  (segment (start 154.432 103.632) (end 154.686 103.251) (width 0.6) (layer B.Cu) (net 8) (tstamp 5AF199DC) (status 20))
  (segment (start 132.152 121.92) (end 132.588 121.92) (width 0.6) (layer B.Cu) (net 8) (status 30))
  (segment (start 132.152 121.92) (end 132.152 121.721) (width 0.2) (layer B.Cu) (net 8) (status 30))
  (segment (start 170.18 114.3) (end 170.18 75.946) (width 0.6) (layer B.Cu) (net 9))
  (segment (start 136.271 79.502) (end 134.366 79.502) (width 0.6) (layer B.Cu) (net 9) (tstamp 5AF19CBE))
  (segment (start 137.668 78.105) (end 136.271 79.502) (width 0.6) (layer B.Cu) (net 9) (tstamp 5AF19CB9))
  (segment (start 137.668 75.692) (end 137.668 78.105) (width 0.6) (layer B.Cu) (net 9) (tstamp 5AF19CB8))
  (via (at 137.668 75.692) (size 2.1) (drill 1) (layers F.Cu B.Cu) (net 9))
  (segment (start 141.478 71.882) (end 137.668 75.692) (width 0.6) (layer F.Cu) (net 9) (tstamp 5AF19C76))
  (segment (start 154.559 71.882) (end 141.478 71.882) (width 0.6) (layer F.Cu) (net 9) (tstamp 5AF19C75))
  (via (at 154.559 71.882) (size 2.1) (drill 1) (layers F.Cu B.Cu) (net 9))
  (segment (start 154.813 71.628) (end 154.559 71.882) (width 0.6) (layer B.Cu) (net 9) (tstamp 5AF19C55))
  (segment (start 165.862 71.628) (end 154.813 71.628) (width 0.6) (layer B.Cu) (net 9) (tstamp 5AF19C53))
  (segment (start 170.18 75.946) (end 165.862 71.628) (width 0.6) (layer B.Cu) (net 9) (tstamp 5AF19C4A))
  (segment (start 141.605 91.059) (end 146.177 91.059) (width 0.6) (layer B.Cu) (net 18))
  (segment (start 146.177 91.059) (end 146.304 91.186) (width 0.6) (layer B.Cu) (net 18) (tstamp 5AF19344))
  (segment (start 134.366 84.582) (end 135.128 84.582) (width 0.6) (layer B.Cu) (net 18))
  (segment (start 135.128 84.582) (end 141.605 91.059) (width 0.6) (layer B.Cu) (net 18) (tstamp 5AF1932C))
  (segment (start 143.256 107.315) (end 153.162 97.409) (width 0.6) (layer F.Cu) (net 19))
  (segment (start 153.035 97.282) (end 153.035 74.84) (width 0.6) (layer B.Cu) (net 19) (tstamp 5AF19B7C))
  (segment (start 153.162 97.409) (end 153.035 97.282) (width 0.6) (layer B.Cu) (net 19) (tstamp 5AF19B7B))
  (via (at 153.162 97.409) (size 2.1) (drill 1) (layers F.Cu B.Cu) (net 19))
  (segment (start 123.571 122.555) (end 123.571 117.856) (width 0.6) (layer B.Cu) (net 19))
  (segment (start 131.699 116.967) (end 136.652 121.92) (width 0.6) (layer B.Cu) (net 19) (tstamp 5AF19793) (status 20))
  (segment (start 124.46 116.967) (end 131.699 116.967) (width 0.6) (layer B.Cu) (net 19) (tstamp 5AF19790))
  (segment (start 123.571 117.856) (end 124.46 116.967) (width 0.6) (layer B.Cu) (net 19) (tstamp 5AF1978D))
  (segment (start 143.256 107.315) (end 143.256 107.061) (width 0.6) (layer F.Cu) (net 19))
  (segment (start 137.922 107.188) (end 143.129 107.188) (width 0.6) (layer B.Cu) (net 19))
  (segment (start 147.193 119.253) (end 147.193 121.92) (width 0.6) (layer B.Cu) (net 19) (tstamp 5AF19692))
  (segment (start 145.034 117.094) (end 147.193 119.253) (width 0.6) (layer B.Cu) (net 19) (tstamp 5AF19691))
  (via (at 145.034 117.094) (size 2.1) (drill 1) (layers F.Cu B.Cu) (net 19))
  (segment (start 145.034 109.093) (end 145.034 117.094) (width 0.6) (layer F.Cu) (net 19) (tstamp 5AF19687))
  (segment (start 143.256 107.315) (end 145.034 109.093) (width 0.6) (layer F.Cu) (net 19) (tstamp 5AF19686))
  (via (at 143.256 107.315) (size 2.1) (drill 1) (layers F.Cu B.Cu) (net 19))
  (segment (start 143.129 107.188) (end 143.256 107.315) (width 0.6) (layer B.Cu) (net 19) (tstamp 5AF19682))
  (segment (start 136.652 121.92) (end 147.193 121.92) (width 0.6) (layer B.Cu) (net 19) (status 10))
  (segment (start 147.193 121.92) (end 157.288 121.92) (width 0.6) (layer B.Cu) (net 19) (tstamp 5AF196A2))
  (segment (start 157.288 121.92) (end 157.96 121.248) (width 0.6) (layer B.Cu) (net 19) (tstamp 5AF19649))
  (segment (start 145.316 74.84) (end 153.035 74.84) (width 0.6) (layer B.Cu) (net 19))
  (segment (start 153.035 74.84) (end 154.305 74.84) (width 0.6) (layer B.Cu) (net 19) (tstamp 5AF19B86))
  (segment (start 154.305 74.84) (end 162.715 74.84) (width 0.6) (layer B.Cu) (net 19) (tstamp 5AF196F6))
  (segment (start 123.571 122.555) (end 123.571 123.698) (width 0.6) (layer B.Cu) (net 19))
  (segment (start 137.922 107.188) (end 135.255 107.188) (width 0.6) (layer B.Cu) (net 19))
  (segment (start 130.302 86.106) (end 134.366 82.042) (width 0.6) (layer B.Cu) (net 19) (tstamp 5AF1924B))
  (segment (start 130.302 102.235) (end 130.302 86.106) (width 0.6) (layer B.Cu) (net 19) (tstamp 5AF19248))
  (segment (start 135.255 107.188) (end 130.302 102.235) (width 0.6) (layer B.Cu) (net 19) (tstamp 5AF19241))
  (segment (start 141.605 101.219) (end 141.605 105.537) (width 0.6) (layer B.Cu) (net 19))
  (segment (start 139.954 107.188) (end 137.922 107.188) (width 0.6) (layer B.Cu) (net 19) (tstamp 5AF19234))
  (segment (start 141.605 105.537) (end 139.954 107.188) (width 0.6) (layer B.Cu) (net 19) (tstamp 5AF1922D))
  (segment (start 152.146 103.251) (end 149.987 106.68) (width 0.6) (layer B.Cu) (net 20) (status 10))
  (segment (start 146.558 106.68) (end 146.304 106.934) (width 0.6) (layer B.Cu) (net 20) (tstamp 5AF197F0))
  (segment (start 149.987 106.68) (end 146.558 106.68) (width 0.6) (layer B.Cu) (net 20) (tstamp 5AF197ED))
  (segment (start 121.031 122.555) (end 121.031 124.46) (width 0.6) (layer B.Cu) (net 20))
  (segment (start 121.031 124.46) (end 121.539 124.968) (width 0.6) (layer B.Cu) (net 20) (tstamp 5AF197B2))
  (segment (start 170.18 122.682) (end 170.18 118.8) (width 0.6) (layer B.Cu) (net 20) (tstamp 5AF197CD))
  (segment (start 167.894 124.968) (end 170.18 122.682) (width 0.6) (layer B.Cu) (net 20) (tstamp 5AF197CA))
  (segment (start 121.539 124.968) (end 167.894 124.968) (width 0.6) (layer B.Cu) (net 20) (tstamp 5AF197BA))
  (segment (start 137.922 114.808) (end 143.383 114.808) (width 0.6) (layer B.Cu) (net 20))
  (segment (start 146.304 111.887) (end 146.304 106.934) (width 0.6) (layer B.Cu) (net 20) (tstamp 5AF192B6))
  (segment (start 146.304 106.934) (end 146.304 101.346) (width 0.6) (layer B.Cu) (net 20) (tstamp 5AF197F7))
  (segment (start 143.383 114.808) (end 146.304 111.887) (width 0.6) (layer B.Cu) (net 20) (tstamp 5AF192AB))
  (segment (start 121.031 122.555) (end 121.031 116.078) (width 0.6) (layer B.Cu) (net 20))
  (segment (start 122.301 114.808) (end 137.922 114.808) (width 0.6) (layer B.Cu) (net 20) (tstamp 5AF19198))
  (segment (start 121.031 116.078) (end 122.301 114.808) (width 0.6) (layer B.Cu) (net 20) (tstamp 5AF1918C))
  (segment (start 134.366 76.962) (end 128.905 76.962) (width 0.6) (layer B.Cu) (net 20))
  (segment (start 120.396 125.095) (end 121.031 124.46) (width 0.6) (layer B.Cu) (net 20) (tstamp 5AF18F6D))
  (segment (start 116.586 125.095) (end 120.396 125.095) (width 0.6) (layer B.Cu) (net 20) (tstamp 5AF18F69))
  (segment (start 114.808 123.317) (end 116.586 125.095) (width 0.6) (layer B.Cu) (net 20) (tstamp 5AF18F67))
  (segment (start 114.808 74.041) (end 114.808 123.317) (width 0.6) (layer B.Cu) (net 20) (tstamp 5AF18F57))
  (segment (start 117.348 71.501) (end 114.808 74.041) (width 0.6) (layer B.Cu) (net 20) (tstamp 5AF18F55))
  (segment (start 123.444 71.501) (end 117.348 71.501) (width 0.6) (layer B.Cu) (net 20) (tstamp 5AF18F50))
  (segment (start 128.905 76.962) (end 123.444 71.501) (width 0.6) (layer B.Cu) (net 20) (tstamp 5AF18F3F))
  (segment (start 137.922 109.728) (end 135.509 109.728) (width 0.6) (layer B.Cu) (net 23))
  (segment (start 127.635 93.091) (end 119.126 84.582) (width 0.6) (layer B.Cu) (net 23) (tstamp 5AF19280))
  (segment (start 127.635 101.854) (end 127.635 93.091) (width 0.6) (layer B.Cu) (net 23) (tstamp 5AF19279))
  (segment (start 135.509 109.728) (end 127.635 101.854) (width 0.6) (layer B.Cu) (net 23) (tstamp 5AF19271))
  (segment (start 137.922 112.268) (end 136.398 112.268) (width 0.6) (layer B.Cu) (net 24))
  (segment (start 125.984 93.98) (end 119.126 87.122) (width 0.6) (layer B.Cu) (net 24) (tstamp 5AF19291))
  (segment (start 125.984 101.854) (end 125.984 93.98) (width 0.6) (layer B.Cu) (net 24) (tstamp 5AF1928C))
  (segment (start 136.398 112.268) (end 125.984 101.854) (width 0.6) (layer B.Cu) (net 24) (tstamp 5AF19284))

)
