(export (version D)
  (design
    (source /home/vaisakh/work/CircuitDesigns/FlipMousePressurePad/FlipMousePressurePad.sch)
    (date "Sat May 19 16:55:04 2018")
    (tool "Eeschema 4.0.5+dfsg1-4")
    (sheet (number 1) (name /) (tstamps /)
      (title_block
        (title)
        (company)
        (rev)
        (date)
        (source FlipMousePressurePad.sch)
        (comment (number 1) (value ""))
        (comment (number 2) (value ""))
        (comment (number 3) (value ""))
        (comment (number 4) (value "")))))
  (components
    (comp (ref P3)
      (value CONN_01X05)
      (footprint Pin_Headers:Pin_Header_Straight_1x05)
      (libsource (lib conn) (part CONN_01X05))
      (sheetpath (names /) (tstamps /))
      (tstamp 5AF96013))
    (comp (ref PA1)
      (value CONN_01X01)
      (footprint Measurement_Points:Test_Point_Keystone_5019_Minature)
      (libsource (lib conn) (part CONN_01X01))
      (sheetpath (names /) (tstamps /))
      (tstamp 5AF97085))
    (comp (ref PA2)
      (value CONN_01X01)
      (footprint Measurement_Points:Test_Point_Keystone_5019_Minature)
      (libsource (lib conn) (part CONN_01X01))
      (sheetpath (names /) (tstamps /))
      (tstamp 5AF970E2))
    (comp (ref PB1)
      (value CONN_01X01)
      (footprint Measurement_Points:Test_Point_Keystone_5019_Minature)
      (libsource (lib conn) (part CONN_01X01))
      (sheetpath (names /) (tstamps /))
      (tstamp 5AF97229))
    (comp (ref PB2)
      (value CONN_01X01)
      (footprint Measurement_Points:Test_Point_Keystone_5019_Minature)
      (libsource (lib conn) (part CONN_01X01))
      (sheetpath (names /) (tstamps /))
      (tstamp 5AF97261))
    (comp (ref PC1)
      (value CONN_01X01)
      (footprint Measurement_Points:Test_Point_Keystone_5019_Minature)
      (libsource (lib conn) (part CONN_01X01))
      (sheetpath (names /) (tstamps /))
      (tstamp 5AF97290))
    (comp (ref PC2)
      (value CONN_01X01)
      (footprint Measurement_Points:Test_Point_Keystone_5019_Minature)
      (libsource (lib conn) (part CONN_01X01))
      (sheetpath (names /) (tstamps /))
      (tstamp 5AF972C2))
    (comp (ref PD1)
      (value CONN_01X01)
      (footprint Measurement_Points:Test_Point_Keystone_5019_Minature)
      (libsource (lib conn) (part CONN_01X01))
      (sheetpath (names /) (tstamps /))
      (tstamp 5AF972F5))
    (comp (ref PD2)
      (value CONN_01X01)
      (footprint Measurement_Points:Test_Point_Keystone_5019_Minature)
      (libsource (lib conn) (part CONN_01X01))
      (sheetpath (names /) (tstamps /))
      (tstamp 5AF9735F)))
  (libparts
    (libpart (lib conn) (part CONN_01X01)
      (description "Connector, single row, 01x01")
      (footprints
        (fp Pin_Header_Straight_1X01)
        (fp Pin_Header_Angled_1X01)
        (fp Socket_Strip_Straight_1X01)
        (fp Socket_Strip_Angled_1X01))
      (fields
        (field (name Reference) P)
        (field (name Value) CONN_01X01))
      (pins
        (pin (num 1) (name P1) (type passive))))
    (libpart (lib conn) (part CONN_01X05)
      (description "Connector, single row, 01x05")
      (footprints
        (fp Pin_Header_Straight_1X05)
        (fp Pin_Header_Angled_1X05)
        (fp Socket_Strip_Straight_1X05)
        (fp Socket_Strip_Angled_1X05))
      (fields
        (field (name Reference) P)
        (field (name Value) CONN_01X05))
      (pins
        (pin (num 1) (name P1) (type passive))
        (pin (num 2) (name P2) (type passive))
        (pin (num 3) (name P3) (type passive))
        (pin (num 4) (name P4) (type passive))
        (pin (num 5) (name P5) (type passive)))))
  (libraries
    (library (logical conn)
      (uri /usr/share/kicad/library/conn.lib)))
  (nets
    (net (code 1) (name "Net-(P3-Pad4)")
      (node (ref P3) (pin 4))
      (node (ref PD1) (pin 1)))
    (net (code 2) (name "Net-(P3-Pad2)")
      (node (ref PB2) (pin 1))
      (node (ref P3) (pin 2)))
    (net (code 3) (name "Net-(P3-Pad3)")
      (node (ref PC2) (pin 1))
      (node (ref P3) (pin 3)))
    (net (code 4) (name "Net-(P3-Pad5)")
      (node (ref PA1) (pin 1))
      (node (ref PC1) (pin 1))
      (node (ref P3) (pin 5))
      (node (ref PD2) (pin 1))
      (node (ref PB1) (pin 1)))
    (net (code 5) (name "Net-(P3-Pad1)")
      (node (ref P3) (pin 1))
      (node (ref PA2) (pin 1)))))