G04 #@! TF.FileFunction,Soldermask,Top*
%FSLAX46Y46*%
G04 Gerber Fmt 4.6, Leading zero omitted, Abs format (unit mm)*
G04 Created by KiCad (PCBNEW 4.0.5+dfsg1-4) date Tue Oct 23 17:56:44 2018*
%MOMM*%
%LPD*%
G01*
G04 APERTURE LIST*
%ADD10C,0.100000*%
%ADD11R,2.032000X1.727200*%
%ADD12O,2.032000X1.727200*%
G04 APERTURE END LIST*
D10*
D11*
X164592000Y-99822000D03*
D12*
X164592000Y-102362000D03*
X164592000Y-104902000D03*
X164592000Y-107442000D03*
X164592000Y-109982000D03*
D10*
G36*
X149333390Y-95121604D02*
X150747604Y-93707390D01*
X153434610Y-96394396D01*
X152020396Y-97808610D01*
X149333390Y-95121604D01*
X149333390Y-95121604D01*
G37*
G36*
X151873390Y-92581604D02*
X153287604Y-91167390D01*
X155974610Y-93854396D01*
X154560396Y-95268610D01*
X151873390Y-92581604D01*
X151873390Y-92581604D01*
G37*
G36*
X136523604Y-101872610D02*
X135109390Y-100458396D01*
X137796396Y-97771390D01*
X139210610Y-99185604D01*
X136523604Y-101872610D01*
X136523604Y-101872610D01*
G37*
G36*
X139063604Y-104412610D02*
X137649390Y-102998396D01*
X140336396Y-100311390D01*
X141750610Y-101725604D01*
X139063604Y-104412610D01*
X139063604Y-104412610D01*
G37*
G36*
X159637604Y-112286610D02*
X158223390Y-110872396D01*
X160910396Y-108185390D01*
X162324610Y-109599604D01*
X159637604Y-112286610D01*
X159637604Y-112286610D01*
G37*
G36*
X157097604Y-109746610D02*
X155683390Y-108332396D01*
X158370396Y-105645390D01*
X159784610Y-107059604D01*
X157097604Y-109746610D01*
X157097604Y-109746610D01*
G37*
G36*
X143745390Y-113155604D02*
X145159604Y-111741390D01*
X147846610Y-114428396D01*
X146432396Y-115842610D01*
X143745390Y-113155604D01*
X143745390Y-113155604D01*
G37*
G36*
X141205390Y-115695604D02*
X142619604Y-114281390D01*
X145306610Y-116968396D01*
X143892396Y-118382610D01*
X141205390Y-115695604D01*
X141205390Y-115695604D01*
G37*
M02*
