M48
;DRILL file {KiCad 4.0.5+dfsg1-4} date Wed Jun 13 15:22:30 2018
;FORMAT={-:-/ absolute / metric / decimal}
FMAT,2
METRIC,TZ
T1C0.200
T2C1.016
%
G90
G05
M71
T1
X135.395Y-88.494
X136.5Y-94.653
X145.085Y-94.996
X148.082Y-88.519
X151.409Y-90.97
T2
X139.446Y-90.932
X141.986Y-90.932
X144.526Y-90.932
X147.066Y-90.932
X149.606Y-90.932
T0
M30
