G04 #@! TF.FileFunction,Copper,L1,Top,Signal*
%FSLAX46Y46*%
G04 Gerber Fmt 4.6, Leading zero omitted, Abs format (unit mm)*
G04 Created by KiCad (PCBNEW 4.0.5+dfsg1-4) date Tue Oct 23 17:58:09 2018*
%MOMM*%
%LPD*%
G01*
G04 APERTURE LIST*
%ADD10C,0.100000*%
%ADD11R,1.600000X1.600000*%
%ADD12C,1.600000*%
%ADD13C,2.000000*%
%ADD14R,2.000000X2.000000*%
%ADD15O,1.600000X1.600000*%
%ADD16C,2.100000*%
%ADD17C,1.750000*%
%ADD18C,1.998980*%
%ADD19R,2.300000X3.000000*%
%ADD20R,2.300000X2.000000*%
%ADD21R,2.032000X1.727200*%
%ADD22O,2.032000X1.727200*%
%ADD23C,0.450000*%
%ADD24C,0.250000*%
%ADD25C,0.400000*%
%ADD26C,0.254000*%
G04 APERTURE END LIST*
D10*
D11*
X88900000Y-72390000D03*
D12*
X88900000Y-69850000D03*
X88900000Y-67310000D03*
X88900000Y-64770000D03*
X88900000Y-62230000D03*
X88900000Y-59690000D03*
X88900000Y-57150000D03*
X88900000Y-54610000D03*
X88900000Y-52070000D03*
X88900000Y-49530000D03*
X88900000Y-46990000D03*
X88900000Y-44450000D03*
X73660000Y-44450000D03*
X73660000Y-46990000D03*
X73660000Y-49530000D03*
X73660000Y-52070000D03*
X73660000Y-54610000D03*
X73660000Y-57150000D03*
X73660000Y-59690000D03*
X73660000Y-62230000D03*
X73660000Y-64770000D03*
X73660000Y-67310000D03*
X73660000Y-69850000D03*
X73660000Y-72390000D03*
D13*
X101600000Y-70601840D03*
X101600000Y-63002160D03*
D14*
X82550000Y-73660000D03*
D13*
X80010000Y-73660000D03*
D11*
X107950000Y-62230000D03*
D15*
X107950000Y-59690000D03*
X107950000Y-57150000D03*
X107950000Y-54610000D03*
X107950000Y-52070000D03*
D11*
X91694000Y-55372000D03*
D15*
X94234000Y-55372000D03*
X96774000Y-55372000D03*
X99314000Y-55372000D03*
X101854000Y-55372000D03*
D16*
X70440000Y-45670000D03*
D17*
X71700000Y-43180000D03*
X76200000Y-43180000D03*
D16*
X77450000Y-45670000D03*
X85680000Y-45670000D03*
D17*
X86940000Y-43180000D03*
X91440000Y-43180000D03*
D16*
X92690000Y-45670000D03*
D18*
X76200000Y-69850000D03*
X86360000Y-69850000D03*
X69850000Y-59690000D03*
X69850000Y-49530000D03*
D19*
X98298000Y-73152000D03*
X92202000Y-73152000D03*
D20*
X98190000Y-64770000D03*
X92240000Y-64770000D03*
D19*
X110998000Y-73152000D03*
X104902000Y-73152000D03*
D20*
X110890000Y-64770000D03*
X104940000Y-64770000D03*
D19*
X96012000Y-43688000D03*
X102108000Y-43688000D03*
D20*
X96120000Y-52070000D03*
X102070000Y-52070000D03*
D21*
X113792000Y-53340000D03*
D22*
X113792000Y-55880000D03*
X113792000Y-58420000D03*
X113792000Y-60960000D03*
X113792000Y-63500000D03*
D23*
X86360000Y-62992000D03*
X95758000Y-63754000D03*
X93218000Y-66802000D03*
X103632000Y-66802000D03*
X107696000Y-48260000D03*
X105664000Y-41148000D03*
X81280000Y-67818000D03*
X100076000Y-52070000D03*
X108458000Y-64008000D03*
X75692000Y-64008000D03*
X95504000Y-67818000D03*
X115570000Y-64516000D03*
X110998000Y-51308000D03*
X111506000Y-50546000D03*
X113030000Y-65532000D03*
X75438000Y-47498000D03*
D24*
X86360000Y-62992000D02*
X88138000Y-64770000D01*
X88138000Y-64770000D02*
X88900000Y-64770000D01*
X73660000Y-69850000D02*
X72136000Y-69850000D01*
X78232000Y-73660000D02*
X80010000Y-73660000D01*
X77724000Y-74168000D02*
X78232000Y-73660000D01*
X72390000Y-74168000D02*
X77724000Y-74168000D01*
X71628000Y-73406000D02*
X72390000Y-74168000D01*
X71628000Y-70358000D02*
X71628000Y-73406000D01*
X72136000Y-69850000D02*
X71628000Y-70358000D01*
X82550000Y-73660000D02*
X84074000Y-73660000D01*
X86360000Y-71374000D02*
X86360000Y-69850000D01*
X84074000Y-73660000D02*
X86360000Y-71374000D01*
X96774000Y-64770000D02*
X98190000Y-64770000D01*
X95758000Y-63754000D02*
X96774000Y-64770000D01*
X98190000Y-64770000D02*
X98190000Y-66148000D01*
X96266000Y-71120000D02*
X98298000Y-73152000D01*
X96266000Y-68072000D02*
X96266000Y-71120000D01*
X98190000Y-66148000D02*
X96266000Y-68072000D01*
X92202000Y-73152000D02*
X98298000Y-73152000D01*
D25*
X92240000Y-64770000D02*
X92240000Y-66332000D01*
X92240000Y-66332000D02*
X92710000Y-66802000D01*
X92710000Y-66802000D02*
X93218000Y-66802000D01*
X104940000Y-66002000D02*
X104940000Y-65748000D01*
X104140000Y-66802000D02*
X104940000Y-66002000D01*
X103632000Y-66802000D02*
X104140000Y-66802000D01*
X104940000Y-65748000D02*
X104940000Y-64770000D01*
X104940000Y-65748000D02*
X104940000Y-64770000D01*
X105918000Y-48260000D02*
X107696000Y-48260000D01*
X105664000Y-41148000D02*
X105918000Y-41402000D01*
X105918000Y-41402000D02*
X105918000Y-48260000D01*
X102070000Y-52070000D02*
X102070000Y-50076000D01*
X103886000Y-48260000D02*
X105918000Y-48260000D01*
X102070000Y-50076000D02*
X103886000Y-48260000D01*
X78740000Y-69850000D02*
X83820000Y-69850000D01*
X90970000Y-66040000D02*
X92240000Y-64770000D01*
X87630000Y-66040000D02*
X90970000Y-66040000D01*
X83820000Y-69850000D02*
X87630000Y-66040000D01*
D24*
X104940000Y-64770000D02*
X105410000Y-64770000D01*
D25*
X105410000Y-64770000D02*
X107950000Y-62230000D01*
X76200000Y-69850000D02*
X78740000Y-69850000D01*
D24*
X78740000Y-69850000D02*
X79248000Y-69850000D01*
D25*
X79248000Y-69850000D02*
X81280000Y-67818000D01*
X73660000Y-64770000D02*
X75438000Y-64770000D01*
X76200000Y-65532000D02*
X76200000Y-69850000D01*
X75438000Y-64770000D02*
X76200000Y-65532000D01*
D24*
X96120000Y-52070000D02*
X100076000Y-52070000D01*
X94488000Y-47752000D02*
X94488000Y-50438000D01*
X94488000Y-50438000D02*
X96120000Y-52070000D01*
X88900000Y-46990000D02*
X90424000Y-46990000D01*
X96012000Y-46228000D02*
X96012000Y-43688000D01*
X94488000Y-47752000D02*
X96012000Y-46228000D01*
X91186000Y-47752000D02*
X94488000Y-47752000D01*
X90424000Y-46990000D02*
X91186000Y-47752000D01*
X89408000Y-47498000D02*
X88900000Y-46990000D01*
X102108000Y-43688000D02*
X96012000Y-43688000D01*
X109220000Y-64770000D02*
X110890000Y-64770000D01*
X108458000Y-64008000D02*
X109220000Y-64770000D01*
X110890000Y-64770000D02*
X110890000Y-66148000D01*
X110890000Y-66148000D02*
X108712000Y-68326000D01*
X108712000Y-68326000D02*
X108712000Y-70866000D01*
X108712000Y-70866000D02*
X110998000Y-73152000D01*
X104902000Y-73152000D02*
X110998000Y-73152000D01*
X73660000Y-44450000D02*
X73660000Y-44958000D01*
X73660000Y-44958000D02*
X71628000Y-46990000D01*
X71628000Y-46990000D02*
X71628000Y-57912000D01*
X71628000Y-57912000D02*
X69850000Y-59690000D01*
X75692000Y-64008000D02*
X75184000Y-63500000D01*
X75184000Y-63500000D02*
X70358000Y-63500000D01*
X70358000Y-63500000D02*
X69850000Y-62992000D01*
X69850000Y-62992000D02*
X69850000Y-59690000D01*
X73660000Y-54610000D02*
X86106000Y-54610000D01*
X105918000Y-52070000D02*
X107950000Y-52070000D01*
X104140000Y-53848000D02*
X105918000Y-52070000D01*
X93726000Y-53848000D02*
X104140000Y-53848000D01*
X93218000Y-53340000D02*
X93726000Y-53848000D01*
X87376000Y-53340000D02*
X93218000Y-53340000D01*
X86106000Y-54610000D02*
X87376000Y-53340000D01*
X107950000Y-52070000D02*
X110998000Y-52070000D01*
X112268000Y-53340000D02*
X113792000Y-53340000D01*
X110998000Y-52070000D02*
X112268000Y-53340000D01*
X73660000Y-57150000D02*
X85090000Y-57150000D01*
X104902000Y-57658000D02*
X107950000Y-54610000D01*
X91440000Y-57658000D02*
X104902000Y-57658000D01*
X89662000Y-55880000D02*
X91440000Y-57658000D01*
X86360000Y-55880000D02*
X89662000Y-55880000D01*
X85090000Y-57150000D02*
X86360000Y-55880000D01*
X107950000Y-54610000D02*
X110490000Y-54610000D01*
X111760000Y-55880000D02*
X113792000Y-55880000D01*
X110490000Y-54610000D02*
X111760000Y-55880000D01*
X73660000Y-59690000D02*
X85344000Y-59690000D01*
X106680000Y-58420000D02*
X107950000Y-57150000D01*
X86614000Y-58420000D02*
X106680000Y-58420000D01*
X85344000Y-59690000D02*
X86614000Y-58420000D01*
X107950000Y-57150000D02*
X110490000Y-57150000D01*
X111760000Y-58420000D02*
X113792000Y-58420000D01*
X110490000Y-57150000D02*
X111760000Y-58420000D01*
X73660000Y-62230000D02*
X85344000Y-62230000D01*
X99314000Y-59690000D02*
X107950000Y-59690000D01*
X98044000Y-60960000D02*
X99314000Y-59690000D01*
X86614000Y-60960000D02*
X98044000Y-60960000D01*
X85344000Y-62230000D02*
X86614000Y-60960000D01*
X107950000Y-59690000D02*
X109982000Y-59690000D01*
X111252000Y-60960000D02*
X113792000Y-60960000D01*
X109982000Y-59690000D02*
X111252000Y-60960000D01*
X94742000Y-67818000D02*
X95504000Y-67818000D01*
X94234000Y-67310000D02*
X94742000Y-67818000D01*
X94234000Y-67056000D02*
X94234000Y-67310000D01*
X115570000Y-64516000D02*
X115570000Y-51816000D01*
X115570000Y-51816000D02*
X115062000Y-51308000D01*
X115062000Y-51308000D02*
X110998000Y-51308000D01*
X93218000Y-62230000D02*
X88900000Y-62230000D01*
X94234000Y-66802000D02*
X94234000Y-67056000D01*
X94234000Y-63246000D02*
X94234000Y-66802000D01*
X93218000Y-62230000D02*
X94234000Y-63246000D01*
X113792000Y-65532000D02*
X115570000Y-65532000D01*
X115570000Y-65532000D02*
X116332000Y-64770000D01*
X116332000Y-64770000D02*
X116332000Y-51816000D01*
X116332000Y-51816000D02*
X115062000Y-50546000D01*
X115062000Y-50546000D02*
X111506000Y-50546000D01*
X113030000Y-65532000D02*
X113792000Y-65532000D01*
X86940000Y-43180000D02*
X84582000Y-43180000D01*
X85598000Y-49530000D02*
X88900000Y-49530000D01*
X83312000Y-47244000D02*
X85598000Y-49530000D01*
X83312000Y-44450000D02*
X83312000Y-47244000D01*
X84582000Y-43180000D02*
X83312000Y-44450000D01*
X76200000Y-43180000D02*
X76200000Y-43942000D01*
X76200000Y-43942000D02*
X75438000Y-44704000D01*
X75438000Y-44704000D02*
X75438000Y-47498000D01*
D26*
G36*
X106935302Y-60732811D02*
X107040572Y-60803150D01*
X106914683Y-60826838D01*
X106698559Y-60965910D01*
X106553569Y-61178110D01*
X106502560Y-61430000D01*
X106502560Y-62496572D01*
X105876572Y-63122560D01*
X103790000Y-63122560D01*
X103554683Y-63166838D01*
X103338559Y-63305910D01*
X103193569Y-63518110D01*
X103142560Y-63770000D01*
X103142560Y-65770000D01*
X103186838Y-66005317D01*
X103212305Y-66044894D01*
X103145486Y-66072503D01*
X102903353Y-66314213D01*
X102772150Y-66630185D01*
X102771851Y-66972314D01*
X102902503Y-67288514D01*
X103144213Y-67530647D01*
X103460185Y-67661850D01*
X103802314Y-67662149D01*
X103863179Y-67637000D01*
X104140000Y-67637000D01*
X104459541Y-67573439D01*
X104730434Y-67392434D01*
X105530434Y-66592434D01*
X105554782Y-66555995D01*
X105647361Y-66417440D01*
X106090000Y-66417440D01*
X106325317Y-66373162D01*
X106541441Y-66234090D01*
X106686431Y-66021890D01*
X106737440Y-65770000D01*
X106737440Y-64623428D01*
X107650318Y-63710550D01*
X107598150Y-63836185D01*
X107597851Y-64178314D01*
X107728503Y-64494514D01*
X107970213Y-64736647D01*
X108212417Y-64837219D01*
X108682599Y-65307401D01*
X108929161Y-65472148D01*
X109092560Y-65504650D01*
X109092560Y-65770000D01*
X109136838Y-66005317D01*
X109275910Y-66221441D01*
X109488110Y-66366431D01*
X109578469Y-66384729D01*
X108174599Y-67788599D01*
X108009852Y-68035161D01*
X107952000Y-68326000D01*
X107952000Y-70866000D01*
X108009852Y-71156839D01*
X108174599Y-71403401D01*
X109163198Y-72392000D01*
X106699440Y-72392000D01*
X106699440Y-71652000D01*
X106655162Y-71416683D01*
X106516090Y-71200559D01*
X106303890Y-71055569D01*
X106052000Y-71004560D01*
X103752000Y-71004560D01*
X103516683Y-71048838D01*
X103300559Y-71187910D01*
X103155569Y-71400110D01*
X103104560Y-71652000D01*
X103104560Y-74652000D01*
X103148838Y-74887317D01*
X103287910Y-75103441D01*
X103500110Y-75248431D01*
X103752000Y-75299440D01*
X106052000Y-75299440D01*
X106287317Y-75255162D01*
X106503441Y-75116090D01*
X106648431Y-74903890D01*
X106699440Y-74652000D01*
X106699440Y-73912000D01*
X109200560Y-73912000D01*
X109200560Y-74652000D01*
X109244838Y-74887317D01*
X109383910Y-75103441D01*
X109596110Y-75248431D01*
X109848000Y-75299440D01*
X112148000Y-75299440D01*
X112383317Y-75255162D01*
X112599441Y-75116090D01*
X112744431Y-74903890D01*
X112795440Y-74652000D01*
X112795440Y-71652000D01*
X112751162Y-71416683D01*
X112612090Y-71200559D01*
X112399890Y-71055569D01*
X112148000Y-71004560D01*
X109925362Y-71004560D01*
X109472000Y-70551198D01*
X109472000Y-69492213D01*
X109792055Y-69812827D01*
X110218249Y-69989798D01*
X110679726Y-69990201D01*
X111106229Y-69813974D01*
X111432827Y-69487945D01*
X111609798Y-69061751D01*
X111610201Y-68600274D01*
X111433974Y-68173771D01*
X111107945Y-67847173D01*
X110681751Y-67670202D01*
X110442809Y-67669993D01*
X111427401Y-66685401D01*
X111592148Y-66438839D01*
X111596405Y-66417440D01*
X112040000Y-66417440D01*
X112275317Y-66373162D01*
X112491441Y-66234090D01*
X112501299Y-66219662D01*
X112542213Y-66260647D01*
X112858185Y-66391850D01*
X113200314Y-66392149D01*
X113442692Y-66292000D01*
X115570000Y-66292000D01*
X115860839Y-66234148D01*
X116107401Y-66069401D01*
X116130000Y-66046802D01*
X116130000Y-75490000D01*
X69290000Y-75490000D01*
X69290000Y-72674187D01*
X72224752Y-72674187D01*
X72442757Y-73201800D01*
X72846077Y-73605824D01*
X73373309Y-73824750D01*
X73944187Y-73825248D01*
X74471800Y-73607243D01*
X74683951Y-73395461D01*
X78364092Y-73395461D01*
X78388144Y-74045460D01*
X78590613Y-74534264D01*
X78857468Y-74632927D01*
X79830395Y-73660000D01*
X78857468Y-72687073D01*
X78590613Y-72785736D01*
X78364092Y-73395461D01*
X74683951Y-73395461D01*
X74875824Y-73203923D01*
X75094750Y-72676691D01*
X75095248Y-72105813D01*
X74877243Y-71578200D01*
X74473923Y-71174176D01*
X74359232Y-71126552D01*
X74414005Y-71103864D01*
X74488139Y-70857745D01*
X73660000Y-70029605D01*
X72831861Y-70857745D01*
X72905995Y-71103864D01*
X72964254Y-71124805D01*
X72848200Y-71172757D01*
X72444176Y-71576077D01*
X72225250Y-72103309D01*
X72224752Y-72674187D01*
X69290000Y-72674187D01*
X69290000Y-69633223D01*
X72213035Y-69633223D01*
X72240222Y-70203454D01*
X72406136Y-70604005D01*
X72652255Y-70678139D01*
X73480395Y-69850000D01*
X72652255Y-69021861D01*
X72406136Y-69095995D01*
X72213035Y-69633223D01*
X69290000Y-69633223D01*
X69290000Y-63495579D01*
X69312599Y-63529401D01*
X69820599Y-64037401D01*
X70067161Y-64202148D01*
X70358000Y-64260000D01*
X72317976Y-64260000D01*
X72225250Y-64483309D01*
X72224752Y-65054187D01*
X72442757Y-65581800D01*
X72846077Y-65985824D01*
X72976215Y-66039862D01*
X72848200Y-66092757D01*
X72444176Y-66496077D01*
X72225250Y-67023309D01*
X72224752Y-67594187D01*
X72442757Y-68121800D01*
X72846077Y-68525824D01*
X72960768Y-68573448D01*
X72905995Y-68596136D01*
X72831861Y-68842255D01*
X73660000Y-69670395D01*
X74488139Y-68842255D01*
X74414005Y-68596136D01*
X74355746Y-68575195D01*
X74471800Y-68527243D01*
X74875824Y-68123923D01*
X75094750Y-67596691D01*
X75095248Y-67025813D01*
X74877243Y-66498200D01*
X74473923Y-66094176D01*
X74343785Y-66040138D01*
X74471800Y-65987243D01*
X74854710Y-65605000D01*
X75092132Y-65605000D01*
X75365000Y-65877868D01*
X75365000Y-68426493D01*
X75275345Y-68463538D01*
X74815154Y-68922927D01*
X74762253Y-69050328D01*
X74667745Y-69021861D01*
X73839605Y-69850000D01*
X74667745Y-70678139D01*
X74761936Y-70649768D01*
X74813538Y-70774655D01*
X75272927Y-71234846D01*
X75873453Y-71484206D01*
X76523694Y-71484774D01*
X77124655Y-71236462D01*
X77584846Y-70777073D01*
X77623078Y-70685000D01*
X83820000Y-70685000D01*
X84139541Y-70621439D01*
X84410434Y-70440434D01*
X84725268Y-70125600D01*
X84725226Y-70173694D01*
X84973538Y-70774655D01*
X85428643Y-71230555D01*
X84166045Y-72493153D01*
X84153162Y-72424683D01*
X84014090Y-72208559D01*
X83801890Y-72063569D01*
X83550000Y-72012560D01*
X81550000Y-72012560D01*
X81314683Y-72056838D01*
X81098559Y-72195910D01*
X80953569Y-72408110D01*
X80950958Y-72421002D01*
X80884264Y-72240613D01*
X80274539Y-72014092D01*
X79624540Y-72038144D01*
X79135736Y-72240613D01*
X79037073Y-72507468D01*
X80010000Y-73480395D01*
X80024143Y-73466253D01*
X80203748Y-73645858D01*
X80189605Y-73660000D01*
X80203748Y-73674143D01*
X80024143Y-73853748D01*
X80010000Y-73839605D01*
X79037073Y-74812532D01*
X79135736Y-75079387D01*
X79745461Y-75305908D01*
X80395460Y-75281856D01*
X80884264Y-75079387D01*
X80950319Y-74900727D01*
X81085910Y-75111441D01*
X81298110Y-75256431D01*
X81550000Y-75307440D01*
X83550000Y-75307440D01*
X83785317Y-75263162D01*
X84001441Y-75124090D01*
X84146431Y-74911890D01*
X84197440Y-74660000D01*
X84197440Y-74395446D01*
X84364839Y-74362148D01*
X84611401Y-74197401D01*
X86897401Y-71911401D01*
X87062148Y-71664840D01*
X87120000Y-71374000D01*
X87120000Y-71304496D01*
X87284655Y-71236462D01*
X87744846Y-70777073D01*
X87760411Y-70739589D01*
X87984688Y-70964258D01*
X87864683Y-70986838D01*
X87648559Y-71125910D01*
X87503569Y-71338110D01*
X87452560Y-71590000D01*
X87452560Y-73190000D01*
X87496838Y-73425317D01*
X87635910Y-73641441D01*
X87848110Y-73786431D01*
X88100000Y-73837440D01*
X89700000Y-73837440D01*
X89935317Y-73793162D01*
X90151441Y-73654090D01*
X90296431Y-73441890D01*
X90347440Y-73190000D01*
X90347440Y-71590000D01*
X90303162Y-71354683D01*
X90164090Y-71138559D01*
X89951890Y-70993569D01*
X89813646Y-70965574D01*
X90115824Y-70663923D01*
X90334750Y-70136691D01*
X90335248Y-69565813D01*
X90126138Y-69059726D01*
X91589799Y-69059726D01*
X91766026Y-69486229D01*
X92092055Y-69812827D01*
X92518249Y-69989798D01*
X92979726Y-69990201D01*
X93406229Y-69813974D01*
X93732827Y-69487945D01*
X93909798Y-69061751D01*
X93910201Y-68600274D01*
X93733974Y-68173771D01*
X93407945Y-67847173D01*
X92981751Y-67670202D01*
X92520274Y-67669799D01*
X92093771Y-67846026D01*
X91767173Y-68172055D01*
X91590202Y-68598249D01*
X91589799Y-69059726D01*
X90126138Y-69059726D01*
X90117243Y-69038200D01*
X89713923Y-68634176D01*
X89599232Y-68586552D01*
X89654005Y-68563864D01*
X89728139Y-68317745D01*
X88900000Y-67489605D01*
X88071861Y-68317745D01*
X88145995Y-68563864D01*
X88204254Y-68584805D01*
X88088200Y-68632757D01*
X87760666Y-68959721D01*
X87746462Y-68925345D01*
X87287073Y-68465154D01*
X86686547Y-68215794D01*
X86635119Y-68215749D01*
X87466897Y-67383971D01*
X87480222Y-67663454D01*
X87646136Y-68064005D01*
X87892255Y-68138139D01*
X88720395Y-67310000D01*
X88706252Y-67295858D01*
X88885858Y-67116253D01*
X88900000Y-67130395D01*
X88914143Y-67116253D01*
X89093748Y-67295858D01*
X89079605Y-67310000D01*
X89907745Y-68138139D01*
X90153864Y-68064005D01*
X90346965Y-67526777D01*
X90319778Y-66956546D01*
X90286000Y-66875000D01*
X90970000Y-66875000D01*
X91289541Y-66811439D01*
X91487168Y-66679389D01*
X91592481Y-66837000D01*
X91649566Y-66922434D01*
X92119566Y-67392434D01*
X92390459Y-67573439D01*
X92710000Y-67637000D01*
X92986340Y-67637000D01*
X93046185Y-67661850D01*
X93388314Y-67662149D01*
X93532900Y-67602407D01*
X93696599Y-67847401D01*
X94204599Y-68355401D01*
X94451161Y-68520148D01*
X94742000Y-68578000D01*
X95091719Y-68578000D01*
X95332185Y-68677850D01*
X95506000Y-68678002D01*
X95506000Y-71120000D01*
X95563852Y-71410839D01*
X95728599Y-71657401D01*
X96463198Y-72392000D01*
X93999440Y-72392000D01*
X93999440Y-71652000D01*
X93955162Y-71416683D01*
X93816090Y-71200559D01*
X93603890Y-71055569D01*
X93352000Y-71004560D01*
X91052000Y-71004560D01*
X90816683Y-71048838D01*
X90600559Y-71187910D01*
X90455569Y-71400110D01*
X90404560Y-71652000D01*
X90404560Y-74652000D01*
X90448838Y-74887317D01*
X90587910Y-75103441D01*
X90800110Y-75248431D01*
X91052000Y-75299440D01*
X93352000Y-75299440D01*
X93587317Y-75255162D01*
X93803441Y-75116090D01*
X93948431Y-74903890D01*
X93999440Y-74652000D01*
X93999440Y-73912000D01*
X96500560Y-73912000D01*
X96500560Y-74652000D01*
X96544838Y-74887317D01*
X96683910Y-75103441D01*
X96896110Y-75248431D01*
X97148000Y-75299440D01*
X99448000Y-75299440D01*
X99683317Y-75255162D01*
X99899441Y-75116090D01*
X100044431Y-74903890D01*
X100095440Y-74652000D01*
X100095440Y-71652000D01*
X100051162Y-71416683D01*
X99912090Y-71200559D01*
X99699890Y-71055569D01*
X99448000Y-71004560D01*
X97225362Y-71004560D01*
X97146437Y-70925635D01*
X99964716Y-70925635D01*
X100213106Y-71526783D01*
X100672637Y-71987118D01*
X101273352Y-72236556D01*
X101923795Y-72237124D01*
X102524943Y-71988734D01*
X102985278Y-71529203D01*
X103234716Y-70928488D01*
X103235284Y-70278045D01*
X102986894Y-69676897D01*
X102527363Y-69216562D01*
X102149659Y-69059726D01*
X104289799Y-69059726D01*
X104466026Y-69486229D01*
X104792055Y-69812827D01*
X105218249Y-69989798D01*
X105679726Y-69990201D01*
X106106229Y-69813974D01*
X106432827Y-69487945D01*
X106609798Y-69061751D01*
X106610201Y-68600274D01*
X106433974Y-68173771D01*
X106107945Y-67847173D01*
X105681751Y-67670202D01*
X105220274Y-67669799D01*
X104793771Y-67846026D01*
X104467173Y-68172055D01*
X104290202Y-68598249D01*
X104289799Y-69059726D01*
X102149659Y-69059726D01*
X101926648Y-68967124D01*
X101276205Y-68966556D01*
X100675057Y-69214946D01*
X100214722Y-69674477D01*
X99965284Y-70275192D01*
X99964716Y-70925635D01*
X97146437Y-70925635D01*
X97026000Y-70805198D01*
X97026000Y-69746657D01*
X97092055Y-69812827D01*
X97518249Y-69989798D01*
X97979726Y-69990201D01*
X98406229Y-69813974D01*
X98732827Y-69487945D01*
X98909798Y-69061751D01*
X98910201Y-68600274D01*
X98733974Y-68173771D01*
X98407945Y-67847173D01*
X97981751Y-67670202D01*
X97742809Y-67669993D01*
X98727401Y-66685401D01*
X98892148Y-66438839D01*
X98896405Y-66417440D01*
X99340000Y-66417440D01*
X99575317Y-66373162D01*
X99791441Y-66234090D01*
X99936431Y-66021890D01*
X99987440Y-65770000D01*
X99987440Y-64154692D01*
X100627073Y-64154692D01*
X100725736Y-64421547D01*
X101335461Y-64648068D01*
X101985460Y-64624016D01*
X102474264Y-64421547D01*
X102572927Y-64154692D01*
X101600000Y-63181765D01*
X100627073Y-64154692D01*
X99987440Y-64154692D01*
X99987440Y-63770000D01*
X99943162Y-63534683D01*
X99804090Y-63318559D01*
X99591890Y-63173569D01*
X99340000Y-63122560D01*
X97040000Y-63122560D01*
X96804683Y-63166838D01*
X96588559Y-63305910D01*
X96535475Y-63383601D01*
X96487497Y-63267486D01*
X96245787Y-63025353D01*
X95929815Y-62894150D01*
X95587686Y-62893851D01*
X95271486Y-63024503D01*
X95029353Y-63266213D01*
X94994000Y-63351353D01*
X94994000Y-63246000D01*
X94936148Y-62955161D01*
X94790793Y-62737621D01*
X99954092Y-62737621D01*
X99978144Y-63387620D01*
X100180613Y-63876424D01*
X100447468Y-63975087D01*
X101420395Y-63002160D01*
X101779605Y-63002160D01*
X102752532Y-63975087D01*
X103019387Y-63876424D01*
X103245908Y-63266699D01*
X103221856Y-62616700D01*
X103019387Y-62127896D01*
X102752532Y-62029233D01*
X101779605Y-63002160D01*
X101420395Y-63002160D01*
X100447468Y-62029233D01*
X100180613Y-62127896D01*
X99954092Y-62737621D01*
X94790793Y-62737621D01*
X94771401Y-62708599D01*
X93912430Y-61849628D01*
X100627073Y-61849628D01*
X101600000Y-62822555D01*
X102572927Y-61849628D01*
X102474264Y-61582773D01*
X101864539Y-61356252D01*
X101214540Y-61380304D01*
X100725736Y-61582773D01*
X100627073Y-61849628D01*
X93912430Y-61849628D01*
X93782802Y-61720000D01*
X98044000Y-61720000D01*
X98334839Y-61662148D01*
X98581401Y-61497401D01*
X99628802Y-60450000D01*
X106746333Y-60450000D01*
X106935302Y-60732811D01*
X106935302Y-60732811D01*
G37*
X106935302Y-60732811D02*
X107040572Y-60803150D01*
X106914683Y-60826838D01*
X106698559Y-60965910D01*
X106553569Y-61178110D01*
X106502560Y-61430000D01*
X106502560Y-62496572D01*
X105876572Y-63122560D01*
X103790000Y-63122560D01*
X103554683Y-63166838D01*
X103338559Y-63305910D01*
X103193569Y-63518110D01*
X103142560Y-63770000D01*
X103142560Y-65770000D01*
X103186838Y-66005317D01*
X103212305Y-66044894D01*
X103145486Y-66072503D01*
X102903353Y-66314213D01*
X102772150Y-66630185D01*
X102771851Y-66972314D01*
X102902503Y-67288514D01*
X103144213Y-67530647D01*
X103460185Y-67661850D01*
X103802314Y-67662149D01*
X103863179Y-67637000D01*
X104140000Y-67637000D01*
X104459541Y-67573439D01*
X104730434Y-67392434D01*
X105530434Y-66592434D01*
X105554782Y-66555995D01*
X105647361Y-66417440D01*
X106090000Y-66417440D01*
X106325317Y-66373162D01*
X106541441Y-66234090D01*
X106686431Y-66021890D01*
X106737440Y-65770000D01*
X106737440Y-64623428D01*
X107650318Y-63710550D01*
X107598150Y-63836185D01*
X107597851Y-64178314D01*
X107728503Y-64494514D01*
X107970213Y-64736647D01*
X108212417Y-64837219D01*
X108682599Y-65307401D01*
X108929161Y-65472148D01*
X109092560Y-65504650D01*
X109092560Y-65770000D01*
X109136838Y-66005317D01*
X109275910Y-66221441D01*
X109488110Y-66366431D01*
X109578469Y-66384729D01*
X108174599Y-67788599D01*
X108009852Y-68035161D01*
X107952000Y-68326000D01*
X107952000Y-70866000D01*
X108009852Y-71156839D01*
X108174599Y-71403401D01*
X109163198Y-72392000D01*
X106699440Y-72392000D01*
X106699440Y-71652000D01*
X106655162Y-71416683D01*
X106516090Y-71200559D01*
X106303890Y-71055569D01*
X106052000Y-71004560D01*
X103752000Y-71004560D01*
X103516683Y-71048838D01*
X103300559Y-71187910D01*
X103155569Y-71400110D01*
X103104560Y-71652000D01*
X103104560Y-74652000D01*
X103148838Y-74887317D01*
X103287910Y-75103441D01*
X103500110Y-75248431D01*
X103752000Y-75299440D01*
X106052000Y-75299440D01*
X106287317Y-75255162D01*
X106503441Y-75116090D01*
X106648431Y-74903890D01*
X106699440Y-74652000D01*
X106699440Y-73912000D01*
X109200560Y-73912000D01*
X109200560Y-74652000D01*
X109244838Y-74887317D01*
X109383910Y-75103441D01*
X109596110Y-75248431D01*
X109848000Y-75299440D01*
X112148000Y-75299440D01*
X112383317Y-75255162D01*
X112599441Y-75116090D01*
X112744431Y-74903890D01*
X112795440Y-74652000D01*
X112795440Y-71652000D01*
X112751162Y-71416683D01*
X112612090Y-71200559D01*
X112399890Y-71055569D01*
X112148000Y-71004560D01*
X109925362Y-71004560D01*
X109472000Y-70551198D01*
X109472000Y-69492213D01*
X109792055Y-69812827D01*
X110218249Y-69989798D01*
X110679726Y-69990201D01*
X111106229Y-69813974D01*
X111432827Y-69487945D01*
X111609798Y-69061751D01*
X111610201Y-68600274D01*
X111433974Y-68173771D01*
X111107945Y-67847173D01*
X110681751Y-67670202D01*
X110442809Y-67669993D01*
X111427401Y-66685401D01*
X111592148Y-66438839D01*
X111596405Y-66417440D01*
X112040000Y-66417440D01*
X112275317Y-66373162D01*
X112491441Y-66234090D01*
X112501299Y-66219662D01*
X112542213Y-66260647D01*
X112858185Y-66391850D01*
X113200314Y-66392149D01*
X113442692Y-66292000D01*
X115570000Y-66292000D01*
X115860839Y-66234148D01*
X116107401Y-66069401D01*
X116130000Y-66046802D01*
X116130000Y-75490000D01*
X69290000Y-75490000D01*
X69290000Y-72674187D01*
X72224752Y-72674187D01*
X72442757Y-73201800D01*
X72846077Y-73605824D01*
X73373309Y-73824750D01*
X73944187Y-73825248D01*
X74471800Y-73607243D01*
X74683951Y-73395461D01*
X78364092Y-73395461D01*
X78388144Y-74045460D01*
X78590613Y-74534264D01*
X78857468Y-74632927D01*
X79830395Y-73660000D01*
X78857468Y-72687073D01*
X78590613Y-72785736D01*
X78364092Y-73395461D01*
X74683951Y-73395461D01*
X74875824Y-73203923D01*
X75094750Y-72676691D01*
X75095248Y-72105813D01*
X74877243Y-71578200D01*
X74473923Y-71174176D01*
X74359232Y-71126552D01*
X74414005Y-71103864D01*
X74488139Y-70857745D01*
X73660000Y-70029605D01*
X72831861Y-70857745D01*
X72905995Y-71103864D01*
X72964254Y-71124805D01*
X72848200Y-71172757D01*
X72444176Y-71576077D01*
X72225250Y-72103309D01*
X72224752Y-72674187D01*
X69290000Y-72674187D01*
X69290000Y-69633223D01*
X72213035Y-69633223D01*
X72240222Y-70203454D01*
X72406136Y-70604005D01*
X72652255Y-70678139D01*
X73480395Y-69850000D01*
X72652255Y-69021861D01*
X72406136Y-69095995D01*
X72213035Y-69633223D01*
X69290000Y-69633223D01*
X69290000Y-63495579D01*
X69312599Y-63529401D01*
X69820599Y-64037401D01*
X70067161Y-64202148D01*
X70358000Y-64260000D01*
X72317976Y-64260000D01*
X72225250Y-64483309D01*
X72224752Y-65054187D01*
X72442757Y-65581800D01*
X72846077Y-65985824D01*
X72976215Y-66039862D01*
X72848200Y-66092757D01*
X72444176Y-66496077D01*
X72225250Y-67023309D01*
X72224752Y-67594187D01*
X72442757Y-68121800D01*
X72846077Y-68525824D01*
X72960768Y-68573448D01*
X72905995Y-68596136D01*
X72831861Y-68842255D01*
X73660000Y-69670395D01*
X74488139Y-68842255D01*
X74414005Y-68596136D01*
X74355746Y-68575195D01*
X74471800Y-68527243D01*
X74875824Y-68123923D01*
X75094750Y-67596691D01*
X75095248Y-67025813D01*
X74877243Y-66498200D01*
X74473923Y-66094176D01*
X74343785Y-66040138D01*
X74471800Y-65987243D01*
X74854710Y-65605000D01*
X75092132Y-65605000D01*
X75365000Y-65877868D01*
X75365000Y-68426493D01*
X75275345Y-68463538D01*
X74815154Y-68922927D01*
X74762253Y-69050328D01*
X74667745Y-69021861D01*
X73839605Y-69850000D01*
X74667745Y-70678139D01*
X74761936Y-70649768D01*
X74813538Y-70774655D01*
X75272927Y-71234846D01*
X75873453Y-71484206D01*
X76523694Y-71484774D01*
X77124655Y-71236462D01*
X77584846Y-70777073D01*
X77623078Y-70685000D01*
X83820000Y-70685000D01*
X84139541Y-70621439D01*
X84410434Y-70440434D01*
X84725268Y-70125600D01*
X84725226Y-70173694D01*
X84973538Y-70774655D01*
X85428643Y-71230555D01*
X84166045Y-72493153D01*
X84153162Y-72424683D01*
X84014090Y-72208559D01*
X83801890Y-72063569D01*
X83550000Y-72012560D01*
X81550000Y-72012560D01*
X81314683Y-72056838D01*
X81098559Y-72195910D01*
X80953569Y-72408110D01*
X80950958Y-72421002D01*
X80884264Y-72240613D01*
X80274539Y-72014092D01*
X79624540Y-72038144D01*
X79135736Y-72240613D01*
X79037073Y-72507468D01*
X80010000Y-73480395D01*
X80024143Y-73466253D01*
X80203748Y-73645858D01*
X80189605Y-73660000D01*
X80203748Y-73674143D01*
X80024143Y-73853748D01*
X80010000Y-73839605D01*
X79037073Y-74812532D01*
X79135736Y-75079387D01*
X79745461Y-75305908D01*
X80395460Y-75281856D01*
X80884264Y-75079387D01*
X80950319Y-74900727D01*
X81085910Y-75111441D01*
X81298110Y-75256431D01*
X81550000Y-75307440D01*
X83550000Y-75307440D01*
X83785317Y-75263162D01*
X84001441Y-75124090D01*
X84146431Y-74911890D01*
X84197440Y-74660000D01*
X84197440Y-74395446D01*
X84364839Y-74362148D01*
X84611401Y-74197401D01*
X86897401Y-71911401D01*
X87062148Y-71664840D01*
X87120000Y-71374000D01*
X87120000Y-71304496D01*
X87284655Y-71236462D01*
X87744846Y-70777073D01*
X87760411Y-70739589D01*
X87984688Y-70964258D01*
X87864683Y-70986838D01*
X87648559Y-71125910D01*
X87503569Y-71338110D01*
X87452560Y-71590000D01*
X87452560Y-73190000D01*
X87496838Y-73425317D01*
X87635910Y-73641441D01*
X87848110Y-73786431D01*
X88100000Y-73837440D01*
X89700000Y-73837440D01*
X89935317Y-73793162D01*
X90151441Y-73654090D01*
X90296431Y-73441890D01*
X90347440Y-73190000D01*
X90347440Y-71590000D01*
X90303162Y-71354683D01*
X90164090Y-71138559D01*
X89951890Y-70993569D01*
X89813646Y-70965574D01*
X90115824Y-70663923D01*
X90334750Y-70136691D01*
X90335248Y-69565813D01*
X90126138Y-69059726D01*
X91589799Y-69059726D01*
X91766026Y-69486229D01*
X92092055Y-69812827D01*
X92518249Y-69989798D01*
X92979726Y-69990201D01*
X93406229Y-69813974D01*
X93732827Y-69487945D01*
X93909798Y-69061751D01*
X93910201Y-68600274D01*
X93733974Y-68173771D01*
X93407945Y-67847173D01*
X92981751Y-67670202D01*
X92520274Y-67669799D01*
X92093771Y-67846026D01*
X91767173Y-68172055D01*
X91590202Y-68598249D01*
X91589799Y-69059726D01*
X90126138Y-69059726D01*
X90117243Y-69038200D01*
X89713923Y-68634176D01*
X89599232Y-68586552D01*
X89654005Y-68563864D01*
X89728139Y-68317745D01*
X88900000Y-67489605D01*
X88071861Y-68317745D01*
X88145995Y-68563864D01*
X88204254Y-68584805D01*
X88088200Y-68632757D01*
X87760666Y-68959721D01*
X87746462Y-68925345D01*
X87287073Y-68465154D01*
X86686547Y-68215794D01*
X86635119Y-68215749D01*
X87466897Y-67383971D01*
X87480222Y-67663454D01*
X87646136Y-68064005D01*
X87892255Y-68138139D01*
X88720395Y-67310000D01*
X88706252Y-67295858D01*
X88885858Y-67116253D01*
X88900000Y-67130395D01*
X88914143Y-67116253D01*
X89093748Y-67295858D01*
X89079605Y-67310000D01*
X89907745Y-68138139D01*
X90153864Y-68064005D01*
X90346965Y-67526777D01*
X90319778Y-66956546D01*
X90286000Y-66875000D01*
X90970000Y-66875000D01*
X91289541Y-66811439D01*
X91487168Y-66679389D01*
X91592481Y-66837000D01*
X91649566Y-66922434D01*
X92119566Y-67392434D01*
X92390459Y-67573439D01*
X92710000Y-67637000D01*
X92986340Y-67637000D01*
X93046185Y-67661850D01*
X93388314Y-67662149D01*
X93532900Y-67602407D01*
X93696599Y-67847401D01*
X94204599Y-68355401D01*
X94451161Y-68520148D01*
X94742000Y-68578000D01*
X95091719Y-68578000D01*
X95332185Y-68677850D01*
X95506000Y-68678002D01*
X95506000Y-71120000D01*
X95563852Y-71410839D01*
X95728599Y-71657401D01*
X96463198Y-72392000D01*
X93999440Y-72392000D01*
X93999440Y-71652000D01*
X93955162Y-71416683D01*
X93816090Y-71200559D01*
X93603890Y-71055569D01*
X93352000Y-71004560D01*
X91052000Y-71004560D01*
X90816683Y-71048838D01*
X90600559Y-71187910D01*
X90455569Y-71400110D01*
X90404560Y-71652000D01*
X90404560Y-74652000D01*
X90448838Y-74887317D01*
X90587910Y-75103441D01*
X90800110Y-75248431D01*
X91052000Y-75299440D01*
X93352000Y-75299440D01*
X93587317Y-75255162D01*
X93803441Y-75116090D01*
X93948431Y-74903890D01*
X93999440Y-74652000D01*
X93999440Y-73912000D01*
X96500560Y-73912000D01*
X96500560Y-74652000D01*
X96544838Y-74887317D01*
X96683910Y-75103441D01*
X96896110Y-75248431D01*
X97148000Y-75299440D01*
X99448000Y-75299440D01*
X99683317Y-75255162D01*
X99899441Y-75116090D01*
X100044431Y-74903890D01*
X100095440Y-74652000D01*
X100095440Y-71652000D01*
X100051162Y-71416683D01*
X99912090Y-71200559D01*
X99699890Y-71055569D01*
X99448000Y-71004560D01*
X97225362Y-71004560D01*
X97146437Y-70925635D01*
X99964716Y-70925635D01*
X100213106Y-71526783D01*
X100672637Y-71987118D01*
X101273352Y-72236556D01*
X101923795Y-72237124D01*
X102524943Y-71988734D01*
X102985278Y-71529203D01*
X103234716Y-70928488D01*
X103235284Y-70278045D01*
X102986894Y-69676897D01*
X102527363Y-69216562D01*
X102149659Y-69059726D01*
X104289799Y-69059726D01*
X104466026Y-69486229D01*
X104792055Y-69812827D01*
X105218249Y-69989798D01*
X105679726Y-69990201D01*
X106106229Y-69813974D01*
X106432827Y-69487945D01*
X106609798Y-69061751D01*
X106610201Y-68600274D01*
X106433974Y-68173771D01*
X106107945Y-67847173D01*
X105681751Y-67670202D01*
X105220274Y-67669799D01*
X104793771Y-67846026D01*
X104467173Y-68172055D01*
X104290202Y-68598249D01*
X104289799Y-69059726D01*
X102149659Y-69059726D01*
X101926648Y-68967124D01*
X101276205Y-68966556D01*
X100675057Y-69214946D01*
X100214722Y-69674477D01*
X99965284Y-70275192D01*
X99964716Y-70925635D01*
X97146437Y-70925635D01*
X97026000Y-70805198D01*
X97026000Y-69746657D01*
X97092055Y-69812827D01*
X97518249Y-69989798D01*
X97979726Y-69990201D01*
X98406229Y-69813974D01*
X98732827Y-69487945D01*
X98909798Y-69061751D01*
X98910201Y-68600274D01*
X98733974Y-68173771D01*
X98407945Y-67847173D01*
X97981751Y-67670202D01*
X97742809Y-67669993D01*
X98727401Y-66685401D01*
X98892148Y-66438839D01*
X98896405Y-66417440D01*
X99340000Y-66417440D01*
X99575317Y-66373162D01*
X99791441Y-66234090D01*
X99936431Y-66021890D01*
X99987440Y-65770000D01*
X99987440Y-64154692D01*
X100627073Y-64154692D01*
X100725736Y-64421547D01*
X101335461Y-64648068D01*
X101985460Y-64624016D01*
X102474264Y-64421547D01*
X102572927Y-64154692D01*
X101600000Y-63181765D01*
X100627073Y-64154692D01*
X99987440Y-64154692D01*
X99987440Y-63770000D01*
X99943162Y-63534683D01*
X99804090Y-63318559D01*
X99591890Y-63173569D01*
X99340000Y-63122560D01*
X97040000Y-63122560D01*
X96804683Y-63166838D01*
X96588559Y-63305910D01*
X96535475Y-63383601D01*
X96487497Y-63267486D01*
X96245787Y-63025353D01*
X95929815Y-62894150D01*
X95587686Y-62893851D01*
X95271486Y-63024503D01*
X95029353Y-63266213D01*
X94994000Y-63351353D01*
X94994000Y-63246000D01*
X94936148Y-62955161D01*
X94790793Y-62737621D01*
X99954092Y-62737621D01*
X99978144Y-63387620D01*
X100180613Y-63876424D01*
X100447468Y-63975087D01*
X101420395Y-63002160D01*
X101779605Y-63002160D01*
X102752532Y-63975087D01*
X103019387Y-63876424D01*
X103245908Y-63266699D01*
X103221856Y-62616700D01*
X103019387Y-62127896D01*
X102752532Y-62029233D01*
X101779605Y-63002160D01*
X101420395Y-63002160D01*
X100447468Y-62029233D01*
X100180613Y-62127896D01*
X99954092Y-62737621D01*
X94790793Y-62737621D01*
X94771401Y-62708599D01*
X93912430Y-61849628D01*
X100627073Y-61849628D01*
X101600000Y-62822555D01*
X102572927Y-61849628D01*
X102474264Y-61582773D01*
X101864539Y-61356252D01*
X101214540Y-61380304D01*
X100725736Y-61582773D01*
X100627073Y-61849628D01*
X93912430Y-61849628D01*
X93782802Y-61720000D01*
X98044000Y-61720000D01*
X98334839Y-61662148D01*
X98581401Y-61497401D01*
X99628802Y-60450000D01*
X106746333Y-60450000D01*
X106935302Y-60732811D01*
G36*
X87465250Y-61943309D02*
X87464752Y-62514187D01*
X87682757Y-63041800D01*
X88086077Y-63445824D01*
X88200768Y-63493448D01*
X88145995Y-63516136D01*
X88071861Y-63762255D01*
X88900000Y-64590395D01*
X89728139Y-63762255D01*
X89654005Y-63516136D01*
X89595746Y-63495195D01*
X89711800Y-63447243D01*
X90115824Y-63043923D01*
X90138215Y-62990000D01*
X92903198Y-62990000D01*
X93035758Y-63122560D01*
X91090000Y-63122560D01*
X90854683Y-63166838D01*
X90638559Y-63305910D01*
X90493569Y-63518110D01*
X90442560Y-63770000D01*
X90442560Y-65205000D01*
X90268527Y-65205000D01*
X90346965Y-64986777D01*
X90319778Y-64416546D01*
X90153864Y-64015995D01*
X89907745Y-63941861D01*
X89079605Y-64770000D01*
X89093748Y-64784142D01*
X88914143Y-64963748D01*
X88900000Y-64949605D01*
X88885858Y-64963748D01*
X88706252Y-64784142D01*
X88720395Y-64770000D01*
X87892255Y-63941861D01*
X87646136Y-64015995D01*
X87453035Y-64553223D01*
X87480222Y-65123454D01*
X87522829Y-65226317D01*
X87310460Y-65268560D01*
X87039566Y-65449566D01*
X83474132Y-69015000D01*
X81263868Y-69015000D01*
X81706625Y-68572243D01*
X81766514Y-68547497D01*
X82008647Y-68305787D01*
X82139850Y-67989815D01*
X82140149Y-67647686D01*
X82009497Y-67331486D01*
X81767787Y-67089353D01*
X81451815Y-66958150D01*
X81109686Y-66957851D01*
X80793486Y-67088503D01*
X80551353Y-67330213D01*
X80526098Y-67391034D01*
X78902132Y-69015000D01*
X77623507Y-69015000D01*
X77586462Y-68925345D01*
X77127073Y-68465154D01*
X77035000Y-68426922D01*
X77035000Y-65532000D01*
X77017864Y-65445852D01*
X76971440Y-65212460D01*
X76790434Y-64941566D01*
X76382618Y-64533750D01*
X76420647Y-64495787D01*
X76551850Y-64179815D01*
X76552149Y-63837686D01*
X76421497Y-63521486D01*
X76179787Y-63279353D01*
X75937583Y-63178781D01*
X75748802Y-62990000D01*
X85344000Y-62990000D01*
X85634839Y-62932148D01*
X85881401Y-62767401D01*
X86928802Y-61720000D01*
X87557976Y-61720000D01*
X87465250Y-61943309D01*
X87465250Y-61943309D01*
G37*
X87465250Y-61943309D02*
X87464752Y-62514187D01*
X87682757Y-63041800D01*
X88086077Y-63445824D01*
X88200768Y-63493448D01*
X88145995Y-63516136D01*
X88071861Y-63762255D01*
X88900000Y-64590395D01*
X89728139Y-63762255D01*
X89654005Y-63516136D01*
X89595746Y-63495195D01*
X89711800Y-63447243D01*
X90115824Y-63043923D01*
X90138215Y-62990000D01*
X92903198Y-62990000D01*
X93035758Y-63122560D01*
X91090000Y-63122560D01*
X90854683Y-63166838D01*
X90638559Y-63305910D01*
X90493569Y-63518110D01*
X90442560Y-63770000D01*
X90442560Y-65205000D01*
X90268527Y-65205000D01*
X90346965Y-64986777D01*
X90319778Y-64416546D01*
X90153864Y-64015995D01*
X89907745Y-63941861D01*
X89079605Y-64770000D01*
X89093748Y-64784142D01*
X88914143Y-64963748D01*
X88900000Y-64949605D01*
X88885858Y-64963748D01*
X88706252Y-64784142D01*
X88720395Y-64770000D01*
X87892255Y-63941861D01*
X87646136Y-64015995D01*
X87453035Y-64553223D01*
X87480222Y-65123454D01*
X87522829Y-65226317D01*
X87310460Y-65268560D01*
X87039566Y-65449566D01*
X83474132Y-69015000D01*
X81263868Y-69015000D01*
X81706625Y-68572243D01*
X81766514Y-68547497D01*
X82008647Y-68305787D01*
X82139850Y-67989815D01*
X82140149Y-67647686D01*
X82009497Y-67331486D01*
X81767787Y-67089353D01*
X81451815Y-66958150D01*
X81109686Y-66957851D01*
X80793486Y-67088503D01*
X80551353Y-67330213D01*
X80526098Y-67391034D01*
X78902132Y-69015000D01*
X77623507Y-69015000D01*
X77586462Y-68925345D01*
X77127073Y-68465154D01*
X77035000Y-68426922D01*
X77035000Y-65532000D01*
X77017864Y-65445852D01*
X76971440Y-65212460D01*
X76790434Y-64941566D01*
X76382618Y-64533750D01*
X76420647Y-64495787D01*
X76551850Y-64179815D01*
X76552149Y-63837686D01*
X76421497Y-63521486D01*
X76179787Y-63279353D01*
X75937583Y-63178781D01*
X75748802Y-62990000D01*
X85344000Y-62990000D01*
X85634839Y-62932148D01*
X85881401Y-62767401D01*
X86928802Y-61720000D01*
X87557976Y-61720000D01*
X87465250Y-61943309D01*
G36*
X113919000Y-63373000D02*
X113939000Y-63373000D01*
X113939000Y-63627000D01*
X113919000Y-63627000D01*
X113919000Y-63647000D01*
X113665000Y-63647000D01*
X113665000Y-63627000D01*
X113645000Y-63627000D01*
X113645000Y-63373000D01*
X113665000Y-63373000D01*
X113665000Y-63353000D01*
X113919000Y-63353000D01*
X113919000Y-63373000D01*
X113919000Y-63373000D01*
G37*
X113919000Y-63373000D02*
X113939000Y-63373000D01*
X113939000Y-63627000D01*
X113919000Y-63627000D01*
X113919000Y-63647000D01*
X113665000Y-63647000D01*
X113665000Y-63627000D01*
X113645000Y-63627000D01*
X113645000Y-63373000D01*
X113665000Y-63373000D01*
X113665000Y-63353000D01*
X113919000Y-63353000D01*
X113919000Y-63373000D01*
G36*
X106935302Y-53112811D02*
X107275314Y-53340000D01*
X106935302Y-53567189D01*
X106624233Y-54032736D01*
X106515000Y-54581887D01*
X106515000Y-54638113D01*
X106570096Y-54915102D01*
X104587198Y-56898000D01*
X91754802Y-56898000D01*
X91536026Y-56679224D01*
X91567000Y-56648250D01*
X91567000Y-55499000D01*
X90417750Y-55499000D01*
X90386776Y-55529974D01*
X90199401Y-55342599D01*
X90160411Y-55316547D01*
X90259000Y-55079117D01*
X90259000Y-55086250D01*
X90417750Y-55245000D01*
X91567000Y-55245000D01*
X91567000Y-55225000D01*
X91821000Y-55225000D01*
X91821000Y-55245000D01*
X91841000Y-55245000D01*
X91841000Y-55499000D01*
X91821000Y-55499000D01*
X91821000Y-56648250D01*
X91979750Y-56807000D01*
X92620309Y-56807000D01*
X92853698Y-56710327D01*
X93032327Y-56531699D01*
X93129000Y-56298310D01*
X93129000Y-56293626D01*
X93191189Y-56386698D01*
X93656736Y-56697767D01*
X94205887Y-56807000D01*
X94262113Y-56807000D01*
X94811264Y-56697767D01*
X95276811Y-56386698D01*
X95504000Y-56046686D01*
X95731189Y-56386698D01*
X96196736Y-56697767D01*
X96745887Y-56807000D01*
X96802113Y-56807000D01*
X97351264Y-56697767D01*
X97816811Y-56386698D01*
X98044000Y-56046686D01*
X98271189Y-56386698D01*
X98736736Y-56697767D01*
X99285887Y-56807000D01*
X99342113Y-56807000D01*
X99891264Y-56697767D01*
X100356811Y-56386698D01*
X100584000Y-56046686D01*
X100811189Y-56386698D01*
X101276736Y-56697767D01*
X101825887Y-56807000D01*
X101882113Y-56807000D01*
X102431264Y-56697767D01*
X102896811Y-56386698D01*
X103207880Y-55921151D01*
X103317113Y-55372000D01*
X103207880Y-54822849D01*
X103064322Y-54608000D01*
X104140000Y-54608000D01*
X104430839Y-54550148D01*
X104677401Y-54385401D01*
X106232802Y-52830000D01*
X106746333Y-52830000D01*
X106935302Y-53112811D01*
X106935302Y-53112811D01*
G37*
X106935302Y-53112811D02*
X107275314Y-53340000D01*
X106935302Y-53567189D01*
X106624233Y-54032736D01*
X106515000Y-54581887D01*
X106515000Y-54638113D01*
X106570096Y-54915102D01*
X104587198Y-56898000D01*
X91754802Y-56898000D01*
X91536026Y-56679224D01*
X91567000Y-56648250D01*
X91567000Y-55499000D01*
X90417750Y-55499000D01*
X90386776Y-55529974D01*
X90199401Y-55342599D01*
X90160411Y-55316547D01*
X90259000Y-55079117D01*
X90259000Y-55086250D01*
X90417750Y-55245000D01*
X91567000Y-55245000D01*
X91567000Y-55225000D01*
X91821000Y-55225000D01*
X91821000Y-55245000D01*
X91841000Y-55245000D01*
X91841000Y-55499000D01*
X91821000Y-55499000D01*
X91821000Y-56648250D01*
X91979750Y-56807000D01*
X92620309Y-56807000D01*
X92853698Y-56710327D01*
X93032327Y-56531699D01*
X93129000Y-56298310D01*
X93129000Y-56293626D01*
X93191189Y-56386698D01*
X93656736Y-56697767D01*
X94205887Y-56807000D01*
X94262113Y-56807000D01*
X94811264Y-56697767D01*
X95276811Y-56386698D01*
X95504000Y-56046686D01*
X95731189Y-56386698D01*
X96196736Y-56697767D01*
X96745887Y-56807000D01*
X96802113Y-56807000D01*
X97351264Y-56697767D01*
X97816811Y-56386698D01*
X98044000Y-56046686D01*
X98271189Y-56386698D01*
X98736736Y-56697767D01*
X99285887Y-56807000D01*
X99342113Y-56807000D01*
X99891264Y-56697767D01*
X100356811Y-56386698D01*
X100584000Y-56046686D01*
X100811189Y-56386698D01*
X101276736Y-56697767D01*
X101825887Y-56807000D01*
X101882113Y-56807000D01*
X102431264Y-56697767D01*
X102896811Y-56386698D01*
X103207880Y-55921151D01*
X103317113Y-55372000D01*
X103207880Y-54822849D01*
X103064322Y-54608000D01*
X104140000Y-54608000D01*
X104430839Y-54550148D01*
X104677401Y-54385401D01*
X106232802Y-52830000D01*
X106746333Y-52830000D01*
X106935302Y-53112811D01*
G36*
X104934503Y-41634514D02*
X105083000Y-41783271D01*
X105083000Y-47425000D01*
X103886000Y-47425000D01*
X103566459Y-47488561D01*
X103297440Y-47668314D01*
X103295566Y-47669566D01*
X102717254Y-48247878D01*
X102719798Y-48241751D01*
X102720201Y-47780274D01*
X102543974Y-47353771D01*
X102217945Y-47027173D01*
X101791751Y-46850202D01*
X101330274Y-46849799D01*
X100903771Y-47026026D01*
X100577173Y-47352055D01*
X100400202Y-47778249D01*
X100399799Y-48239726D01*
X100576026Y-48666229D01*
X100902055Y-48992827D01*
X101328249Y-49169798D01*
X101789726Y-49170201D01*
X101798596Y-49166536D01*
X101479566Y-49485566D01*
X101298561Y-49756459D01*
X101235000Y-50076000D01*
X101235000Y-50422560D01*
X100920000Y-50422560D01*
X100684683Y-50466838D01*
X100468559Y-50605910D01*
X100323569Y-50818110D01*
X100272560Y-51070000D01*
X100272560Y-51220425D01*
X100247815Y-51210150D01*
X99905686Y-51209851D01*
X99663308Y-51310000D01*
X97917440Y-51310000D01*
X97917440Y-51070000D01*
X97873162Y-50834683D01*
X97734090Y-50618559D01*
X97521890Y-50473569D01*
X97270000Y-50422560D01*
X95547362Y-50422560D01*
X95248000Y-50123198D01*
X95248000Y-48066802D01*
X95400083Y-47914719D01*
X95399799Y-48239726D01*
X95576026Y-48666229D01*
X95902055Y-48992827D01*
X96328249Y-49169798D01*
X96789726Y-49170201D01*
X97216229Y-48993974D01*
X97542827Y-48667945D01*
X97719798Y-48241751D01*
X97720201Y-47780274D01*
X97543974Y-47353771D01*
X97217945Y-47027173D01*
X96791751Y-46850202D01*
X96464885Y-46849917D01*
X96549401Y-46765401D01*
X96714148Y-46518840D01*
X96727324Y-46452599D01*
X96772000Y-46228000D01*
X96772000Y-45835440D01*
X97162000Y-45835440D01*
X97397317Y-45791162D01*
X97613441Y-45652090D01*
X97758431Y-45439890D01*
X97809440Y-45188000D01*
X97809440Y-44448000D01*
X100310560Y-44448000D01*
X100310560Y-45188000D01*
X100354838Y-45423317D01*
X100493910Y-45639441D01*
X100706110Y-45784431D01*
X100958000Y-45835440D01*
X103258000Y-45835440D01*
X103493317Y-45791162D01*
X103709441Y-45652090D01*
X103854431Y-45439890D01*
X103905440Y-45188000D01*
X103905440Y-42188000D01*
X103861162Y-41952683D01*
X103722090Y-41736559D01*
X103509890Y-41591569D01*
X103258000Y-41540560D01*
X100958000Y-41540560D01*
X100722683Y-41584838D01*
X100506559Y-41723910D01*
X100361569Y-41936110D01*
X100310560Y-42188000D01*
X100310560Y-42928000D01*
X97809440Y-42928000D01*
X97809440Y-42188000D01*
X97765162Y-41952683D01*
X97626090Y-41736559D01*
X97413890Y-41591569D01*
X97162000Y-41540560D01*
X94862000Y-41540560D01*
X94626683Y-41584838D01*
X94410559Y-41723910D01*
X94265569Y-41936110D01*
X94214560Y-42188000D01*
X94214560Y-44947303D01*
X94119306Y-44716771D01*
X93645722Y-44242360D01*
X93026638Y-43985293D01*
X92740721Y-43985043D01*
X92949738Y-43481675D01*
X92950262Y-42880960D01*
X92720862Y-42325771D01*
X92296463Y-41900630D01*
X91741675Y-41670262D01*
X91140960Y-41669738D01*
X90585771Y-41899138D01*
X90160630Y-42323537D01*
X89930262Y-42878325D01*
X89929763Y-43450393D01*
X89713923Y-43234176D01*
X89186691Y-43015250D01*
X88615813Y-43014752D01*
X88450086Y-43083229D01*
X88450262Y-42880960D01*
X88220862Y-42325771D01*
X87796463Y-41900630D01*
X87241675Y-41670262D01*
X86640960Y-41669738D01*
X86085771Y-41899138D01*
X85660630Y-42323537D01*
X85620575Y-42420000D01*
X84582000Y-42420000D01*
X84291160Y-42477852D01*
X84044599Y-42642599D01*
X82774599Y-43912599D01*
X82609852Y-44159161D01*
X82552000Y-44450000D01*
X82552000Y-47244000D01*
X82609852Y-47534839D01*
X82774599Y-47781401D01*
X85060599Y-50067401D01*
X85307160Y-50232148D01*
X85598000Y-50290000D01*
X87661354Y-50290000D01*
X87682757Y-50341800D01*
X88086077Y-50745824D01*
X88216215Y-50799862D01*
X88088200Y-50852757D01*
X87684176Y-51256077D01*
X87465250Y-51783309D01*
X87464752Y-52354187D01*
X87558056Y-52580000D01*
X87376000Y-52580000D01*
X87085160Y-52637852D01*
X86838599Y-52802599D01*
X85791198Y-53850000D01*
X74898646Y-53850000D01*
X74877243Y-53798200D01*
X74473923Y-53394176D01*
X74343785Y-53340138D01*
X74471800Y-53287243D01*
X74875824Y-52883923D01*
X75094750Y-52356691D01*
X75095248Y-51785813D01*
X74877243Y-51258200D01*
X74473923Y-50854176D01*
X74343785Y-50800138D01*
X74471800Y-50747243D01*
X74875824Y-50343923D01*
X75094750Y-49816691D01*
X75095248Y-49245813D01*
X74877243Y-48718200D01*
X74473923Y-48314176D01*
X74343785Y-48260138D01*
X74471800Y-48207243D01*
X74704536Y-47974913D01*
X74708503Y-47984514D01*
X74950213Y-48226647D01*
X75266185Y-48357850D01*
X75608314Y-48358149D01*
X75924514Y-48227497D01*
X76166647Y-47985787D01*
X76297850Y-47669815D01*
X76298149Y-47327686D01*
X76198000Y-47085308D01*
X76198000Y-46800845D01*
X76494278Y-47097640D01*
X77113362Y-47354707D01*
X77783697Y-47355292D01*
X78403229Y-47099306D01*
X78877640Y-46625722D01*
X79134707Y-46006638D01*
X79135292Y-45336303D01*
X78879306Y-44716771D01*
X78405722Y-44242360D01*
X77786638Y-43985293D01*
X77500721Y-43985043D01*
X77709738Y-43481675D01*
X77710262Y-42880960D01*
X77480862Y-42325771D01*
X77056463Y-41900630D01*
X76501675Y-41670262D01*
X75900960Y-41669738D01*
X75345771Y-41899138D01*
X74920630Y-42323537D01*
X74690262Y-42878325D01*
X74689763Y-43450393D01*
X74473923Y-43234176D01*
X73946691Y-43015250D01*
X73375813Y-43014752D01*
X73207274Y-43084391D01*
X73195579Y-42814542D01*
X73015953Y-42380884D01*
X72762060Y-42297545D01*
X71879605Y-43180000D01*
X71893748Y-43194143D01*
X71714143Y-43373748D01*
X71700000Y-43359605D01*
X71685858Y-43373748D01*
X71506253Y-43194143D01*
X71520395Y-43180000D01*
X70637940Y-42297545D01*
X70384047Y-42380884D01*
X70178410Y-42945306D01*
X70204421Y-43545458D01*
X70384047Y-43979116D01*
X70401869Y-43984966D01*
X70106303Y-43984708D01*
X69486771Y-44240694D01*
X69290000Y-44437122D01*
X69290000Y-42117940D01*
X70817545Y-42117940D01*
X71700000Y-43000395D01*
X72582455Y-42117940D01*
X72499116Y-41864047D01*
X71934694Y-41658410D01*
X71334542Y-41684421D01*
X70900884Y-41864047D01*
X70817545Y-42117940D01*
X69290000Y-42117940D01*
X69290000Y-41350000D01*
X104816943Y-41350000D01*
X104934503Y-41634514D01*
X104934503Y-41634514D01*
G37*
X104934503Y-41634514D02*
X105083000Y-41783271D01*
X105083000Y-47425000D01*
X103886000Y-47425000D01*
X103566459Y-47488561D01*
X103297440Y-47668314D01*
X103295566Y-47669566D01*
X102717254Y-48247878D01*
X102719798Y-48241751D01*
X102720201Y-47780274D01*
X102543974Y-47353771D01*
X102217945Y-47027173D01*
X101791751Y-46850202D01*
X101330274Y-46849799D01*
X100903771Y-47026026D01*
X100577173Y-47352055D01*
X100400202Y-47778249D01*
X100399799Y-48239726D01*
X100576026Y-48666229D01*
X100902055Y-48992827D01*
X101328249Y-49169798D01*
X101789726Y-49170201D01*
X101798596Y-49166536D01*
X101479566Y-49485566D01*
X101298561Y-49756459D01*
X101235000Y-50076000D01*
X101235000Y-50422560D01*
X100920000Y-50422560D01*
X100684683Y-50466838D01*
X100468559Y-50605910D01*
X100323569Y-50818110D01*
X100272560Y-51070000D01*
X100272560Y-51220425D01*
X100247815Y-51210150D01*
X99905686Y-51209851D01*
X99663308Y-51310000D01*
X97917440Y-51310000D01*
X97917440Y-51070000D01*
X97873162Y-50834683D01*
X97734090Y-50618559D01*
X97521890Y-50473569D01*
X97270000Y-50422560D01*
X95547362Y-50422560D01*
X95248000Y-50123198D01*
X95248000Y-48066802D01*
X95400083Y-47914719D01*
X95399799Y-48239726D01*
X95576026Y-48666229D01*
X95902055Y-48992827D01*
X96328249Y-49169798D01*
X96789726Y-49170201D01*
X97216229Y-48993974D01*
X97542827Y-48667945D01*
X97719798Y-48241751D01*
X97720201Y-47780274D01*
X97543974Y-47353771D01*
X97217945Y-47027173D01*
X96791751Y-46850202D01*
X96464885Y-46849917D01*
X96549401Y-46765401D01*
X96714148Y-46518840D01*
X96727324Y-46452599D01*
X96772000Y-46228000D01*
X96772000Y-45835440D01*
X97162000Y-45835440D01*
X97397317Y-45791162D01*
X97613441Y-45652090D01*
X97758431Y-45439890D01*
X97809440Y-45188000D01*
X97809440Y-44448000D01*
X100310560Y-44448000D01*
X100310560Y-45188000D01*
X100354838Y-45423317D01*
X100493910Y-45639441D01*
X100706110Y-45784431D01*
X100958000Y-45835440D01*
X103258000Y-45835440D01*
X103493317Y-45791162D01*
X103709441Y-45652090D01*
X103854431Y-45439890D01*
X103905440Y-45188000D01*
X103905440Y-42188000D01*
X103861162Y-41952683D01*
X103722090Y-41736559D01*
X103509890Y-41591569D01*
X103258000Y-41540560D01*
X100958000Y-41540560D01*
X100722683Y-41584838D01*
X100506559Y-41723910D01*
X100361569Y-41936110D01*
X100310560Y-42188000D01*
X100310560Y-42928000D01*
X97809440Y-42928000D01*
X97809440Y-42188000D01*
X97765162Y-41952683D01*
X97626090Y-41736559D01*
X97413890Y-41591569D01*
X97162000Y-41540560D01*
X94862000Y-41540560D01*
X94626683Y-41584838D01*
X94410559Y-41723910D01*
X94265569Y-41936110D01*
X94214560Y-42188000D01*
X94214560Y-44947303D01*
X94119306Y-44716771D01*
X93645722Y-44242360D01*
X93026638Y-43985293D01*
X92740721Y-43985043D01*
X92949738Y-43481675D01*
X92950262Y-42880960D01*
X92720862Y-42325771D01*
X92296463Y-41900630D01*
X91741675Y-41670262D01*
X91140960Y-41669738D01*
X90585771Y-41899138D01*
X90160630Y-42323537D01*
X89930262Y-42878325D01*
X89929763Y-43450393D01*
X89713923Y-43234176D01*
X89186691Y-43015250D01*
X88615813Y-43014752D01*
X88450086Y-43083229D01*
X88450262Y-42880960D01*
X88220862Y-42325771D01*
X87796463Y-41900630D01*
X87241675Y-41670262D01*
X86640960Y-41669738D01*
X86085771Y-41899138D01*
X85660630Y-42323537D01*
X85620575Y-42420000D01*
X84582000Y-42420000D01*
X84291160Y-42477852D01*
X84044599Y-42642599D01*
X82774599Y-43912599D01*
X82609852Y-44159161D01*
X82552000Y-44450000D01*
X82552000Y-47244000D01*
X82609852Y-47534839D01*
X82774599Y-47781401D01*
X85060599Y-50067401D01*
X85307160Y-50232148D01*
X85598000Y-50290000D01*
X87661354Y-50290000D01*
X87682757Y-50341800D01*
X88086077Y-50745824D01*
X88216215Y-50799862D01*
X88088200Y-50852757D01*
X87684176Y-51256077D01*
X87465250Y-51783309D01*
X87464752Y-52354187D01*
X87558056Y-52580000D01*
X87376000Y-52580000D01*
X87085160Y-52637852D01*
X86838599Y-52802599D01*
X85791198Y-53850000D01*
X74898646Y-53850000D01*
X74877243Y-53798200D01*
X74473923Y-53394176D01*
X74343785Y-53340138D01*
X74471800Y-53287243D01*
X74875824Y-52883923D01*
X75094750Y-52356691D01*
X75095248Y-51785813D01*
X74877243Y-51258200D01*
X74473923Y-50854176D01*
X74343785Y-50800138D01*
X74471800Y-50747243D01*
X74875824Y-50343923D01*
X75094750Y-49816691D01*
X75095248Y-49245813D01*
X74877243Y-48718200D01*
X74473923Y-48314176D01*
X74343785Y-48260138D01*
X74471800Y-48207243D01*
X74704536Y-47974913D01*
X74708503Y-47984514D01*
X74950213Y-48226647D01*
X75266185Y-48357850D01*
X75608314Y-48358149D01*
X75924514Y-48227497D01*
X76166647Y-47985787D01*
X76297850Y-47669815D01*
X76298149Y-47327686D01*
X76198000Y-47085308D01*
X76198000Y-46800845D01*
X76494278Y-47097640D01*
X77113362Y-47354707D01*
X77783697Y-47355292D01*
X78403229Y-47099306D01*
X78877640Y-46625722D01*
X79134707Y-46006638D01*
X79135292Y-45336303D01*
X78879306Y-44716771D01*
X78405722Y-44242360D01*
X77786638Y-43985293D01*
X77500721Y-43985043D01*
X77709738Y-43481675D01*
X77710262Y-42880960D01*
X77480862Y-42325771D01*
X77056463Y-41900630D01*
X76501675Y-41670262D01*
X75900960Y-41669738D01*
X75345771Y-41899138D01*
X74920630Y-42323537D01*
X74690262Y-42878325D01*
X74689763Y-43450393D01*
X74473923Y-43234176D01*
X73946691Y-43015250D01*
X73375813Y-43014752D01*
X73207274Y-43084391D01*
X73195579Y-42814542D01*
X73015953Y-42380884D01*
X72762060Y-42297545D01*
X71879605Y-43180000D01*
X71893748Y-43194143D01*
X71714143Y-43373748D01*
X71700000Y-43359605D01*
X71685858Y-43373748D01*
X71506253Y-43194143D01*
X71520395Y-43180000D01*
X70637940Y-42297545D01*
X70384047Y-42380884D01*
X70178410Y-42945306D01*
X70204421Y-43545458D01*
X70384047Y-43979116D01*
X70401869Y-43984966D01*
X70106303Y-43984708D01*
X69486771Y-44240694D01*
X69290000Y-44437122D01*
X69290000Y-42117940D01*
X70817545Y-42117940D01*
X71700000Y-43000395D01*
X72582455Y-42117940D01*
X72499116Y-41864047D01*
X71934694Y-41658410D01*
X71334542Y-41684421D01*
X70900884Y-41864047D01*
X70817545Y-42117940D01*
X69290000Y-42117940D01*
X69290000Y-41350000D01*
X104816943Y-41350000D01*
X104934503Y-41634514D01*
G36*
X70043748Y-49515858D02*
X70029605Y-49530000D01*
X70043748Y-49544142D01*
X69864142Y-49723748D01*
X69850000Y-49709605D01*
X69835858Y-49723748D01*
X69656253Y-49544143D01*
X69670395Y-49530000D01*
X69656253Y-49515858D01*
X69835858Y-49336252D01*
X69850000Y-49350395D01*
X69864142Y-49336252D01*
X70043748Y-49515858D01*
X70043748Y-49515858D01*
G37*
X70043748Y-49515858D02*
X70029605Y-49530000D01*
X70043748Y-49544142D01*
X69864142Y-49723748D01*
X69850000Y-49709605D01*
X69835858Y-49723748D01*
X69656253Y-49544143D01*
X69670395Y-49530000D01*
X69656253Y-49515858D01*
X69835858Y-49336252D01*
X69850000Y-49350395D01*
X69864142Y-49336252D01*
X70043748Y-49515858D01*
M02*
