G04 #@! TF.GenerationSoftware,KiCad,Pcbnew,5.1.5+dfsg1-2*
G04 #@! TF.CreationDate,2020-01-10T10:39:52+05:30*
G04 #@! TF.ProjectId,flipmouse,666c6970-6d6f-4757-9365-2e6b69636164,rev?*
G04 #@! TF.SameCoordinates,Original*
G04 #@! TF.FileFunction,Copper,L1,Top*
G04 #@! TF.FilePolarity,Positive*
%FSLAX46Y46*%
G04 Gerber Fmt 4.6, Leading zero omitted, Abs format (unit mm)*
G04 Created by KiCad (PCBNEW 5.1.5+dfsg1-2) date 2020-01-10 10:39:52*
%MOMM*%
%LPD*%
G04 APERTURE LIST*
%ADD10R,1.600000X1.600000*%
%ADD11C,1.600000*%
%ADD12C,2.000000*%
%ADD13R,2.000000X2.000000*%
%ADD14O,1.600000X1.600000*%
%ADD15C,2.100000*%
%ADD16C,1.750000*%
%ADD17C,1.998980*%
%ADD18R,2.300000X3.000000*%
%ADD19R,2.300000X2.000000*%
%ADD20R,2.032000X1.727200*%
%ADD21O,2.032000X1.727200*%
%ADD22C,0.450000*%
%ADD23C,0.250000*%
%ADD24C,0.400000*%
%ADD25C,0.254000*%
G04 APERTURE END LIST*
D10*
X88900000Y-72390000D03*
D11*
X88900000Y-69850000D03*
X88900000Y-67310000D03*
X88900000Y-64770000D03*
X88900000Y-62230000D03*
X88900000Y-59690000D03*
X88900000Y-57150000D03*
X88900000Y-54610000D03*
X88900000Y-52070000D03*
X88900000Y-49530000D03*
X88900000Y-46990000D03*
X88900000Y-44450000D03*
X73660000Y-44450000D03*
X73660000Y-46990000D03*
X73660000Y-49530000D03*
X73660000Y-52070000D03*
X73660000Y-54610000D03*
X73660000Y-57150000D03*
X73660000Y-59690000D03*
X73660000Y-62230000D03*
X73660000Y-64770000D03*
X73660000Y-67310000D03*
X73660000Y-69850000D03*
X73660000Y-72390000D03*
D12*
X101600000Y-70601840D03*
X101600000Y-63002160D03*
D13*
X82550000Y-73660000D03*
D12*
X80010000Y-73660000D03*
D10*
X107950000Y-62230000D03*
D14*
X107950000Y-59690000D03*
X107950000Y-57150000D03*
X107950000Y-54610000D03*
X107950000Y-52070000D03*
D10*
X91694000Y-55372000D03*
D14*
X94234000Y-55372000D03*
X96774000Y-55372000D03*
X99314000Y-55372000D03*
X101854000Y-55372000D03*
D15*
X70440000Y-45670000D03*
D16*
X71700000Y-43180000D03*
X76200000Y-43180000D03*
D15*
X77450000Y-45670000D03*
X85680000Y-45670000D03*
D16*
X86940000Y-43180000D03*
X91440000Y-43180000D03*
D15*
X92690000Y-45670000D03*
D17*
X76200000Y-69850000D03*
X86360000Y-69850000D03*
X69850000Y-59690000D03*
X69850000Y-49530000D03*
D18*
X98298000Y-73152000D03*
X92202000Y-73152000D03*
D19*
X98190000Y-64770000D03*
X92240000Y-64770000D03*
D18*
X110998000Y-73152000D03*
X104902000Y-73152000D03*
D19*
X110890000Y-64770000D03*
X104940000Y-64770000D03*
D18*
X96012000Y-43688000D03*
X102108000Y-43688000D03*
D19*
X96120000Y-52070000D03*
X102070000Y-52070000D03*
D20*
X113792000Y-53340000D03*
D21*
X113792000Y-55880000D03*
X113792000Y-58420000D03*
X113792000Y-60960000D03*
X113792000Y-63500000D03*
D22*
X86360000Y-62992000D03*
X94615000Y-62230000D03*
X92710000Y-62865000D03*
X95758000Y-63754000D03*
X87630000Y-74295000D03*
X107696000Y-48260000D03*
X105664000Y-41148000D03*
X81280000Y-67818000D03*
X100076000Y-52070000D03*
X109855000Y-66675000D03*
X105410000Y-66675000D03*
X108458000Y-64008000D03*
X75692000Y-64008000D03*
X95504000Y-67818000D03*
X115570000Y-64516000D03*
X110998000Y-51308000D03*
X111506000Y-50546000D03*
X113030000Y-65532000D03*
X75438000Y-47498000D03*
D23*
X86360000Y-62992000D02*
X88138000Y-64770000D01*
X88138000Y-64770000D02*
X88900000Y-64770000D01*
X73660000Y-69850000D02*
X72136000Y-69850000D01*
X78232000Y-73660000D02*
X80010000Y-73660000D01*
X77724000Y-74168000D02*
X78232000Y-73660000D01*
X72390000Y-74168000D02*
X77724000Y-74168000D01*
X71628000Y-73406000D02*
X72390000Y-74168000D01*
X71628000Y-70358000D02*
X71628000Y-73406000D01*
X72136000Y-69850000D02*
X71628000Y-70358000D01*
X82550000Y-73660000D02*
X84074000Y-73660000D01*
X86360000Y-71374000D02*
X86360000Y-69850000D01*
X84074000Y-73660000D02*
X86360000Y-71374000D01*
X92240000Y-64770000D02*
X92240000Y-63335000D01*
X98190000Y-63265000D02*
X98190000Y-64770000D01*
X97155000Y-62230000D02*
X98190000Y-63265000D01*
X94615000Y-62230000D02*
X97155000Y-62230000D01*
X92240000Y-63335000D02*
X92710000Y-62865000D01*
X96774000Y-64770000D02*
X98190000Y-64770000D01*
X95758000Y-63754000D02*
X96774000Y-64770000D01*
D24*
X102108000Y-43688000D02*
X96012000Y-43688000D01*
X96012000Y-43688000D02*
X95885000Y-43815000D01*
X95885000Y-43815000D02*
X93980000Y-43815000D01*
X93980000Y-43815000D02*
X93345000Y-43180000D01*
X93345000Y-43180000D02*
X91440000Y-43180000D01*
X92202000Y-73152000D02*
X91313000Y-73152000D01*
X91313000Y-73152000D02*
X90170000Y-74295000D01*
X90170000Y-74295000D02*
X87630000Y-74295000D01*
X98298000Y-73152000D02*
X92202000Y-73152000D01*
X107950000Y-62230000D02*
X107315000Y-62865000D01*
X107315000Y-62865000D02*
X107315000Y-67945000D01*
X110998000Y-70993000D02*
X110998000Y-73152000D01*
X110490000Y-70485000D02*
X110998000Y-70993000D01*
X109855000Y-70485000D02*
X110490000Y-70485000D01*
X107315000Y-67945000D02*
X109855000Y-70485000D01*
X110998000Y-73152000D02*
X104902000Y-73152000D01*
X104902000Y-73152000D02*
X98298000Y-73152000D01*
X105918000Y-48260000D02*
X107696000Y-48260000D01*
X105664000Y-41148000D02*
X105918000Y-41402000D01*
X105918000Y-41402000D02*
X105918000Y-48260000D01*
X76200000Y-69850000D02*
X78740000Y-69850000D01*
X78740000Y-69850000D02*
X79248000Y-69850000D01*
X79248000Y-69850000D02*
X81280000Y-67818000D01*
X73660000Y-64770000D02*
X75438000Y-64770000D01*
X76200000Y-65532000D02*
X76200000Y-69850000D01*
X75438000Y-64770000D02*
X76200000Y-65532000D01*
D23*
X102070000Y-52070000D02*
X99695000Y-52070000D01*
X94488000Y-47752000D02*
X94488000Y-50438000D01*
X91186000Y-47752000D02*
X94488000Y-47752000D01*
X96120000Y-52070000D02*
X99695000Y-52070000D01*
X99695000Y-52070000D02*
X100076000Y-52070000D01*
X94488000Y-50438000D02*
X96120000Y-52070000D01*
X88900000Y-46990000D02*
X90424000Y-46990000D01*
X90424000Y-46990000D02*
X91186000Y-47752000D01*
X89408000Y-47498000D02*
X88900000Y-46990000D01*
X104940000Y-64770000D02*
X104940000Y-66205000D01*
X110890000Y-66275000D02*
X110890000Y-64770000D01*
X110490000Y-66675000D02*
X110890000Y-66275000D01*
X109855000Y-66675000D02*
X110490000Y-66675000D01*
X104940000Y-66205000D02*
X105410000Y-66675000D01*
X104940000Y-64770000D02*
X105410000Y-64770000D01*
X108458000Y-64008000D02*
X109220000Y-64770000D01*
X109220000Y-64770000D02*
X110890000Y-64770000D01*
X73660000Y-44450000D02*
X73660000Y-44958000D01*
X73660000Y-44958000D02*
X71628000Y-46990000D01*
X71628000Y-46990000D02*
X71628000Y-57912000D01*
X71628000Y-57912000D02*
X69850000Y-59690000D01*
X75692000Y-64008000D02*
X75184000Y-63500000D01*
X75184000Y-63500000D02*
X70358000Y-63500000D01*
X70358000Y-63500000D02*
X69850000Y-62992000D01*
X69850000Y-62992000D02*
X69850000Y-59690000D01*
X73660000Y-54610000D02*
X86106000Y-54610000D01*
X105918000Y-52070000D02*
X107950000Y-52070000D01*
X104140000Y-53848000D02*
X105918000Y-52070000D01*
X93726000Y-53848000D02*
X104140000Y-53848000D01*
X93218000Y-53340000D02*
X93726000Y-53848000D01*
X87376000Y-53340000D02*
X93218000Y-53340000D01*
X86106000Y-54610000D02*
X87376000Y-53340000D01*
X107950000Y-52070000D02*
X110998000Y-52070000D01*
X112268000Y-53340000D02*
X113792000Y-53340000D01*
X110998000Y-52070000D02*
X112268000Y-53340000D01*
X73660000Y-57150000D02*
X85090000Y-57150000D01*
X104902000Y-57658000D02*
X107950000Y-54610000D01*
X91440000Y-57658000D02*
X104902000Y-57658000D01*
X89662000Y-55880000D02*
X91440000Y-57658000D01*
X86360000Y-55880000D02*
X89662000Y-55880000D01*
X85090000Y-57150000D02*
X86360000Y-55880000D01*
X107950000Y-54610000D02*
X110490000Y-54610000D01*
X111760000Y-55880000D02*
X113792000Y-55880000D01*
X110490000Y-54610000D02*
X111760000Y-55880000D01*
X73660000Y-59690000D02*
X85344000Y-59690000D01*
X106680000Y-58420000D02*
X107950000Y-57150000D01*
X86614000Y-58420000D02*
X106680000Y-58420000D01*
X85344000Y-59690000D02*
X86614000Y-58420000D01*
X107950000Y-57150000D02*
X110490000Y-57150000D01*
X111760000Y-58420000D02*
X113792000Y-58420000D01*
X110490000Y-57150000D02*
X111760000Y-58420000D01*
X73660000Y-62230000D02*
X85344000Y-62230000D01*
X99314000Y-59690000D02*
X107950000Y-59690000D01*
X98044000Y-60960000D02*
X99314000Y-59690000D01*
X86614000Y-60960000D02*
X98044000Y-60960000D01*
X85344000Y-62230000D02*
X86614000Y-60960000D01*
X107950000Y-59690000D02*
X109982000Y-59690000D01*
X111252000Y-60960000D02*
X113792000Y-60960000D01*
X109982000Y-59690000D02*
X111252000Y-60960000D01*
X94742000Y-67818000D02*
X95504000Y-67818000D01*
X94234000Y-67310000D02*
X94742000Y-67818000D01*
X94234000Y-67056000D02*
X94234000Y-67310000D01*
X115570000Y-64516000D02*
X115570000Y-51816000D01*
X115570000Y-51816000D02*
X115062000Y-51308000D01*
X115062000Y-51308000D02*
X110998000Y-51308000D01*
X93218000Y-62230000D02*
X88900000Y-62230000D01*
X94234000Y-66802000D02*
X94234000Y-67056000D01*
X94234000Y-63246000D02*
X94234000Y-66802000D01*
X93218000Y-62230000D02*
X94234000Y-63246000D01*
X113792000Y-65532000D02*
X115570000Y-65532000D01*
X115570000Y-65532000D02*
X116332000Y-64770000D01*
X116332000Y-64770000D02*
X116332000Y-51816000D01*
X116332000Y-51816000D02*
X115062000Y-50546000D01*
X115062000Y-50546000D02*
X111506000Y-50546000D01*
X113030000Y-65532000D02*
X113792000Y-65532000D01*
X86940000Y-43180000D02*
X84582000Y-43180000D01*
X85598000Y-49530000D02*
X88900000Y-49530000D01*
X83312000Y-47244000D02*
X85598000Y-49530000D01*
X83312000Y-44450000D02*
X83312000Y-47244000D01*
X84582000Y-43180000D02*
X83312000Y-44450000D01*
X76200000Y-43180000D02*
X76200000Y-43942000D01*
X76200000Y-43942000D02*
X75438000Y-44704000D01*
X75438000Y-44704000D02*
X75438000Y-47498000D01*
D25*
G36*
X106835363Y-60604759D02*
G01*
X107033961Y-60803357D01*
X107025518Y-60804188D01*
X106905820Y-60840498D01*
X106795506Y-60899463D01*
X106698815Y-60978815D01*
X106619463Y-61075506D01*
X106560498Y-61185820D01*
X106524188Y-61305518D01*
X106511928Y-61430000D01*
X106511928Y-62635888D01*
X106492082Y-62701312D01*
X106475960Y-62865000D01*
X106480000Y-62906019D01*
X106480000Y-63268602D01*
X106444494Y-63239463D01*
X106334180Y-63180498D01*
X106214482Y-63144188D01*
X106090000Y-63131928D01*
X103790000Y-63131928D01*
X103665518Y-63144188D01*
X103545820Y-63180498D01*
X103435506Y-63239463D01*
X103338815Y-63318815D01*
X103259463Y-63415506D01*
X103200498Y-63525820D01*
X103164188Y-63645518D01*
X103151928Y-63770000D01*
X103151928Y-65770000D01*
X103164188Y-65894482D01*
X103200498Y-66014180D01*
X103259463Y-66124494D01*
X103338815Y-66221185D01*
X103435506Y-66300537D01*
X103545820Y-66359502D01*
X103665518Y-66395812D01*
X103790000Y-66408072D01*
X104207404Y-66408072D01*
X104234454Y-66497246D01*
X104305026Y-66629276D01*
X104362474Y-66699276D01*
X104400000Y-66745001D01*
X104428998Y-66768799D01*
X104582303Y-66922105D01*
X104583049Y-66925853D01*
X104647878Y-67082363D01*
X104741995Y-67223218D01*
X104861782Y-67343005D01*
X105002637Y-67437122D01*
X105159147Y-67501951D01*
X105325297Y-67535000D01*
X105494703Y-67535000D01*
X105660853Y-67501951D01*
X105817363Y-67437122D01*
X105958218Y-67343005D01*
X106078005Y-67223218D01*
X106172122Y-67082363D01*
X106236951Y-66925853D01*
X106270000Y-66759703D01*
X106270000Y-66590297D01*
X106236951Y-66424147D01*
X106224016Y-66392920D01*
X106334180Y-66359502D01*
X106444494Y-66300537D01*
X106480001Y-66271398D01*
X106480001Y-67903972D01*
X106475960Y-67945000D01*
X106492082Y-68108688D01*
X106539828Y-68266086D01*
X106616636Y-68409783D01*
X106617365Y-68411146D01*
X106721710Y-68538291D01*
X106753574Y-68564441D01*
X109235559Y-71046427D01*
X109261709Y-71078291D01*
X109388854Y-71182636D01*
X109407089Y-71192383D01*
X109396815Y-71200815D01*
X109317463Y-71297506D01*
X109258498Y-71407820D01*
X109222188Y-71527518D01*
X109209928Y-71652000D01*
X109209928Y-72317000D01*
X106690072Y-72317000D01*
X106690072Y-71652000D01*
X106677812Y-71527518D01*
X106641502Y-71407820D01*
X106582537Y-71297506D01*
X106503185Y-71200815D01*
X106406494Y-71121463D01*
X106296180Y-71062498D01*
X106176482Y-71026188D01*
X106052000Y-71013928D01*
X103752000Y-71013928D01*
X103627518Y-71026188D01*
X103507820Y-71062498D01*
X103397506Y-71121463D01*
X103300815Y-71200815D01*
X103221463Y-71297506D01*
X103162498Y-71407820D01*
X103126188Y-71527518D01*
X103113928Y-71652000D01*
X103113928Y-72317000D01*
X100086072Y-72317000D01*
X100086072Y-71652000D01*
X100073812Y-71527518D01*
X100037502Y-71407820D01*
X99978537Y-71297506D01*
X99899185Y-71200815D01*
X99802494Y-71121463D01*
X99692180Y-71062498D01*
X99572482Y-71026188D01*
X99448000Y-71013928D01*
X97148000Y-71013928D01*
X97023518Y-71026188D01*
X96903820Y-71062498D01*
X96793506Y-71121463D01*
X96696815Y-71200815D01*
X96617463Y-71297506D01*
X96558498Y-71407820D01*
X96522188Y-71527518D01*
X96509928Y-71652000D01*
X96509928Y-72317000D01*
X93990072Y-72317000D01*
X93990072Y-71652000D01*
X93977812Y-71527518D01*
X93941502Y-71407820D01*
X93882537Y-71297506D01*
X93803185Y-71200815D01*
X93706494Y-71121463D01*
X93596180Y-71062498D01*
X93476482Y-71026188D01*
X93352000Y-71013928D01*
X91052000Y-71013928D01*
X90927518Y-71026188D01*
X90807820Y-71062498D01*
X90697506Y-71121463D01*
X90600815Y-71200815D01*
X90521463Y-71297506D01*
X90462498Y-71407820D01*
X90426188Y-71527518D01*
X90413928Y-71652000D01*
X90413928Y-72870204D01*
X90338072Y-72946060D01*
X90338072Y-71590000D01*
X90325812Y-71465518D01*
X90289502Y-71345820D01*
X90230537Y-71235506D01*
X90151185Y-71138815D01*
X90054494Y-71059463D01*
X89944180Y-71000498D01*
X89824482Y-70964188D01*
X89816039Y-70963357D01*
X90014637Y-70764759D01*
X90171680Y-70529727D01*
X90208511Y-70440807D01*
X99965000Y-70440807D01*
X99965000Y-70762873D01*
X100027832Y-71078752D01*
X100151082Y-71376303D01*
X100330013Y-71644092D01*
X100557748Y-71871827D01*
X100825537Y-72050758D01*
X101123088Y-72174008D01*
X101438967Y-72236840D01*
X101761033Y-72236840D01*
X102076912Y-72174008D01*
X102374463Y-72050758D01*
X102642252Y-71871827D01*
X102869987Y-71644092D01*
X103048918Y-71376303D01*
X103172168Y-71078752D01*
X103235000Y-70762873D01*
X103235000Y-70440807D01*
X103172168Y-70124928D01*
X103048918Y-69827377D01*
X102869987Y-69559588D01*
X102642252Y-69331853D01*
X102374463Y-69152922D01*
X102076912Y-69029672D01*
X101761033Y-68966840D01*
X101438967Y-68966840D01*
X101123088Y-69029672D01*
X100825537Y-69152922D01*
X100557748Y-69331853D01*
X100330013Y-69559588D01*
X100151082Y-69827377D01*
X100027832Y-70124928D01*
X99965000Y-70440807D01*
X90208511Y-70440807D01*
X90279853Y-70268574D01*
X90335000Y-69991335D01*
X90335000Y-69708665D01*
X90279853Y-69431426D01*
X90171680Y-69170273D01*
X90014637Y-68935241D01*
X89814759Y-68735363D01*
X89785407Y-68715750D01*
X91590000Y-68715750D01*
X91590000Y-68944250D01*
X91634578Y-69168360D01*
X91722021Y-69379466D01*
X91848969Y-69569457D01*
X92010543Y-69731031D01*
X92200534Y-69857979D01*
X92411640Y-69945422D01*
X92635750Y-69990000D01*
X92864250Y-69990000D01*
X93088360Y-69945422D01*
X93299466Y-69857979D01*
X93489457Y-69731031D01*
X93651031Y-69569457D01*
X93777979Y-69379466D01*
X93865422Y-69168360D01*
X93910000Y-68944250D01*
X93910000Y-68715750D01*
X96590000Y-68715750D01*
X96590000Y-68944250D01*
X96634578Y-69168360D01*
X96722021Y-69379466D01*
X96848969Y-69569457D01*
X97010543Y-69731031D01*
X97200534Y-69857979D01*
X97411640Y-69945422D01*
X97635750Y-69990000D01*
X97864250Y-69990000D01*
X98088360Y-69945422D01*
X98299466Y-69857979D01*
X98489457Y-69731031D01*
X98651031Y-69569457D01*
X98777979Y-69379466D01*
X98865422Y-69168360D01*
X98910000Y-68944250D01*
X98910000Y-68715750D01*
X104290000Y-68715750D01*
X104290000Y-68944250D01*
X104334578Y-69168360D01*
X104422021Y-69379466D01*
X104548969Y-69569457D01*
X104710543Y-69731031D01*
X104900534Y-69857979D01*
X105111640Y-69945422D01*
X105335750Y-69990000D01*
X105564250Y-69990000D01*
X105788360Y-69945422D01*
X105999466Y-69857979D01*
X106189457Y-69731031D01*
X106351031Y-69569457D01*
X106477979Y-69379466D01*
X106565422Y-69168360D01*
X106610000Y-68944250D01*
X106610000Y-68715750D01*
X106565422Y-68491640D01*
X106477979Y-68280534D01*
X106351031Y-68090543D01*
X106189457Y-67928969D01*
X105999466Y-67802021D01*
X105788360Y-67714578D01*
X105564250Y-67670000D01*
X105335750Y-67670000D01*
X105111640Y-67714578D01*
X104900534Y-67802021D01*
X104710543Y-67928969D01*
X104548969Y-68090543D01*
X104422021Y-68280534D01*
X104334578Y-68491640D01*
X104290000Y-68715750D01*
X98910000Y-68715750D01*
X98865422Y-68491640D01*
X98777979Y-68280534D01*
X98651031Y-68090543D01*
X98489457Y-67928969D01*
X98299466Y-67802021D01*
X98088360Y-67714578D01*
X97864250Y-67670000D01*
X97635750Y-67670000D01*
X97411640Y-67714578D01*
X97200534Y-67802021D01*
X97010543Y-67928969D01*
X96848969Y-68090543D01*
X96722021Y-68280534D01*
X96634578Y-68491640D01*
X96590000Y-68715750D01*
X93910000Y-68715750D01*
X93865422Y-68491640D01*
X93777979Y-68280534D01*
X93651031Y-68090543D01*
X93489457Y-67928969D01*
X93299466Y-67802021D01*
X93088360Y-67714578D01*
X92864250Y-67670000D01*
X92635750Y-67670000D01*
X92411640Y-67714578D01*
X92200534Y-67802021D01*
X92010543Y-67928969D01*
X91848969Y-68090543D01*
X91722021Y-68280534D01*
X91634578Y-68491640D01*
X91590000Y-68715750D01*
X89785407Y-68715750D01*
X89580872Y-68579085D01*
X89641514Y-68546671D01*
X89713097Y-68302702D01*
X88900000Y-67489605D01*
X88086903Y-68302702D01*
X88158486Y-68546671D01*
X88222992Y-68577194D01*
X88220273Y-68578320D01*
X87985241Y-68735363D01*
X87785363Y-68935241D01*
X87749963Y-68988221D01*
X87629592Y-68808073D01*
X87401927Y-68580408D01*
X87134222Y-68401533D01*
X86836763Y-68278322D01*
X86520983Y-68215510D01*
X86199017Y-68215510D01*
X85883237Y-68278322D01*
X85585778Y-68401533D01*
X85318073Y-68580408D01*
X85090408Y-68808073D01*
X84911533Y-69075778D01*
X84788322Y-69373237D01*
X84725510Y-69689017D01*
X84725510Y-70010983D01*
X84788322Y-70326763D01*
X84911533Y-70624222D01*
X85090408Y-70891927D01*
X85318073Y-71119592D01*
X85450872Y-71208326D01*
X84163679Y-72495520D01*
X84139502Y-72415820D01*
X84080537Y-72305506D01*
X84001185Y-72208815D01*
X83904494Y-72129463D01*
X83794180Y-72070498D01*
X83674482Y-72034188D01*
X83550000Y-72021928D01*
X81550000Y-72021928D01*
X81425518Y-72034188D01*
X81305820Y-72070498D01*
X81195506Y-72129463D01*
X81098815Y-72208815D01*
X81019463Y-72305506D01*
X80960498Y-72415820D01*
X80944963Y-72467033D01*
X80870044Y-72260186D01*
X80580429Y-72119296D01*
X80268892Y-72037616D01*
X79947405Y-72018282D01*
X79628325Y-72062039D01*
X79323912Y-72167205D01*
X79149956Y-72260186D01*
X79054192Y-72524587D01*
X80010000Y-73480395D01*
X80024143Y-73466253D01*
X80203748Y-73645858D01*
X80189605Y-73660000D01*
X80203748Y-73674143D01*
X80024143Y-73853748D01*
X80010000Y-73839605D01*
X79054192Y-74795413D01*
X79149956Y-75059814D01*
X79439571Y-75200704D01*
X79751108Y-75282384D01*
X80072595Y-75301718D01*
X80391675Y-75257961D01*
X80696088Y-75152795D01*
X80870044Y-75059814D01*
X80944963Y-74852967D01*
X80960498Y-74904180D01*
X81019463Y-75014494D01*
X81098815Y-75111185D01*
X81195506Y-75190537D01*
X81305820Y-75249502D01*
X81425518Y-75285812D01*
X81550000Y-75298072D01*
X83550000Y-75298072D01*
X83674482Y-75285812D01*
X83794180Y-75249502D01*
X83904494Y-75190537D01*
X84001185Y-75111185D01*
X84080537Y-75014494D01*
X84139502Y-74904180D01*
X84175812Y-74784482D01*
X84188072Y-74660000D01*
X84188072Y-74412442D01*
X84222986Y-74409003D01*
X84366247Y-74365546D01*
X84498276Y-74294974D01*
X84614001Y-74200001D01*
X84637804Y-74170997D01*
X86871004Y-71937798D01*
X86900001Y-71914001D01*
X86994974Y-71798276D01*
X87065546Y-71666247D01*
X87109003Y-71522986D01*
X87120000Y-71411333D01*
X87120000Y-71411324D01*
X87123676Y-71374001D01*
X87120000Y-71336678D01*
X87120000Y-71304358D01*
X87134222Y-71298467D01*
X87401927Y-71119592D01*
X87629592Y-70891927D01*
X87749963Y-70711779D01*
X87785363Y-70764759D01*
X87983961Y-70963357D01*
X87975518Y-70964188D01*
X87855820Y-71000498D01*
X87745506Y-71059463D01*
X87648815Y-71138815D01*
X87569463Y-71235506D01*
X87510498Y-71345820D01*
X87474188Y-71465518D01*
X87461928Y-71590000D01*
X87461928Y-73190000D01*
X87474188Y-73314482D01*
X87510498Y-73434180D01*
X87514238Y-73441178D01*
X87379147Y-73468049D01*
X87222637Y-73532878D01*
X87081782Y-73626995D01*
X86961995Y-73746782D01*
X86867878Y-73887637D01*
X86803049Y-74044147D01*
X86770000Y-74210297D01*
X86770000Y-74379703D01*
X86803049Y-74545853D01*
X86867878Y-74702363D01*
X86961995Y-74843218D01*
X87081782Y-74963005D01*
X87222637Y-75057122D01*
X87379147Y-75121951D01*
X87545297Y-75155000D01*
X87714703Y-75155000D01*
X87840388Y-75130000D01*
X90128982Y-75130000D01*
X90170000Y-75134040D01*
X90211018Y-75130000D01*
X90211019Y-75130000D01*
X90333689Y-75117918D01*
X90491087Y-75070172D01*
X90548526Y-75039470D01*
X90600815Y-75103185D01*
X90697506Y-75182537D01*
X90807820Y-75241502D01*
X90927518Y-75277812D01*
X91052000Y-75290072D01*
X93352000Y-75290072D01*
X93476482Y-75277812D01*
X93596180Y-75241502D01*
X93706494Y-75182537D01*
X93803185Y-75103185D01*
X93882537Y-75006494D01*
X93941502Y-74896180D01*
X93977812Y-74776482D01*
X93990072Y-74652000D01*
X93990072Y-73987000D01*
X96509928Y-73987000D01*
X96509928Y-74652000D01*
X96522188Y-74776482D01*
X96558498Y-74896180D01*
X96617463Y-75006494D01*
X96696815Y-75103185D01*
X96793506Y-75182537D01*
X96903820Y-75241502D01*
X97023518Y-75277812D01*
X97148000Y-75290072D01*
X99448000Y-75290072D01*
X99572482Y-75277812D01*
X99692180Y-75241502D01*
X99802494Y-75182537D01*
X99899185Y-75103185D01*
X99978537Y-75006494D01*
X100037502Y-74896180D01*
X100073812Y-74776482D01*
X100086072Y-74652000D01*
X100086072Y-73987000D01*
X103113928Y-73987000D01*
X103113928Y-74652000D01*
X103126188Y-74776482D01*
X103162498Y-74896180D01*
X103221463Y-75006494D01*
X103300815Y-75103185D01*
X103397506Y-75182537D01*
X103507820Y-75241502D01*
X103627518Y-75277812D01*
X103752000Y-75290072D01*
X106052000Y-75290072D01*
X106176482Y-75277812D01*
X106296180Y-75241502D01*
X106406494Y-75182537D01*
X106503185Y-75103185D01*
X106582537Y-75006494D01*
X106641502Y-74896180D01*
X106677812Y-74776482D01*
X106690072Y-74652000D01*
X106690072Y-73987000D01*
X109209928Y-73987000D01*
X109209928Y-74652000D01*
X109222188Y-74776482D01*
X109258498Y-74896180D01*
X109317463Y-75006494D01*
X109396815Y-75103185D01*
X109493506Y-75182537D01*
X109603820Y-75241502D01*
X109723518Y-75277812D01*
X109848000Y-75290072D01*
X112148000Y-75290072D01*
X112272482Y-75277812D01*
X112392180Y-75241502D01*
X112502494Y-75182537D01*
X112599185Y-75103185D01*
X112678537Y-75006494D01*
X112737502Y-74896180D01*
X112773812Y-74776482D01*
X112786072Y-74652000D01*
X112786072Y-71652000D01*
X112773812Y-71527518D01*
X112737502Y-71407820D01*
X112678537Y-71297506D01*
X112599185Y-71200815D01*
X112502494Y-71121463D01*
X112392180Y-71062498D01*
X112272482Y-71026188D01*
X112148000Y-71013928D01*
X111834978Y-71013928D01*
X111837039Y-70992999D01*
X111833000Y-70951991D01*
X111833000Y-70951981D01*
X111820918Y-70829311D01*
X111773172Y-70671913D01*
X111695636Y-70526854D01*
X111591291Y-70399709D01*
X111559422Y-70373555D01*
X111109446Y-69923579D01*
X111083291Y-69891709D01*
X111023016Y-69842243D01*
X111189457Y-69731031D01*
X111351031Y-69569457D01*
X111477979Y-69379466D01*
X111565422Y-69168360D01*
X111610000Y-68944250D01*
X111610000Y-68715750D01*
X111565422Y-68491640D01*
X111477979Y-68280534D01*
X111351031Y-68090543D01*
X111189457Y-67928969D01*
X110999466Y-67802021D01*
X110788360Y-67714578D01*
X110564250Y-67670000D01*
X110335750Y-67670000D01*
X110111640Y-67714578D01*
X109900534Y-67802021D01*
X109710543Y-67928969D01*
X109548969Y-68090543D01*
X109422021Y-68280534D01*
X109334578Y-68491640D01*
X109290000Y-68715750D01*
X109290000Y-68739132D01*
X108150000Y-67599133D01*
X108150000Y-64811280D01*
X108207147Y-64834951D01*
X108210895Y-64835697D01*
X108656201Y-65281002D01*
X108679999Y-65310001D01*
X108795724Y-65404974D01*
X108927753Y-65475546D01*
X109071014Y-65519003D01*
X109101928Y-65522048D01*
X109101928Y-65770000D01*
X109114188Y-65894482D01*
X109150498Y-66014180D01*
X109202434Y-66111343D01*
X109186995Y-66126782D01*
X109092878Y-66267637D01*
X109028049Y-66424147D01*
X108995000Y-66590297D01*
X108995000Y-66759703D01*
X109028049Y-66925853D01*
X109092878Y-67082363D01*
X109186995Y-67223218D01*
X109306782Y-67343005D01*
X109447637Y-67437122D01*
X109604147Y-67501951D01*
X109770297Y-67535000D01*
X109939703Y-67535000D01*
X110105853Y-67501951D01*
X110262363Y-67437122D01*
X110265539Y-67435000D01*
X110452678Y-67435000D01*
X110490000Y-67438676D01*
X110527322Y-67435000D01*
X110527333Y-67435000D01*
X110638986Y-67424003D01*
X110782247Y-67380546D01*
X110914276Y-67309974D01*
X111030001Y-67215001D01*
X111053803Y-67185998D01*
X111401003Y-66838799D01*
X111430001Y-66815001D01*
X111524974Y-66699276D01*
X111595546Y-66567247D01*
X111639003Y-66423986D01*
X111640570Y-66408072D01*
X112040000Y-66408072D01*
X112164482Y-66395812D01*
X112284180Y-66359502D01*
X112394494Y-66300537D01*
X112491185Y-66221185D01*
X112499081Y-66211564D01*
X112622637Y-66294122D01*
X112779147Y-66358951D01*
X112945297Y-66392000D01*
X113114703Y-66392000D01*
X113280853Y-66358951D01*
X113437363Y-66294122D01*
X113440539Y-66292000D01*
X115532678Y-66292000D01*
X115570000Y-66295676D01*
X115607322Y-66292000D01*
X115607333Y-66292000D01*
X115718986Y-66281003D01*
X115862247Y-66237546D01*
X115994276Y-66166974D01*
X116110001Y-66072001D01*
X116130000Y-66047632D01*
X116130000Y-75490000D01*
X69290000Y-75490000D01*
X69290000Y-72248665D01*
X72225000Y-72248665D01*
X72225000Y-72531335D01*
X72280147Y-72808574D01*
X72388320Y-73069727D01*
X72545363Y-73304759D01*
X72745241Y-73504637D01*
X72980273Y-73661680D01*
X73241426Y-73769853D01*
X73518665Y-73825000D01*
X73801335Y-73825000D01*
X74078574Y-73769853D01*
X74192665Y-73722595D01*
X78368282Y-73722595D01*
X78412039Y-74041675D01*
X78517205Y-74346088D01*
X78610186Y-74520044D01*
X78874587Y-74615808D01*
X79830395Y-73660000D01*
X78874587Y-72704192D01*
X78610186Y-72799956D01*
X78469296Y-73089571D01*
X78387616Y-73401108D01*
X78368282Y-73722595D01*
X74192665Y-73722595D01*
X74339727Y-73661680D01*
X74574759Y-73504637D01*
X74774637Y-73304759D01*
X74931680Y-73069727D01*
X75039853Y-72808574D01*
X75095000Y-72531335D01*
X75095000Y-72248665D01*
X75039853Y-71971426D01*
X74931680Y-71710273D01*
X74774637Y-71475241D01*
X74574759Y-71275363D01*
X74340872Y-71119085D01*
X74401514Y-71086671D01*
X74473097Y-70842702D01*
X73660000Y-70029605D01*
X72846903Y-70842702D01*
X72918486Y-71086671D01*
X72982992Y-71117194D01*
X72980273Y-71118320D01*
X72745241Y-71275363D01*
X72545363Y-71475241D01*
X72388320Y-71710273D01*
X72280147Y-71971426D01*
X72225000Y-72248665D01*
X69290000Y-72248665D01*
X69290000Y-69920512D01*
X72219783Y-69920512D01*
X72261213Y-70200130D01*
X72356397Y-70466292D01*
X72423329Y-70591514D01*
X72667298Y-70663097D01*
X73480395Y-69850000D01*
X72667298Y-69036903D01*
X72423329Y-69108486D01*
X72302429Y-69363996D01*
X72233700Y-69638184D01*
X72219783Y-69920512D01*
X69290000Y-69920512D01*
X69290000Y-63507632D01*
X69309999Y-63532001D01*
X69339002Y-63555803D01*
X69794200Y-64011002D01*
X69817999Y-64040001D01*
X69933724Y-64134974D01*
X70065753Y-64205546D01*
X70209014Y-64249003D01*
X70320667Y-64260000D01*
X70320676Y-64260000D01*
X70357999Y-64263676D01*
X70395322Y-64260000D01*
X72318017Y-64260000D01*
X72280147Y-64351426D01*
X72225000Y-64628665D01*
X72225000Y-64911335D01*
X72280147Y-65188574D01*
X72388320Y-65449727D01*
X72545363Y-65684759D01*
X72745241Y-65884637D01*
X72977759Y-66040000D01*
X72745241Y-66195363D01*
X72545363Y-66395241D01*
X72388320Y-66630273D01*
X72280147Y-66891426D01*
X72225000Y-67168665D01*
X72225000Y-67451335D01*
X72280147Y-67728574D01*
X72388320Y-67989727D01*
X72545363Y-68224759D01*
X72745241Y-68424637D01*
X72979128Y-68580915D01*
X72918486Y-68613329D01*
X72846903Y-68857298D01*
X73660000Y-69670395D01*
X74473097Y-68857298D01*
X74401514Y-68613329D01*
X74337008Y-68582806D01*
X74339727Y-68581680D01*
X74574759Y-68424637D01*
X74774637Y-68224759D01*
X74931680Y-67989727D01*
X75039853Y-67728574D01*
X75095000Y-67451335D01*
X75095000Y-67168665D01*
X75039853Y-66891426D01*
X74931680Y-66630273D01*
X74774637Y-66395241D01*
X74574759Y-66195363D01*
X74342241Y-66040000D01*
X74574759Y-65884637D01*
X74774637Y-65684759D01*
X74827930Y-65605000D01*
X75092132Y-65605000D01*
X75365000Y-65877868D01*
X75365001Y-68442143D01*
X75158073Y-68580408D01*
X74930408Y-68808073D01*
X74757051Y-69067520D01*
X74652702Y-69036903D01*
X73839605Y-69850000D01*
X74652702Y-70663097D01*
X74757051Y-70632480D01*
X74930408Y-70891927D01*
X75158073Y-71119592D01*
X75425778Y-71298467D01*
X75723237Y-71421678D01*
X76039017Y-71484490D01*
X76360983Y-71484490D01*
X76676763Y-71421678D01*
X76974222Y-71298467D01*
X77241927Y-71119592D01*
X77469592Y-70891927D01*
X77607856Y-70685000D01*
X79206982Y-70685000D01*
X79248000Y-70689040D01*
X79289018Y-70685000D01*
X79289019Y-70685000D01*
X79411689Y-70672918D01*
X79569087Y-70625172D01*
X79714146Y-70547636D01*
X79841291Y-70443291D01*
X79867446Y-70411421D01*
X81721671Y-68557198D01*
X81828218Y-68486005D01*
X81948005Y-68366218D01*
X82042122Y-68225363D01*
X82106951Y-68068853D01*
X82140000Y-67902703D01*
X82140000Y-67733297D01*
X82106951Y-67567147D01*
X82042122Y-67410637D01*
X82021993Y-67380512D01*
X87459783Y-67380512D01*
X87501213Y-67660130D01*
X87596397Y-67926292D01*
X87663329Y-68051514D01*
X87907298Y-68123097D01*
X88720395Y-67310000D01*
X89079605Y-67310000D01*
X89892702Y-68123097D01*
X90136671Y-68051514D01*
X90257571Y-67796004D01*
X90326300Y-67521816D01*
X90340217Y-67239488D01*
X90298787Y-66959870D01*
X90203603Y-66693708D01*
X90136671Y-66568486D01*
X89892702Y-66496903D01*
X89079605Y-67310000D01*
X88720395Y-67310000D01*
X87907298Y-66496903D01*
X87663329Y-66568486D01*
X87542429Y-66823996D01*
X87473700Y-67098184D01*
X87459783Y-67380512D01*
X82021993Y-67380512D01*
X81948005Y-67269782D01*
X81828218Y-67149995D01*
X81687363Y-67055878D01*
X81530853Y-66991049D01*
X81364703Y-66958000D01*
X81195297Y-66958000D01*
X81029147Y-66991049D01*
X80872637Y-67055878D01*
X80731782Y-67149995D01*
X80611995Y-67269782D01*
X80540802Y-67376329D01*
X78902133Y-69015000D01*
X77607856Y-69015000D01*
X77469592Y-68808073D01*
X77241927Y-68580408D01*
X77035000Y-68442144D01*
X77035000Y-65762702D01*
X88086903Y-65762702D01*
X88158486Y-66006671D01*
X88224636Y-66037971D01*
X88158486Y-66073329D01*
X88086903Y-66317298D01*
X88900000Y-67130395D01*
X89713097Y-66317298D01*
X89641514Y-66073329D01*
X89575364Y-66042029D01*
X89641514Y-66006671D01*
X89713097Y-65762702D01*
X88900000Y-64949605D01*
X88086903Y-65762702D01*
X77035000Y-65762702D01*
X77035000Y-65573018D01*
X77039040Y-65532000D01*
X77022918Y-65368312D01*
X76995560Y-65278122D01*
X76975172Y-65210913D01*
X76897636Y-65065854D01*
X76831433Y-64985185D01*
X76819439Y-64970570D01*
X76819437Y-64970568D01*
X76793291Y-64938709D01*
X76761433Y-64912564D01*
X76689381Y-64840512D01*
X87459783Y-64840512D01*
X87501213Y-65120130D01*
X87596397Y-65386292D01*
X87663329Y-65511514D01*
X87907298Y-65583097D01*
X88720395Y-64770000D01*
X89079605Y-64770000D01*
X89892702Y-65583097D01*
X90136671Y-65511514D01*
X90257571Y-65256004D01*
X90326300Y-64981816D01*
X90340217Y-64699488D01*
X90298787Y-64419870D01*
X90203603Y-64153708D01*
X90136671Y-64028486D01*
X89892702Y-63956903D01*
X89079605Y-64770000D01*
X88720395Y-64770000D01*
X87907298Y-63956903D01*
X87663329Y-64028486D01*
X87542429Y-64283996D01*
X87473700Y-64558184D01*
X87459783Y-64840512D01*
X76689381Y-64840512D01*
X76378062Y-64529194D01*
X76454122Y-64415363D01*
X76518951Y-64258853D01*
X76552000Y-64092703D01*
X76552000Y-63923297D01*
X76518951Y-63757147D01*
X76454122Y-63600637D01*
X76360005Y-63459782D01*
X76240218Y-63339995D01*
X76099363Y-63245878D01*
X75942853Y-63181049D01*
X75939105Y-63180303D01*
X75748801Y-62990000D01*
X85306678Y-62990000D01*
X85344000Y-62993676D01*
X85381322Y-62990000D01*
X85381333Y-62990000D01*
X85492986Y-62979003D01*
X85636247Y-62935546D01*
X85768276Y-62864974D01*
X85884001Y-62770001D01*
X85907804Y-62740997D01*
X86928802Y-61720000D01*
X87558017Y-61720000D01*
X87520147Y-61811426D01*
X87465000Y-62088665D01*
X87465000Y-62371335D01*
X87520147Y-62648574D01*
X87628320Y-62909727D01*
X87785363Y-63144759D01*
X87985241Y-63344637D01*
X88219128Y-63500915D01*
X88158486Y-63533329D01*
X88086903Y-63777298D01*
X88900000Y-64590395D01*
X89713097Y-63777298D01*
X89641514Y-63533329D01*
X89577008Y-63502806D01*
X89579727Y-63501680D01*
X89814759Y-63344637D01*
X90014637Y-63144759D01*
X90118043Y-62990000D01*
X91562652Y-62990000D01*
X91534454Y-63042754D01*
X91507404Y-63131928D01*
X91090000Y-63131928D01*
X90965518Y-63144188D01*
X90845820Y-63180498D01*
X90735506Y-63239463D01*
X90638815Y-63318815D01*
X90559463Y-63415506D01*
X90500498Y-63525820D01*
X90464188Y-63645518D01*
X90451928Y-63770000D01*
X90451928Y-65770000D01*
X90464188Y-65894482D01*
X90500498Y-66014180D01*
X90559463Y-66124494D01*
X90638815Y-66221185D01*
X90735506Y-66300537D01*
X90845820Y-66359502D01*
X90965518Y-66395812D01*
X91090000Y-66408072D01*
X93390000Y-66408072D01*
X93474001Y-66399799D01*
X93474001Y-66764658D01*
X93474000Y-66764668D01*
X93474000Y-67272678D01*
X93470324Y-67310000D01*
X93474000Y-67347322D01*
X93474000Y-67347333D01*
X93484997Y-67458986D01*
X93528454Y-67602247D01*
X93599026Y-67734276D01*
X93693999Y-67850001D01*
X93723001Y-67873802D01*
X94178200Y-68329002D01*
X94201999Y-68358001D01*
X94317724Y-68452974D01*
X94449753Y-68523546D01*
X94593014Y-68567003D01*
X94704667Y-68578000D01*
X94704676Y-68578000D01*
X94741999Y-68581676D01*
X94779322Y-68578000D01*
X95093461Y-68578000D01*
X95096637Y-68580122D01*
X95253147Y-68644951D01*
X95419297Y-68678000D01*
X95588703Y-68678000D01*
X95754853Y-68644951D01*
X95911363Y-68580122D01*
X96052218Y-68486005D01*
X96172005Y-68366218D01*
X96266122Y-68225363D01*
X96330951Y-68068853D01*
X96364000Y-67902703D01*
X96364000Y-67733297D01*
X96330951Y-67567147D01*
X96266122Y-67410637D01*
X96172005Y-67269782D01*
X96052218Y-67149995D01*
X95911363Y-67055878D01*
X95754853Y-66991049D01*
X95588703Y-66958000D01*
X95419297Y-66958000D01*
X95253147Y-66991049D01*
X95096637Y-67055878D01*
X95093461Y-67058000D01*
X95056802Y-67058000D01*
X94994000Y-66995199D01*
X94994000Y-64156829D01*
X94995878Y-64161363D01*
X95089995Y-64302218D01*
X95209782Y-64422005D01*
X95350637Y-64516122D01*
X95507147Y-64580951D01*
X95510895Y-64581697D01*
X96210201Y-65281003D01*
X96233999Y-65310001D01*
X96262997Y-65333799D01*
X96349723Y-65404974D01*
X96401928Y-65432878D01*
X96401928Y-65770000D01*
X96414188Y-65894482D01*
X96450498Y-66014180D01*
X96509463Y-66124494D01*
X96588815Y-66221185D01*
X96685506Y-66300537D01*
X96795820Y-66359502D01*
X96915518Y-66395812D01*
X97040000Y-66408072D01*
X99340000Y-66408072D01*
X99464482Y-66395812D01*
X99584180Y-66359502D01*
X99694494Y-66300537D01*
X99791185Y-66221185D01*
X99870537Y-66124494D01*
X99929502Y-66014180D01*
X99965812Y-65894482D01*
X99978072Y-65770000D01*
X99978072Y-64137573D01*
X100644192Y-64137573D01*
X100739956Y-64401974D01*
X101029571Y-64542864D01*
X101341108Y-64624544D01*
X101662595Y-64643878D01*
X101981675Y-64600121D01*
X102286088Y-64494955D01*
X102460044Y-64401974D01*
X102555808Y-64137573D01*
X101600000Y-63181765D01*
X100644192Y-64137573D01*
X99978072Y-64137573D01*
X99978072Y-63770000D01*
X99965812Y-63645518D01*
X99929502Y-63525820D01*
X99870537Y-63415506D01*
X99791185Y-63318815D01*
X99694494Y-63239463D01*
X99584180Y-63180498D01*
X99464482Y-63144188D01*
X99340000Y-63131928D01*
X98940570Y-63131928D01*
X98939003Y-63116014D01*
X98923455Y-63064755D01*
X99958282Y-63064755D01*
X100002039Y-63383835D01*
X100107205Y-63688248D01*
X100200186Y-63862204D01*
X100464587Y-63957968D01*
X101420395Y-63002160D01*
X101779605Y-63002160D01*
X102735413Y-63957968D01*
X102999814Y-63862204D01*
X103140704Y-63572589D01*
X103222384Y-63261052D01*
X103241718Y-62939565D01*
X103197961Y-62620485D01*
X103092795Y-62316072D01*
X102999814Y-62142116D01*
X102735413Y-62046352D01*
X101779605Y-63002160D01*
X101420395Y-63002160D01*
X100464587Y-62046352D01*
X100200186Y-62142116D01*
X100059296Y-62431731D01*
X99977616Y-62743268D01*
X99958282Y-63064755D01*
X98923455Y-63064755D01*
X98895546Y-62972753D01*
X98883225Y-62949703D01*
X98824974Y-62840723D01*
X98753799Y-62753997D01*
X98730001Y-62724999D01*
X98701004Y-62701202D01*
X97866549Y-61866747D01*
X100644192Y-61866747D01*
X101600000Y-62822555D01*
X102555808Y-61866747D01*
X102460044Y-61602346D01*
X102170429Y-61461456D01*
X101858892Y-61379776D01*
X101537405Y-61360442D01*
X101218325Y-61404199D01*
X100913912Y-61509365D01*
X100739956Y-61602346D01*
X100644192Y-61866747D01*
X97866549Y-61866747D01*
X97719801Y-61720000D01*
X98006678Y-61720000D01*
X98044000Y-61723676D01*
X98081322Y-61720000D01*
X98081333Y-61720000D01*
X98192986Y-61709003D01*
X98336247Y-61665546D01*
X98468276Y-61594974D01*
X98584001Y-61500001D01*
X98607804Y-61470997D01*
X99628802Y-60450000D01*
X106731957Y-60450000D01*
X106835363Y-60604759D01*
G37*
X106835363Y-60604759D02*
X107033961Y-60803357D01*
X107025518Y-60804188D01*
X106905820Y-60840498D01*
X106795506Y-60899463D01*
X106698815Y-60978815D01*
X106619463Y-61075506D01*
X106560498Y-61185820D01*
X106524188Y-61305518D01*
X106511928Y-61430000D01*
X106511928Y-62635888D01*
X106492082Y-62701312D01*
X106475960Y-62865000D01*
X106480000Y-62906019D01*
X106480000Y-63268602D01*
X106444494Y-63239463D01*
X106334180Y-63180498D01*
X106214482Y-63144188D01*
X106090000Y-63131928D01*
X103790000Y-63131928D01*
X103665518Y-63144188D01*
X103545820Y-63180498D01*
X103435506Y-63239463D01*
X103338815Y-63318815D01*
X103259463Y-63415506D01*
X103200498Y-63525820D01*
X103164188Y-63645518D01*
X103151928Y-63770000D01*
X103151928Y-65770000D01*
X103164188Y-65894482D01*
X103200498Y-66014180D01*
X103259463Y-66124494D01*
X103338815Y-66221185D01*
X103435506Y-66300537D01*
X103545820Y-66359502D01*
X103665518Y-66395812D01*
X103790000Y-66408072D01*
X104207404Y-66408072D01*
X104234454Y-66497246D01*
X104305026Y-66629276D01*
X104362474Y-66699276D01*
X104400000Y-66745001D01*
X104428998Y-66768799D01*
X104582303Y-66922105D01*
X104583049Y-66925853D01*
X104647878Y-67082363D01*
X104741995Y-67223218D01*
X104861782Y-67343005D01*
X105002637Y-67437122D01*
X105159147Y-67501951D01*
X105325297Y-67535000D01*
X105494703Y-67535000D01*
X105660853Y-67501951D01*
X105817363Y-67437122D01*
X105958218Y-67343005D01*
X106078005Y-67223218D01*
X106172122Y-67082363D01*
X106236951Y-66925853D01*
X106270000Y-66759703D01*
X106270000Y-66590297D01*
X106236951Y-66424147D01*
X106224016Y-66392920D01*
X106334180Y-66359502D01*
X106444494Y-66300537D01*
X106480001Y-66271398D01*
X106480001Y-67903972D01*
X106475960Y-67945000D01*
X106492082Y-68108688D01*
X106539828Y-68266086D01*
X106616636Y-68409783D01*
X106617365Y-68411146D01*
X106721710Y-68538291D01*
X106753574Y-68564441D01*
X109235559Y-71046427D01*
X109261709Y-71078291D01*
X109388854Y-71182636D01*
X109407089Y-71192383D01*
X109396815Y-71200815D01*
X109317463Y-71297506D01*
X109258498Y-71407820D01*
X109222188Y-71527518D01*
X109209928Y-71652000D01*
X109209928Y-72317000D01*
X106690072Y-72317000D01*
X106690072Y-71652000D01*
X106677812Y-71527518D01*
X106641502Y-71407820D01*
X106582537Y-71297506D01*
X106503185Y-71200815D01*
X106406494Y-71121463D01*
X106296180Y-71062498D01*
X106176482Y-71026188D01*
X106052000Y-71013928D01*
X103752000Y-71013928D01*
X103627518Y-71026188D01*
X103507820Y-71062498D01*
X103397506Y-71121463D01*
X103300815Y-71200815D01*
X103221463Y-71297506D01*
X103162498Y-71407820D01*
X103126188Y-71527518D01*
X103113928Y-71652000D01*
X103113928Y-72317000D01*
X100086072Y-72317000D01*
X100086072Y-71652000D01*
X100073812Y-71527518D01*
X100037502Y-71407820D01*
X99978537Y-71297506D01*
X99899185Y-71200815D01*
X99802494Y-71121463D01*
X99692180Y-71062498D01*
X99572482Y-71026188D01*
X99448000Y-71013928D01*
X97148000Y-71013928D01*
X97023518Y-71026188D01*
X96903820Y-71062498D01*
X96793506Y-71121463D01*
X96696815Y-71200815D01*
X96617463Y-71297506D01*
X96558498Y-71407820D01*
X96522188Y-71527518D01*
X96509928Y-71652000D01*
X96509928Y-72317000D01*
X93990072Y-72317000D01*
X93990072Y-71652000D01*
X93977812Y-71527518D01*
X93941502Y-71407820D01*
X93882537Y-71297506D01*
X93803185Y-71200815D01*
X93706494Y-71121463D01*
X93596180Y-71062498D01*
X93476482Y-71026188D01*
X93352000Y-71013928D01*
X91052000Y-71013928D01*
X90927518Y-71026188D01*
X90807820Y-71062498D01*
X90697506Y-71121463D01*
X90600815Y-71200815D01*
X90521463Y-71297506D01*
X90462498Y-71407820D01*
X90426188Y-71527518D01*
X90413928Y-71652000D01*
X90413928Y-72870204D01*
X90338072Y-72946060D01*
X90338072Y-71590000D01*
X90325812Y-71465518D01*
X90289502Y-71345820D01*
X90230537Y-71235506D01*
X90151185Y-71138815D01*
X90054494Y-71059463D01*
X89944180Y-71000498D01*
X89824482Y-70964188D01*
X89816039Y-70963357D01*
X90014637Y-70764759D01*
X90171680Y-70529727D01*
X90208511Y-70440807D01*
X99965000Y-70440807D01*
X99965000Y-70762873D01*
X100027832Y-71078752D01*
X100151082Y-71376303D01*
X100330013Y-71644092D01*
X100557748Y-71871827D01*
X100825537Y-72050758D01*
X101123088Y-72174008D01*
X101438967Y-72236840D01*
X101761033Y-72236840D01*
X102076912Y-72174008D01*
X102374463Y-72050758D01*
X102642252Y-71871827D01*
X102869987Y-71644092D01*
X103048918Y-71376303D01*
X103172168Y-71078752D01*
X103235000Y-70762873D01*
X103235000Y-70440807D01*
X103172168Y-70124928D01*
X103048918Y-69827377D01*
X102869987Y-69559588D01*
X102642252Y-69331853D01*
X102374463Y-69152922D01*
X102076912Y-69029672D01*
X101761033Y-68966840D01*
X101438967Y-68966840D01*
X101123088Y-69029672D01*
X100825537Y-69152922D01*
X100557748Y-69331853D01*
X100330013Y-69559588D01*
X100151082Y-69827377D01*
X100027832Y-70124928D01*
X99965000Y-70440807D01*
X90208511Y-70440807D01*
X90279853Y-70268574D01*
X90335000Y-69991335D01*
X90335000Y-69708665D01*
X90279853Y-69431426D01*
X90171680Y-69170273D01*
X90014637Y-68935241D01*
X89814759Y-68735363D01*
X89785407Y-68715750D01*
X91590000Y-68715750D01*
X91590000Y-68944250D01*
X91634578Y-69168360D01*
X91722021Y-69379466D01*
X91848969Y-69569457D01*
X92010543Y-69731031D01*
X92200534Y-69857979D01*
X92411640Y-69945422D01*
X92635750Y-69990000D01*
X92864250Y-69990000D01*
X93088360Y-69945422D01*
X93299466Y-69857979D01*
X93489457Y-69731031D01*
X93651031Y-69569457D01*
X93777979Y-69379466D01*
X93865422Y-69168360D01*
X93910000Y-68944250D01*
X93910000Y-68715750D01*
X96590000Y-68715750D01*
X96590000Y-68944250D01*
X96634578Y-69168360D01*
X96722021Y-69379466D01*
X96848969Y-69569457D01*
X97010543Y-69731031D01*
X97200534Y-69857979D01*
X97411640Y-69945422D01*
X97635750Y-69990000D01*
X97864250Y-69990000D01*
X98088360Y-69945422D01*
X98299466Y-69857979D01*
X98489457Y-69731031D01*
X98651031Y-69569457D01*
X98777979Y-69379466D01*
X98865422Y-69168360D01*
X98910000Y-68944250D01*
X98910000Y-68715750D01*
X104290000Y-68715750D01*
X104290000Y-68944250D01*
X104334578Y-69168360D01*
X104422021Y-69379466D01*
X104548969Y-69569457D01*
X104710543Y-69731031D01*
X104900534Y-69857979D01*
X105111640Y-69945422D01*
X105335750Y-69990000D01*
X105564250Y-69990000D01*
X105788360Y-69945422D01*
X105999466Y-69857979D01*
X106189457Y-69731031D01*
X106351031Y-69569457D01*
X106477979Y-69379466D01*
X106565422Y-69168360D01*
X106610000Y-68944250D01*
X106610000Y-68715750D01*
X106565422Y-68491640D01*
X106477979Y-68280534D01*
X106351031Y-68090543D01*
X106189457Y-67928969D01*
X105999466Y-67802021D01*
X105788360Y-67714578D01*
X105564250Y-67670000D01*
X105335750Y-67670000D01*
X105111640Y-67714578D01*
X104900534Y-67802021D01*
X104710543Y-67928969D01*
X104548969Y-68090543D01*
X104422021Y-68280534D01*
X104334578Y-68491640D01*
X104290000Y-68715750D01*
X98910000Y-68715750D01*
X98865422Y-68491640D01*
X98777979Y-68280534D01*
X98651031Y-68090543D01*
X98489457Y-67928969D01*
X98299466Y-67802021D01*
X98088360Y-67714578D01*
X97864250Y-67670000D01*
X97635750Y-67670000D01*
X97411640Y-67714578D01*
X97200534Y-67802021D01*
X97010543Y-67928969D01*
X96848969Y-68090543D01*
X96722021Y-68280534D01*
X96634578Y-68491640D01*
X96590000Y-68715750D01*
X93910000Y-68715750D01*
X93865422Y-68491640D01*
X93777979Y-68280534D01*
X93651031Y-68090543D01*
X93489457Y-67928969D01*
X93299466Y-67802021D01*
X93088360Y-67714578D01*
X92864250Y-67670000D01*
X92635750Y-67670000D01*
X92411640Y-67714578D01*
X92200534Y-67802021D01*
X92010543Y-67928969D01*
X91848969Y-68090543D01*
X91722021Y-68280534D01*
X91634578Y-68491640D01*
X91590000Y-68715750D01*
X89785407Y-68715750D01*
X89580872Y-68579085D01*
X89641514Y-68546671D01*
X89713097Y-68302702D01*
X88900000Y-67489605D01*
X88086903Y-68302702D01*
X88158486Y-68546671D01*
X88222992Y-68577194D01*
X88220273Y-68578320D01*
X87985241Y-68735363D01*
X87785363Y-68935241D01*
X87749963Y-68988221D01*
X87629592Y-68808073D01*
X87401927Y-68580408D01*
X87134222Y-68401533D01*
X86836763Y-68278322D01*
X86520983Y-68215510D01*
X86199017Y-68215510D01*
X85883237Y-68278322D01*
X85585778Y-68401533D01*
X85318073Y-68580408D01*
X85090408Y-68808073D01*
X84911533Y-69075778D01*
X84788322Y-69373237D01*
X84725510Y-69689017D01*
X84725510Y-70010983D01*
X84788322Y-70326763D01*
X84911533Y-70624222D01*
X85090408Y-70891927D01*
X85318073Y-71119592D01*
X85450872Y-71208326D01*
X84163679Y-72495520D01*
X84139502Y-72415820D01*
X84080537Y-72305506D01*
X84001185Y-72208815D01*
X83904494Y-72129463D01*
X83794180Y-72070498D01*
X83674482Y-72034188D01*
X83550000Y-72021928D01*
X81550000Y-72021928D01*
X81425518Y-72034188D01*
X81305820Y-72070498D01*
X81195506Y-72129463D01*
X81098815Y-72208815D01*
X81019463Y-72305506D01*
X80960498Y-72415820D01*
X80944963Y-72467033D01*
X80870044Y-72260186D01*
X80580429Y-72119296D01*
X80268892Y-72037616D01*
X79947405Y-72018282D01*
X79628325Y-72062039D01*
X79323912Y-72167205D01*
X79149956Y-72260186D01*
X79054192Y-72524587D01*
X80010000Y-73480395D01*
X80024143Y-73466253D01*
X80203748Y-73645858D01*
X80189605Y-73660000D01*
X80203748Y-73674143D01*
X80024143Y-73853748D01*
X80010000Y-73839605D01*
X79054192Y-74795413D01*
X79149956Y-75059814D01*
X79439571Y-75200704D01*
X79751108Y-75282384D01*
X80072595Y-75301718D01*
X80391675Y-75257961D01*
X80696088Y-75152795D01*
X80870044Y-75059814D01*
X80944963Y-74852967D01*
X80960498Y-74904180D01*
X81019463Y-75014494D01*
X81098815Y-75111185D01*
X81195506Y-75190537D01*
X81305820Y-75249502D01*
X81425518Y-75285812D01*
X81550000Y-75298072D01*
X83550000Y-75298072D01*
X83674482Y-75285812D01*
X83794180Y-75249502D01*
X83904494Y-75190537D01*
X84001185Y-75111185D01*
X84080537Y-75014494D01*
X84139502Y-74904180D01*
X84175812Y-74784482D01*
X84188072Y-74660000D01*
X84188072Y-74412442D01*
X84222986Y-74409003D01*
X84366247Y-74365546D01*
X84498276Y-74294974D01*
X84614001Y-74200001D01*
X84637804Y-74170997D01*
X86871004Y-71937798D01*
X86900001Y-71914001D01*
X86994974Y-71798276D01*
X87065546Y-71666247D01*
X87109003Y-71522986D01*
X87120000Y-71411333D01*
X87120000Y-71411324D01*
X87123676Y-71374001D01*
X87120000Y-71336678D01*
X87120000Y-71304358D01*
X87134222Y-71298467D01*
X87401927Y-71119592D01*
X87629592Y-70891927D01*
X87749963Y-70711779D01*
X87785363Y-70764759D01*
X87983961Y-70963357D01*
X87975518Y-70964188D01*
X87855820Y-71000498D01*
X87745506Y-71059463D01*
X87648815Y-71138815D01*
X87569463Y-71235506D01*
X87510498Y-71345820D01*
X87474188Y-71465518D01*
X87461928Y-71590000D01*
X87461928Y-73190000D01*
X87474188Y-73314482D01*
X87510498Y-73434180D01*
X87514238Y-73441178D01*
X87379147Y-73468049D01*
X87222637Y-73532878D01*
X87081782Y-73626995D01*
X86961995Y-73746782D01*
X86867878Y-73887637D01*
X86803049Y-74044147D01*
X86770000Y-74210297D01*
X86770000Y-74379703D01*
X86803049Y-74545853D01*
X86867878Y-74702363D01*
X86961995Y-74843218D01*
X87081782Y-74963005D01*
X87222637Y-75057122D01*
X87379147Y-75121951D01*
X87545297Y-75155000D01*
X87714703Y-75155000D01*
X87840388Y-75130000D01*
X90128982Y-75130000D01*
X90170000Y-75134040D01*
X90211018Y-75130000D01*
X90211019Y-75130000D01*
X90333689Y-75117918D01*
X90491087Y-75070172D01*
X90548526Y-75039470D01*
X90600815Y-75103185D01*
X90697506Y-75182537D01*
X90807820Y-75241502D01*
X90927518Y-75277812D01*
X91052000Y-75290072D01*
X93352000Y-75290072D01*
X93476482Y-75277812D01*
X93596180Y-75241502D01*
X93706494Y-75182537D01*
X93803185Y-75103185D01*
X93882537Y-75006494D01*
X93941502Y-74896180D01*
X93977812Y-74776482D01*
X93990072Y-74652000D01*
X93990072Y-73987000D01*
X96509928Y-73987000D01*
X96509928Y-74652000D01*
X96522188Y-74776482D01*
X96558498Y-74896180D01*
X96617463Y-75006494D01*
X96696815Y-75103185D01*
X96793506Y-75182537D01*
X96903820Y-75241502D01*
X97023518Y-75277812D01*
X97148000Y-75290072D01*
X99448000Y-75290072D01*
X99572482Y-75277812D01*
X99692180Y-75241502D01*
X99802494Y-75182537D01*
X99899185Y-75103185D01*
X99978537Y-75006494D01*
X100037502Y-74896180D01*
X100073812Y-74776482D01*
X100086072Y-74652000D01*
X100086072Y-73987000D01*
X103113928Y-73987000D01*
X103113928Y-74652000D01*
X103126188Y-74776482D01*
X103162498Y-74896180D01*
X103221463Y-75006494D01*
X103300815Y-75103185D01*
X103397506Y-75182537D01*
X103507820Y-75241502D01*
X103627518Y-75277812D01*
X103752000Y-75290072D01*
X106052000Y-75290072D01*
X106176482Y-75277812D01*
X106296180Y-75241502D01*
X106406494Y-75182537D01*
X106503185Y-75103185D01*
X106582537Y-75006494D01*
X106641502Y-74896180D01*
X106677812Y-74776482D01*
X106690072Y-74652000D01*
X106690072Y-73987000D01*
X109209928Y-73987000D01*
X109209928Y-74652000D01*
X109222188Y-74776482D01*
X109258498Y-74896180D01*
X109317463Y-75006494D01*
X109396815Y-75103185D01*
X109493506Y-75182537D01*
X109603820Y-75241502D01*
X109723518Y-75277812D01*
X109848000Y-75290072D01*
X112148000Y-75290072D01*
X112272482Y-75277812D01*
X112392180Y-75241502D01*
X112502494Y-75182537D01*
X112599185Y-75103185D01*
X112678537Y-75006494D01*
X112737502Y-74896180D01*
X112773812Y-74776482D01*
X112786072Y-74652000D01*
X112786072Y-71652000D01*
X112773812Y-71527518D01*
X112737502Y-71407820D01*
X112678537Y-71297506D01*
X112599185Y-71200815D01*
X112502494Y-71121463D01*
X112392180Y-71062498D01*
X112272482Y-71026188D01*
X112148000Y-71013928D01*
X111834978Y-71013928D01*
X111837039Y-70992999D01*
X111833000Y-70951991D01*
X111833000Y-70951981D01*
X111820918Y-70829311D01*
X111773172Y-70671913D01*
X111695636Y-70526854D01*
X111591291Y-70399709D01*
X111559422Y-70373555D01*
X111109446Y-69923579D01*
X111083291Y-69891709D01*
X111023016Y-69842243D01*
X111189457Y-69731031D01*
X111351031Y-69569457D01*
X111477979Y-69379466D01*
X111565422Y-69168360D01*
X111610000Y-68944250D01*
X111610000Y-68715750D01*
X111565422Y-68491640D01*
X111477979Y-68280534D01*
X111351031Y-68090543D01*
X111189457Y-67928969D01*
X110999466Y-67802021D01*
X110788360Y-67714578D01*
X110564250Y-67670000D01*
X110335750Y-67670000D01*
X110111640Y-67714578D01*
X109900534Y-67802021D01*
X109710543Y-67928969D01*
X109548969Y-68090543D01*
X109422021Y-68280534D01*
X109334578Y-68491640D01*
X109290000Y-68715750D01*
X109290000Y-68739132D01*
X108150000Y-67599133D01*
X108150000Y-64811280D01*
X108207147Y-64834951D01*
X108210895Y-64835697D01*
X108656201Y-65281002D01*
X108679999Y-65310001D01*
X108795724Y-65404974D01*
X108927753Y-65475546D01*
X109071014Y-65519003D01*
X109101928Y-65522048D01*
X109101928Y-65770000D01*
X109114188Y-65894482D01*
X109150498Y-66014180D01*
X109202434Y-66111343D01*
X109186995Y-66126782D01*
X109092878Y-66267637D01*
X109028049Y-66424147D01*
X108995000Y-66590297D01*
X108995000Y-66759703D01*
X109028049Y-66925853D01*
X109092878Y-67082363D01*
X109186995Y-67223218D01*
X109306782Y-67343005D01*
X109447637Y-67437122D01*
X109604147Y-67501951D01*
X109770297Y-67535000D01*
X109939703Y-67535000D01*
X110105853Y-67501951D01*
X110262363Y-67437122D01*
X110265539Y-67435000D01*
X110452678Y-67435000D01*
X110490000Y-67438676D01*
X110527322Y-67435000D01*
X110527333Y-67435000D01*
X110638986Y-67424003D01*
X110782247Y-67380546D01*
X110914276Y-67309974D01*
X111030001Y-67215001D01*
X111053803Y-67185998D01*
X111401003Y-66838799D01*
X111430001Y-66815001D01*
X111524974Y-66699276D01*
X111595546Y-66567247D01*
X111639003Y-66423986D01*
X111640570Y-66408072D01*
X112040000Y-66408072D01*
X112164482Y-66395812D01*
X112284180Y-66359502D01*
X112394494Y-66300537D01*
X112491185Y-66221185D01*
X112499081Y-66211564D01*
X112622637Y-66294122D01*
X112779147Y-66358951D01*
X112945297Y-66392000D01*
X113114703Y-66392000D01*
X113280853Y-66358951D01*
X113437363Y-66294122D01*
X113440539Y-66292000D01*
X115532678Y-66292000D01*
X115570000Y-66295676D01*
X115607322Y-66292000D01*
X115607333Y-66292000D01*
X115718986Y-66281003D01*
X115862247Y-66237546D01*
X115994276Y-66166974D01*
X116110001Y-66072001D01*
X116130000Y-66047632D01*
X116130000Y-75490000D01*
X69290000Y-75490000D01*
X69290000Y-72248665D01*
X72225000Y-72248665D01*
X72225000Y-72531335D01*
X72280147Y-72808574D01*
X72388320Y-73069727D01*
X72545363Y-73304759D01*
X72745241Y-73504637D01*
X72980273Y-73661680D01*
X73241426Y-73769853D01*
X73518665Y-73825000D01*
X73801335Y-73825000D01*
X74078574Y-73769853D01*
X74192665Y-73722595D01*
X78368282Y-73722595D01*
X78412039Y-74041675D01*
X78517205Y-74346088D01*
X78610186Y-74520044D01*
X78874587Y-74615808D01*
X79830395Y-73660000D01*
X78874587Y-72704192D01*
X78610186Y-72799956D01*
X78469296Y-73089571D01*
X78387616Y-73401108D01*
X78368282Y-73722595D01*
X74192665Y-73722595D01*
X74339727Y-73661680D01*
X74574759Y-73504637D01*
X74774637Y-73304759D01*
X74931680Y-73069727D01*
X75039853Y-72808574D01*
X75095000Y-72531335D01*
X75095000Y-72248665D01*
X75039853Y-71971426D01*
X74931680Y-71710273D01*
X74774637Y-71475241D01*
X74574759Y-71275363D01*
X74340872Y-71119085D01*
X74401514Y-71086671D01*
X74473097Y-70842702D01*
X73660000Y-70029605D01*
X72846903Y-70842702D01*
X72918486Y-71086671D01*
X72982992Y-71117194D01*
X72980273Y-71118320D01*
X72745241Y-71275363D01*
X72545363Y-71475241D01*
X72388320Y-71710273D01*
X72280147Y-71971426D01*
X72225000Y-72248665D01*
X69290000Y-72248665D01*
X69290000Y-69920512D01*
X72219783Y-69920512D01*
X72261213Y-70200130D01*
X72356397Y-70466292D01*
X72423329Y-70591514D01*
X72667298Y-70663097D01*
X73480395Y-69850000D01*
X72667298Y-69036903D01*
X72423329Y-69108486D01*
X72302429Y-69363996D01*
X72233700Y-69638184D01*
X72219783Y-69920512D01*
X69290000Y-69920512D01*
X69290000Y-63507632D01*
X69309999Y-63532001D01*
X69339002Y-63555803D01*
X69794200Y-64011002D01*
X69817999Y-64040001D01*
X69933724Y-64134974D01*
X70065753Y-64205546D01*
X70209014Y-64249003D01*
X70320667Y-64260000D01*
X70320676Y-64260000D01*
X70357999Y-64263676D01*
X70395322Y-64260000D01*
X72318017Y-64260000D01*
X72280147Y-64351426D01*
X72225000Y-64628665D01*
X72225000Y-64911335D01*
X72280147Y-65188574D01*
X72388320Y-65449727D01*
X72545363Y-65684759D01*
X72745241Y-65884637D01*
X72977759Y-66040000D01*
X72745241Y-66195363D01*
X72545363Y-66395241D01*
X72388320Y-66630273D01*
X72280147Y-66891426D01*
X72225000Y-67168665D01*
X72225000Y-67451335D01*
X72280147Y-67728574D01*
X72388320Y-67989727D01*
X72545363Y-68224759D01*
X72745241Y-68424637D01*
X72979128Y-68580915D01*
X72918486Y-68613329D01*
X72846903Y-68857298D01*
X73660000Y-69670395D01*
X74473097Y-68857298D01*
X74401514Y-68613329D01*
X74337008Y-68582806D01*
X74339727Y-68581680D01*
X74574759Y-68424637D01*
X74774637Y-68224759D01*
X74931680Y-67989727D01*
X75039853Y-67728574D01*
X75095000Y-67451335D01*
X75095000Y-67168665D01*
X75039853Y-66891426D01*
X74931680Y-66630273D01*
X74774637Y-66395241D01*
X74574759Y-66195363D01*
X74342241Y-66040000D01*
X74574759Y-65884637D01*
X74774637Y-65684759D01*
X74827930Y-65605000D01*
X75092132Y-65605000D01*
X75365000Y-65877868D01*
X75365001Y-68442143D01*
X75158073Y-68580408D01*
X74930408Y-68808073D01*
X74757051Y-69067520D01*
X74652702Y-69036903D01*
X73839605Y-69850000D01*
X74652702Y-70663097D01*
X74757051Y-70632480D01*
X74930408Y-70891927D01*
X75158073Y-71119592D01*
X75425778Y-71298467D01*
X75723237Y-71421678D01*
X76039017Y-71484490D01*
X76360983Y-71484490D01*
X76676763Y-71421678D01*
X76974222Y-71298467D01*
X77241927Y-71119592D01*
X77469592Y-70891927D01*
X77607856Y-70685000D01*
X79206982Y-70685000D01*
X79248000Y-70689040D01*
X79289018Y-70685000D01*
X79289019Y-70685000D01*
X79411689Y-70672918D01*
X79569087Y-70625172D01*
X79714146Y-70547636D01*
X79841291Y-70443291D01*
X79867446Y-70411421D01*
X81721671Y-68557198D01*
X81828218Y-68486005D01*
X81948005Y-68366218D01*
X82042122Y-68225363D01*
X82106951Y-68068853D01*
X82140000Y-67902703D01*
X82140000Y-67733297D01*
X82106951Y-67567147D01*
X82042122Y-67410637D01*
X82021993Y-67380512D01*
X87459783Y-67380512D01*
X87501213Y-67660130D01*
X87596397Y-67926292D01*
X87663329Y-68051514D01*
X87907298Y-68123097D01*
X88720395Y-67310000D01*
X89079605Y-67310000D01*
X89892702Y-68123097D01*
X90136671Y-68051514D01*
X90257571Y-67796004D01*
X90326300Y-67521816D01*
X90340217Y-67239488D01*
X90298787Y-66959870D01*
X90203603Y-66693708D01*
X90136671Y-66568486D01*
X89892702Y-66496903D01*
X89079605Y-67310000D01*
X88720395Y-67310000D01*
X87907298Y-66496903D01*
X87663329Y-66568486D01*
X87542429Y-66823996D01*
X87473700Y-67098184D01*
X87459783Y-67380512D01*
X82021993Y-67380512D01*
X81948005Y-67269782D01*
X81828218Y-67149995D01*
X81687363Y-67055878D01*
X81530853Y-66991049D01*
X81364703Y-66958000D01*
X81195297Y-66958000D01*
X81029147Y-66991049D01*
X80872637Y-67055878D01*
X80731782Y-67149995D01*
X80611995Y-67269782D01*
X80540802Y-67376329D01*
X78902133Y-69015000D01*
X77607856Y-69015000D01*
X77469592Y-68808073D01*
X77241927Y-68580408D01*
X77035000Y-68442144D01*
X77035000Y-65762702D01*
X88086903Y-65762702D01*
X88158486Y-66006671D01*
X88224636Y-66037971D01*
X88158486Y-66073329D01*
X88086903Y-66317298D01*
X88900000Y-67130395D01*
X89713097Y-66317298D01*
X89641514Y-66073329D01*
X89575364Y-66042029D01*
X89641514Y-66006671D01*
X89713097Y-65762702D01*
X88900000Y-64949605D01*
X88086903Y-65762702D01*
X77035000Y-65762702D01*
X77035000Y-65573018D01*
X77039040Y-65532000D01*
X77022918Y-65368312D01*
X76995560Y-65278122D01*
X76975172Y-65210913D01*
X76897636Y-65065854D01*
X76831433Y-64985185D01*
X76819439Y-64970570D01*
X76819437Y-64970568D01*
X76793291Y-64938709D01*
X76761433Y-64912564D01*
X76689381Y-64840512D01*
X87459783Y-64840512D01*
X87501213Y-65120130D01*
X87596397Y-65386292D01*
X87663329Y-65511514D01*
X87907298Y-65583097D01*
X88720395Y-64770000D01*
X89079605Y-64770000D01*
X89892702Y-65583097D01*
X90136671Y-65511514D01*
X90257571Y-65256004D01*
X90326300Y-64981816D01*
X90340217Y-64699488D01*
X90298787Y-64419870D01*
X90203603Y-64153708D01*
X90136671Y-64028486D01*
X89892702Y-63956903D01*
X89079605Y-64770000D01*
X88720395Y-64770000D01*
X87907298Y-63956903D01*
X87663329Y-64028486D01*
X87542429Y-64283996D01*
X87473700Y-64558184D01*
X87459783Y-64840512D01*
X76689381Y-64840512D01*
X76378062Y-64529194D01*
X76454122Y-64415363D01*
X76518951Y-64258853D01*
X76552000Y-64092703D01*
X76552000Y-63923297D01*
X76518951Y-63757147D01*
X76454122Y-63600637D01*
X76360005Y-63459782D01*
X76240218Y-63339995D01*
X76099363Y-63245878D01*
X75942853Y-63181049D01*
X75939105Y-63180303D01*
X75748801Y-62990000D01*
X85306678Y-62990000D01*
X85344000Y-62993676D01*
X85381322Y-62990000D01*
X85381333Y-62990000D01*
X85492986Y-62979003D01*
X85636247Y-62935546D01*
X85768276Y-62864974D01*
X85884001Y-62770001D01*
X85907804Y-62740997D01*
X86928802Y-61720000D01*
X87558017Y-61720000D01*
X87520147Y-61811426D01*
X87465000Y-62088665D01*
X87465000Y-62371335D01*
X87520147Y-62648574D01*
X87628320Y-62909727D01*
X87785363Y-63144759D01*
X87985241Y-63344637D01*
X88219128Y-63500915D01*
X88158486Y-63533329D01*
X88086903Y-63777298D01*
X88900000Y-64590395D01*
X89713097Y-63777298D01*
X89641514Y-63533329D01*
X89577008Y-63502806D01*
X89579727Y-63501680D01*
X89814759Y-63344637D01*
X90014637Y-63144759D01*
X90118043Y-62990000D01*
X91562652Y-62990000D01*
X91534454Y-63042754D01*
X91507404Y-63131928D01*
X91090000Y-63131928D01*
X90965518Y-63144188D01*
X90845820Y-63180498D01*
X90735506Y-63239463D01*
X90638815Y-63318815D01*
X90559463Y-63415506D01*
X90500498Y-63525820D01*
X90464188Y-63645518D01*
X90451928Y-63770000D01*
X90451928Y-65770000D01*
X90464188Y-65894482D01*
X90500498Y-66014180D01*
X90559463Y-66124494D01*
X90638815Y-66221185D01*
X90735506Y-66300537D01*
X90845820Y-66359502D01*
X90965518Y-66395812D01*
X91090000Y-66408072D01*
X93390000Y-66408072D01*
X93474001Y-66399799D01*
X93474001Y-66764658D01*
X93474000Y-66764668D01*
X93474000Y-67272678D01*
X93470324Y-67310000D01*
X93474000Y-67347322D01*
X93474000Y-67347333D01*
X93484997Y-67458986D01*
X93528454Y-67602247D01*
X93599026Y-67734276D01*
X93693999Y-67850001D01*
X93723001Y-67873802D01*
X94178200Y-68329002D01*
X94201999Y-68358001D01*
X94317724Y-68452974D01*
X94449753Y-68523546D01*
X94593014Y-68567003D01*
X94704667Y-68578000D01*
X94704676Y-68578000D01*
X94741999Y-68581676D01*
X94779322Y-68578000D01*
X95093461Y-68578000D01*
X95096637Y-68580122D01*
X95253147Y-68644951D01*
X95419297Y-68678000D01*
X95588703Y-68678000D01*
X95754853Y-68644951D01*
X95911363Y-68580122D01*
X96052218Y-68486005D01*
X96172005Y-68366218D01*
X96266122Y-68225363D01*
X96330951Y-68068853D01*
X96364000Y-67902703D01*
X96364000Y-67733297D01*
X96330951Y-67567147D01*
X96266122Y-67410637D01*
X96172005Y-67269782D01*
X96052218Y-67149995D01*
X95911363Y-67055878D01*
X95754853Y-66991049D01*
X95588703Y-66958000D01*
X95419297Y-66958000D01*
X95253147Y-66991049D01*
X95096637Y-67055878D01*
X95093461Y-67058000D01*
X95056802Y-67058000D01*
X94994000Y-66995199D01*
X94994000Y-64156829D01*
X94995878Y-64161363D01*
X95089995Y-64302218D01*
X95209782Y-64422005D01*
X95350637Y-64516122D01*
X95507147Y-64580951D01*
X95510895Y-64581697D01*
X96210201Y-65281003D01*
X96233999Y-65310001D01*
X96262997Y-65333799D01*
X96349723Y-65404974D01*
X96401928Y-65432878D01*
X96401928Y-65770000D01*
X96414188Y-65894482D01*
X96450498Y-66014180D01*
X96509463Y-66124494D01*
X96588815Y-66221185D01*
X96685506Y-66300537D01*
X96795820Y-66359502D01*
X96915518Y-66395812D01*
X97040000Y-66408072D01*
X99340000Y-66408072D01*
X99464482Y-66395812D01*
X99584180Y-66359502D01*
X99694494Y-66300537D01*
X99791185Y-66221185D01*
X99870537Y-66124494D01*
X99929502Y-66014180D01*
X99965812Y-65894482D01*
X99978072Y-65770000D01*
X99978072Y-64137573D01*
X100644192Y-64137573D01*
X100739956Y-64401974D01*
X101029571Y-64542864D01*
X101341108Y-64624544D01*
X101662595Y-64643878D01*
X101981675Y-64600121D01*
X102286088Y-64494955D01*
X102460044Y-64401974D01*
X102555808Y-64137573D01*
X101600000Y-63181765D01*
X100644192Y-64137573D01*
X99978072Y-64137573D01*
X99978072Y-63770000D01*
X99965812Y-63645518D01*
X99929502Y-63525820D01*
X99870537Y-63415506D01*
X99791185Y-63318815D01*
X99694494Y-63239463D01*
X99584180Y-63180498D01*
X99464482Y-63144188D01*
X99340000Y-63131928D01*
X98940570Y-63131928D01*
X98939003Y-63116014D01*
X98923455Y-63064755D01*
X99958282Y-63064755D01*
X100002039Y-63383835D01*
X100107205Y-63688248D01*
X100200186Y-63862204D01*
X100464587Y-63957968D01*
X101420395Y-63002160D01*
X101779605Y-63002160D01*
X102735413Y-63957968D01*
X102999814Y-63862204D01*
X103140704Y-63572589D01*
X103222384Y-63261052D01*
X103241718Y-62939565D01*
X103197961Y-62620485D01*
X103092795Y-62316072D01*
X102999814Y-62142116D01*
X102735413Y-62046352D01*
X101779605Y-63002160D01*
X101420395Y-63002160D01*
X100464587Y-62046352D01*
X100200186Y-62142116D01*
X100059296Y-62431731D01*
X99977616Y-62743268D01*
X99958282Y-63064755D01*
X98923455Y-63064755D01*
X98895546Y-62972753D01*
X98883225Y-62949703D01*
X98824974Y-62840723D01*
X98753799Y-62753997D01*
X98730001Y-62724999D01*
X98701004Y-62701202D01*
X97866549Y-61866747D01*
X100644192Y-61866747D01*
X101600000Y-62822555D01*
X102555808Y-61866747D01*
X102460044Y-61602346D01*
X102170429Y-61461456D01*
X101858892Y-61379776D01*
X101537405Y-61360442D01*
X101218325Y-61404199D01*
X100913912Y-61509365D01*
X100739956Y-61602346D01*
X100644192Y-61866747D01*
X97866549Y-61866747D01*
X97719801Y-61720000D01*
X98006678Y-61720000D01*
X98044000Y-61723676D01*
X98081322Y-61720000D01*
X98081333Y-61720000D01*
X98192986Y-61709003D01*
X98336247Y-61665546D01*
X98468276Y-61594974D01*
X98584001Y-61500001D01*
X98607804Y-61470997D01*
X99628802Y-60450000D01*
X106731957Y-60450000D01*
X106835363Y-60604759D01*
G36*
X113919000Y-63373000D02*
G01*
X113939000Y-63373000D01*
X113939000Y-63627000D01*
X113919000Y-63627000D01*
X113919000Y-63647000D01*
X113665000Y-63647000D01*
X113665000Y-63627000D01*
X113645000Y-63627000D01*
X113645000Y-63373000D01*
X113665000Y-63373000D01*
X113665000Y-63353000D01*
X113919000Y-63353000D01*
X113919000Y-63373000D01*
G37*
X113919000Y-63373000D02*
X113939000Y-63373000D01*
X113939000Y-63627000D01*
X113919000Y-63627000D01*
X113919000Y-63647000D01*
X113665000Y-63647000D01*
X113665000Y-63627000D01*
X113645000Y-63627000D01*
X113645000Y-63373000D01*
X113665000Y-63373000D01*
X113665000Y-63353000D01*
X113919000Y-63353000D01*
X113919000Y-63373000D01*
G36*
X106835363Y-52984759D02*
G01*
X107035241Y-53184637D01*
X107267759Y-53340000D01*
X107035241Y-53495363D01*
X106835363Y-53695241D01*
X106678320Y-53930273D01*
X106570147Y-54191426D01*
X106515000Y-54468665D01*
X106515000Y-54751335D01*
X106551312Y-54933886D01*
X104587199Y-56898000D01*
X91754802Y-56898000D01*
X91536026Y-56679224D01*
X91567000Y-56648250D01*
X91567000Y-55499000D01*
X90417750Y-55499000D01*
X90386776Y-55529974D01*
X90225804Y-55369003D01*
X90202001Y-55339999D01*
X90160724Y-55306124D01*
X90171680Y-55289727D01*
X90258957Y-55079022D01*
X90259000Y-55086250D01*
X90417750Y-55245000D01*
X91567000Y-55245000D01*
X91567000Y-55225000D01*
X91821000Y-55225000D01*
X91821000Y-55245000D01*
X91841000Y-55245000D01*
X91841000Y-55499000D01*
X91821000Y-55499000D01*
X91821000Y-56648250D01*
X91979750Y-56807000D01*
X92494000Y-56810072D01*
X92618482Y-56797812D01*
X92738180Y-56761502D01*
X92848494Y-56702537D01*
X92945185Y-56623185D01*
X93024537Y-56526494D01*
X93083502Y-56416180D01*
X93119812Y-56296482D01*
X93120643Y-56288039D01*
X93319241Y-56486637D01*
X93554273Y-56643680D01*
X93815426Y-56751853D01*
X94092665Y-56807000D01*
X94375335Y-56807000D01*
X94652574Y-56751853D01*
X94913727Y-56643680D01*
X95148759Y-56486637D01*
X95348637Y-56286759D01*
X95504000Y-56054241D01*
X95659363Y-56286759D01*
X95859241Y-56486637D01*
X96094273Y-56643680D01*
X96355426Y-56751853D01*
X96632665Y-56807000D01*
X96915335Y-56807000D01*
X97192574Y-56751853D01*
X97453727Y-56643680D01*
X97688759Y-56486637D01*
X97888637Y-56286759D01*
X98044000Y-56054241D01*
X98199363Y-56286759D01*
X98399241Y-56486637D01*
X98634273Y-56643680D01*
X98895426Y-56751853D01*
X99172665Y-56807000D01*
X99455335Y-56807000D01*
X99732574Y-56751853D01*
X99993727Y-56643680D01*
X100228759Y-56486637D01*
X100428637Y-56286759D01*
X100584000Y-56054241D01*
X100739363Y-56286759D01*
X100939241Y-56486637D01*
X101174273Y-56643680D01*
X101435426Y-56751853D01*
X101712665Y-56807000D01*
X101995335Y-56807000D01*
X102272574Y-56751853D01*
X102533727Y-56643680D01*
X102768759Y-56486637D01*
X102968637Y-56286759D01*
X103125680Y-56051727D01*
X103233853Y-55790574D01*
X103289000Y-55513335D01*
X103289000Y-55230665D01*
X103233853Y-54953426D01*
X103125680Y-54692273D01*
X103069371Y-54608000D01*
X104102678Y-54608000D01*
X104140000Y-54611676D01*
X104177322Y-54608000D01*
X104177333Y-54608000D01*
X104288986Y-54597003D01*
X104432247Y-54553546D01*
X104564276Y-54482974D01*
X104680001Y-54388001D01*
X104703804Y-54358997D01*
X106232802Y-52830000D01*
X106731957Y-52830000D01*
X106835363Y-52984759D01*
G37*
X106835363Y-52984759D02*
X107035241Y-53184637D01*
X107267759Y-53340000D01*
X107035241Y-53495363D01*
X106835363Y-53695241D01*
X106678320Y-53930273D01*
X106570147Y-54191426D01*
X106515000Y-54468665D01*
X106515000Y-54751335D01*
X106551312Y-54933886D01*
X104587199Y-56898000D01*
X91754802Y-56898000D01*
X91536026Y-56679224D01*
X91567000Y-56648250D01*
X91567000Y-55499000D01*
X90417750Y-55499000D01*
X90386776Y-55529974D01*
X90225804Y-55369003D01*
X90202001Y-55339999D01*
X90160724Y-55306124D01*
X90171680Y-55289727D01*
X90258957Y-55079022D01*
X90259000Y-55086250D01*
X90417750Y-55245000D01*
X91567000Y-55245000D01*
X91567000Y-55225000D01*
X91821000Y-55225000D01*
X91821000Y-55245000D01*
X91841000Y-55245000D01*
X91841000Y-55499000D01*
X91821000Y-55499000D01*
X91821000Y-56648250D01*
X91979750Y-56807000D01*
X92494000Y-56810072D01*
X92618482Y-56797812D01*
X92738180Y-56761502D01*
X92848494Y-56702537D01*
X92945185Y-56623185D01*
X93024537Y-56526494D01*
X93083502Y-56416180D01*
X93119812Y-56296482D01*
X93120643Y-56288039D01*
X93319241Y-56486637D01*
X93554273Y-56643680D01*
X93815426Y-56751853D01*
X94092665Y-56807000D01*
X94375335Y-56807000D01*
X94652574Y-56751853D01*
X94913727Y-56643680D01*
X95148759Y-56486637D01*
X95348637Y-56286759D01*
X95504000Y-56054241D01*
X95659363Y-56286759D01*
X95859241Y-56486637D01*
X96094273Y-56643680D01*
X96355426Y-56751853D01*
X96632665Y-56807000D01*
X96915335Y-56807000D01*
X97192574Y-56751853D01*
X97453727Y-56643680D01*
X97688759Y-56486637D01*
X97888637Y-56286759D01*
X98044000Y-56054241D01*
X98199363Y-56286759D01*
X98399241Y-56486637D01*
X98634273Y-56643680D01*
X98895426Y-56751853D01*
X99172665Y-56807000D01*
X99455335Y-56807000D01*
X99732574Y-56751853D01*
X99993727Y-56643680D01*
X100228759Y-56486637D01*
X100428637Y-56286759D01*
X100584000Y-56054241D01*
X100739363Y-56286759D01*
X100939241Y-56486637D01*
X101174273Y-56643680D01*
X101435426Y-56751853D01*
X101712665Y-56807000D01*
X101995335Y-56807000D01*
X102272574Y-56751853D01*
X102533727Y-56643680D01*
X102768759Y-56486637D01*
X102968637Y-56286759D01*
X103125680Y-56051727D01*
X103233853Y-55790574D01*
X103289000Y-55513335D01*
X103289000Y-55230665D01*
X103233853Y-54953426D01*
X103125680Y-54692273D01*
X103069371Y-54608000D01*
X104102678Y-54608000D01*
X104140000Y-54611676D01*
X104177322Y-54608000D01*
X104177333Y-54608000D01*
X104288986Y-54597003D01*
X104432247Y-54553546D01*
X104564276Y-54482974D01*
X104680001Y-54388001D01*
X104703804Y-54358997D01*
X106232802Y-52830000D01*
X106731957Y-52830000D01*
X106835363Y-52984759D01*
G36*
X104837049Y-41398853D02*
G01*
X104901878Y-41555363D01*
X104995995Y-41696218D01*
X105083000Y-41783223D01*
X105083001Y-48218971D01*
X105078960Y-48260000D01*
X105095082Y-48423689D01*
X105142828Y-48581087D01*
X105220364Y-48726146D01*
X105324709Y-48853291D01*
X105451854Y-48957636D01*
X105596913Y-49035172D01*
X105754311Y-49082918D01*
X105876981Y-49095000D01*
X105876982Y-49095000D01*
X105918000Y-49099040D01*
X105959019Y-49095000D01*
X107485612Y-49095000D01*
X107611297Y-49120000D01*
X107780703Y-49120000D01*
X107946853Y-49086951D01*
X108103363Y-49022122D01*
X108244218Y-48928005D01*
X108364005Y-48808218D01*
X108458122Y-48667363D01*
X108522951Y-48510853D01*
X108556000Y-48344703D01*
X108556000Y-48175297D01*
X108522951Y-48009147D01*
X108458122Y-47852637D01*
X108364005Y-47711782D01*
X108244218Y-47591995D01*
X108103363Y-47497878D01*
X107946853Y-47433049D01*
X107780703Y-47400000D01*
X107611297Y-47400000D01*
X107485612Y-47425000D01*
X106753000Y-47425000D01*
X106753000Y-45813137D01*
X107205000Y-45813137D01*
X107205000Y-46026863D01*
X107246696Y-46236483D01*
X107328485Y-46433940D01*
X107447225Y-46611647D01*
X107598353Y-46762775D01*
X107776060Y-46881515D01*
X107973517Y-46963304D01*
X108183137Y-47005000D01*
X108396863Y-47005000D01*
X108606483Y-46963304D01*
X108803940Y-46881515D01*
X108981647Y-46762775D01*
X109132775Y-46611647D01*
X109251515Y-46433940D01*
X109333304Y-46236483D01*
X109375000Y-46026863D01*
X109375000Y-45813137D01*
X111605000Y-45813137D01*
X111605000Y-46026863D01*
X111646696Y-46236483D01*
X111728485Y-46433940D01*
X111847225Y-46611647D01*
X111998353Y-46762775D01*
X112176060Y-46881515D01*
X112373517Y-46963304D01*
X112583137Y-47005000D01*
X112796863Y-47005000D01*
X113006483Y-46963304D01*
X113203940Y-46881515D01*
X113381647Y-46762775D01*
X113532775Y-46611647D01*
X113651515Y-46433940D01*
X113733304Y-46236483D01*
X113775000Y-46026863D01*
X113775000Y-45813137D01*
X113733304Y-45603517D01*
X113651515Y-45406060D01*
X113532775Y-45228353D01*
X113381647Y-45077225D01*
X113203940Y-44958485D01*
X113006483Y-44876696D01*
X112796863Y-44835000D01*
X112583137Y-44835000D01*
X112373517Y-44876696D01*
X112176060Y-44958485D01*
X111998353Y-45077225D01*
X111847225Y-45228353D01*
X111728485Y-45406060D01*
X111646696Y-45603517D01*
X111605000Y-45813137D01*
X109375000Y-45813137D01*
X109333304Y-45603517D01*
X109251515Y-45406060D01*
X109132775Y-45228353D01*
X108981647Y-45077225D01*
X108803940Y-44958485D01*
X108606483Y-44876696D01*
X108396863Y-44835000D01*
X108183137Y-44835000D01*
X107973517Y-44876696D01*
X107776060Y-44958485D01*
X107598353Y-45077225D01*
X107447225Y-45228353D01*
X107328485Y-45406060D01*
X107246696Y-45603517D01*
X107205000Y-45813137D01*
X106753000Y-45813137D01*
X106753000Y-41443015D01*
X106757040Y-41401999D01*
X106751918Y-41350000D01*
X116130001Y-41350000D01*
X116130001Y-50539199D01*
X115625804Y-50035003D01*
X115602001Y-50005999D01*
X115486276Y-49911026D01*
X115354247Y-49840454D01*
X115210986Y-49796997D01*
X115099333Y-49786000D01*
X115099322Y-49786000D01*
X115062000Y-49782324D01*
X115024678Y-49786000D01*
X111916539Y-49786000D01*
X111913363Y-49783878D01*
X111756853Y-49719049D01*
X111590703Y-49686000D01*
X111421297Y-49686000D01*
X111255147Y-49719049D01*
X111098637Y-49783878D01*
X110957782Y-49877995D01*
X110837995Y-49997782D01*
X110743878Y-50138637D01*
X110679049Y-50295147D01*
X110646000Y-50461297D01*
X110646000Y-50522946D01*
X110590637Y-50545878D01*
X110449782Y-50639995D01*
X110329995Y-50759782D01*
X110235878Y-50900637D01*
X110171049Y-51057147D01*
X110138000Y-51223297D01*
X110138000Y-51310000D01*
X109168043Y-51310000D01*
X109064637Y-51155241D01*
X108864759Y-50955363D01*
X108629727Y-50798320D01*
X108368574Y-50690147D01*
X108091335Y-50635000D01*
X107808665Y-50635000D01*
X107531426Y-50690147D01*
X107270273Y-50798320D01*
X107035241Y-50955363D01*
X106835363Y-51155241D01*
X106731957Y-51310000D01*
X105955325Y-51310000D01*
X105918000Y-51306324D01*
X105880675Y-51310000D01*
X105880667Y-51310000D01*
X105769014Y-51320997D01*
X105625753Y-51364454D01*
X105493724Y-51435026D01*
X105377999Y-51529999D01*
X105354201Y-51558997D01*
X103858072Y-53055127D01*
X103858072Y-51070000D01*
X103845812Y-50945518D01*
X103809502Y-50825820D01*
X103750537Y-50715506D01*
X103671185Y-50618815D01*
X103574494Y-50539463D01*
X103464180Y-50480498D01*
X103344482Y-50444188D01*
X103220000Y-50431928D01*
X100920000Y-50431928D01*
X100795518Y-50444188D01*
X100675820Y-50480498D01*
X100565506Y-50539463D01*
X100468815Y-50618815D01*
X100389463Y-50715506D01*
X100330498Y-50825820D01*
X100294188Y-50945518D01*
X100281928Y-51070000D01*
X100281928Y-51234113D01*
X100160703Y-51210000D01*
X99991297Y-51210000D01*
X99825147Y-51243049D01*
X99668637Y-51307878D01*
X99665461Y-51310000D01*
X97908072Y-51310000D01*
X97908072Y-51070000D01*
X97895812Y-50945518D01*
X97859502Y-50825820D01*
X97800537Y-50715506D01*
X97721185Y-50618815D01*
X97624494Y-50539463D01*
X97514180Y-50480498D01*
X97394482Y-50444188D01*
X97270000Y-50431928D01*
X95556729Y-50431928D01*
X95248000Y-50123199D01*
X95248000Y-47895750D01*
X95400000Y-47895750D01*
X95400000Y-48124250D01*
X95444578Y-48348360D01*
X95532021Y-48559466D01*
X95658969Y-48749457D01*
X95820543Y-48911031D01*
X96010534Y-49037979D01*
X96221640Y-49125422D01*
X96445750Y-49170000D01*
X96674250Y-49170000D01*
X96898360Y-49125422D01*
X97109466Y-49037979D01*
X97299457Y-48911031D01*
X97461031Y-48749457D01*
X97587979Y-48559466D01*
X97675422Y-48348360D01*
X97720000Y-48124250D01*
X97720000Y-47895750D01*
X100400000Y-47895750D01*
X100400000Y-48124250D01*
X100444578Y-48348360D01*
X100532021Y-48559466D01*
X100658969Y-48749457D01*
X100820543Y-48911031D01*
X101010534Y-49037979D01*
X101221640Y-49125422D01*
X101445750Y-49170000D01*
X101674250Y-49170000D01*
X101898360Y-49125422D01*
X102109466Y-49037979D01*
X102299457Y-48911031D01*
X102461031Y-48749457D01*
X102587979Y-48559466D01*
X102675422Y-48348360D01*
X102720000Y-48124250D01*
X102720000Y-47895750D01*
X102675422Y-47671640D01*
X102587979Y-47460534D01*
X102461031Y-47270543D01*
X102299457Y-47108969D01*
X102109466Y-46982021D01*
X101898360Y-46894578D01*
X101674250Y-46850000D01*
X101445750Y-46850000D01*
X101221640Y-46894578D01*
X101010534Y-46982021D01*
X100820543Y-47108969D01*
X100658969Y-47270543D01*
X100532021Y-47460534D01*
X100444578Y-47671640D01*
X100400000Y-47895750D01*
X97720000Y-47895750D01*
X97675422Y-47671640D01*
X97587979Y-47460534D01*
X97461031Y-47270543D01*
X97299457Y-47108969D01*
X97109466Y-46982021D01*
X96898360Y-46894578D01*
X96674250Y-46850000D01*
X96445750Y-46850000D01*
X96221640Y-46894578D01*
X96010534Y-46982021D01*
X95820543Y-47108969D01*
X95658969Y-47270543D01*
X95532021Y-47460534D01*
X95444578Y-47671640D01*
X95400000Y-47895750D01*
X95248000Y-47895750D01*
X95248000Y-47789333D01*
X95251677Y-47752000D01*
X95237003Y-47603014D01*
X95193546Y-47459753D01*
X95122974Y-47327724D01*
X95028001Y-47211999D01*
X94912276Y-47117026D01*
X94780247Y-47046454D01*
X94636986Y-47002997D01*
X94525333Y-46992000D01*
X94488000Y-46988323D01*
X94450667Y-46992000D01*
X93744407Y-46992000D01*
X93764125Y-46978825D01*
X93998825Y-46744125D01*
X94183228Y-46468147D01*
X94310246Y-46161496D01*
X94375000Y-45835958D01*
X94375000Y-45595544D01*
X94410815Y-45639185D01*
X94507506Y-45718537D01*
X94617820Y-45777502D01*
X94737518Y-45813812D01*
X94862000Y-45826072D01*
X97162000Y-45826072D01*
X97286482Y-45813812D01*
X97406180Y-45777502D01*
X97516494Y-45718537D01*
X97613185Y-45639185D01*
X97692537Y-45542494D01*
X97751502Y-45432180D01*
X97787812Y-45312482D01*
X97800072Y-45188000D01*
X97800072Y-44523000D01*
X100319928Y-44523000D01*
X100319928Y-45188000D01*
X100332188Y-45312482D01*
X100368498Y-45432180D01*
X100427463Y-45542494D01*
X100506815Y-45639185D01*
X100603506Y-45718537D01*
X100713820Y-45777502D01*
X100833518Y-45813812D01*
X100958000Y-45826072D01*
X103258000Y-45826072D01*
X103382482Y-45813812D01*
X103502180Y-45777502D01*
X103612494Y-45718537D01*
X103709185Y-45639185D01*
X103788537Y-45542494D01*
X103847502Y-45432180D01*
X103883812Y-45312482D01*
X103896072Y-45188000D01*
X103896072Y-42188000D01*
X103883812Y-42063518D01*
X103847502Y-41943820D01*
X103788537Y-41833506D01*
X103709185Y-41736815D01*
X103612494Y-41657463D01*
X103502180Y-41598498D01*
X103382482Y-41562188D01*
X103258000Y-41549928D01*
X100958000Y-41549928D01*
X100833518Y-41562188D01*
X100713820Y-41598498D01*
X100603506Y-41657463D01*
X100506815Y-41736815D01*
X100427463Y-41833506D01*
X100368498Y-41943820D01*
X100332188Y-42063518D01*
X100319928Y-42188000D01*
X100319928Y-42853000D01*
X97800072Y-42853000D01*
X97800072Y-42188000D01*
X97787812Y-42063518D01*
X97751502Y-41943820D01*
X97692537Y-41833506D01*
X97613185Y-41736815D01*
X97516494Y-41657463D01*
X97406180Y-41598498D01*
X97286482Y-41562188D01*
X97162000Y-41549928D01*
X94862000Y-41549928D01*
X94737518Y-41562188D01*
X94617820Y-41598498D01*
X94507506Y-41657463D01*
X94410815Y-41736815D01*
X94331463Y-41833506D01*
X94272498Y-41943820D01*
X94236188Y-42063518D01*
X94223928Y-42188000D01*
X94223928Y-42878060D01*
X93964445Y-42618578D01*
X93938291Y-42586709D01*
X93811146Y-42482364D01*
X93666087Y-42404828D01*
X93508689Y-42357082D01*
X93386019Y-42345000D01*
X93386018Y-42345000D01*
X93345000Y-42340960D01*
X93303982Y-42345000D01*
X92698132Y-42345000D01*
X92612893Y-42217431D01*
X92402569Y-42007107D01*
X92155253Y-41841856D01*
X91880451Y-41728029D01*
X91588722Y-41670000D01*
X91291278Y-41670000D01*
X90999549Y-41728029D01*
X90724747Y-41841856D01*
X90477431Y-42007107D01*
X90267107Y-42217431D01*
X90101856Y-42464747D01*
X89988029Y-42739549D01*
X89930000Y-43031278D01*
X89930000Y-43328722D01*
X89960264Y-43480868D01*
X89814759Y-43335363D01*
X89579727Y-43178320D01*
X89318574Y-43070147D01*
X89041335Y-43015000D01*
X88758665Y-43015000D01*
X88481426Y-43070147D01*
X88450000Y-43083164D01*
X88450000Y-43031278D01*
X88391971Y-42739549D01*
X88278144Y-42464747D01*
X88112893Y-42217431D01*
X87902569Y-42007107D01*
X87655253Y-41841856D01*
X87380451Y-41728029D01*
X87088722Y-41670000D01*
X86791278Y-41670000D01*
X86499549Y-41728029D01*
X86224747Y-41841856D01*
X85977431Y-42007107D01*
X85767107Y-42217431D01*
X85631755Y-42420000D01*
X84619322Y-42420000D01*
X84581999Y-42416324D01*
X84544676Y-42420000D01*
X84544667Y-42420000D01*
X84433014Y-42430997D01*
X84289753Y-42474454D01*
X84157724Y-42545026D01*
X84041999Y-42639999D01*
X84018201Y-42668997D01*
X82801003Y-43886196D01*
X82771999Y-43909999D01*
X82734927Y-43955172D01*
X82677026Y-44025724D01*
X82618036Y-44136086D01*
X82606454Y-44157754D01*
X82562997Y-44301015D01*
X82552000Y-44412668D01*
X82552000Y-44412678D01*
X82548324Y-44450000D01*
X82552000Y-44487323D01*
X82552001Y-47206668D01*
X82548324Y-47244000D01*
X82552001Y-47281333D01*
X82562998Y-47392986D01*
X82569159Y-47413297D01*
X82606454Y-47536246D01*
X82677026Y-47668276D01*
X82735070Y-47739002D01*
X82772000Y-47784001D01*
X82800998Y-47807799D01*
X85034201Y-50041003D01*
X85057999Y-50070001D01*
X85173724Y-50164974D01*
X85305753Y-50235546D01*
X85449014Y-50279003D01*
X85560667Y-50290000D01*
X85560676Y-50290000D01*
X85597999Y-50293676D01*
X85635322Y-50290000D01*
X87681957Y-50290000D01*
X87785363Y-50444759D01*
X87985241Y-50644637D01*
X88217759Y-50800000D01*
X87985241Y-50955363D01*
X87785363Y-51155241D01*
X87628320Y-51390273D01*
X87520147Y-51651426D01*
X87465000Y-51928665D01*
X87465000Y-52211335D01*
X87520147Y-52488574D01*
X87558017Y-52580000D01*
X87413322Y-52580000D01*
X87375999Y-52576324D01*
X87338676Y-52580000D01*
X87338667Y-52580000D01*
X87227014Y-52590997D01*
X87083753Y-52634454D01*
X86951724Y-52705026D01*
X86835999Y-52799999D01*
X86812201Y-52828997D01*
X85791199Y-53850000D01*
X74878043Y-53850000D01*
X74774637Y-53695241D01*
X74574759Y-53495363D01*
X74342241Y-53340000D01*
X74574759Y-53184637D01*
X74774637Y-52984759D01*
X74931680Y-52749727D01*
X75039853Y-52488574D01*
X75095000Y-52211335D01*
X75095000Y-51928665D01*
X75039853Y-51651426D01*
X74931680Y-51390273D01*
X74774637Y-51155241D01*
X74574759Y-50955363D01*
X74342241Y-50800000D01*
X74574759Y-50644637D01*
X74774637Y-50444759D01*
X74931680Y-50209727D01*
X75039853Y-49948574D01*
X75095000Y-49671335D01*
X75095000Y-49388665D01*
X75039853Y-49111426D01*
X74931680Y-48850273D01*
X74774637Y-48615241D01*
X74574759Y-48415363D01*
X74342241Y-48260000D01*
X74574759Y-48104637D01*
X74715194Y-47964202D01*
X74769995Y-48046218D01*
X74889782Y-48166005D01*
X75030637Y-48260122D01*
X75187147Y-48324951D01*
X75353297Y-48358000D01*
X75522703Y-48358000D01*
X75688853Y-48324951D01*
X75845363Y-48260122D01*
X75986218Y-48166005D01*
X76106005Y-48046218D01*
X76200122Y-47905363D01*
X76264951Y-47748853D01*
X76298000Y-47582703D01*
X76298000Y-47413297D01*
X76264951Y-47247147D01*
X76200122Y-47090637D01*
X76198000Y-47087461D01*
X76198000Y-46800950D01*
X76375875Y-46978825D01*
X76651853Y-47163228D01*
X76958504Y-47290246D01*
X77284042Y-47355000D01*
X77615958Y-47355000D01*
X77941496Y-47290246D01*
X78248147Y-47163228D01*
X78524125Y-46978825D01*
X78758825Y-46744125D01*
X78943228Y-46468147D01*
X79070246Y-46161496D01*
X79135000Y-45835958D01*
X79135000Y-45504042D01*
X79070246Y-45178504D01*
X78943228Y-44871853D01*
X78758825Y-44595875D01*
X78524125Y-44361175D01*
X78248147Y-44176772D01*
X77941496Y-44049754D01*
X77615958Y-43985000D01*
X77478177Y-43985000D01*
X77538144Y-43895253D01*
X77651971Y-43620451D01*
X77710000Y-43328722D01*
X77710000Y-43031278D01*
X77651971Y-42739549D01*
X77538144Y-42464747D01*
X77372893Y-42217431D01*
X77162569Y-42007107D01*
X76915253Y-41841856D01*
X76640451Y-41728029D01*
X76348722Y-41670000D01*
X76051278Y-41670000D01*
X75759549Y-41728029D01*
X75484747Y-41841856D01*
X75237431Y-42007107D01*
X75027107Y-42217431D01*
X74861856Y-42464747D01*
X74748029Y-42739549D01*
X74690000Y-43031278D01*
X74690000Y-43328722D01*
X74720264Y-43480868D01*
X74574759Y-43335363D01*
X74339727Y-43178320D01*
X74078574Y-43070147D01*
X73801335Y-43015000D01*
X73518665Y-43015000D01*
X73241426Y-43070147D01*
X73211506Y-43082540D01*
X73173501Y-42818037D01*
X73074572Y-42537526D01*
X72997868Y-42394025D01*
X72746240Y-42313365D01*
X71879605Y-43180000D01*
X71893748Y-43194143D01*
X71714143Y-43373748D01*
X71700000Y-43359605D01*
X71685858Y-43373748D01*
X71506253Y-43194143D01*
X71520395Y-43180000D01*
X70653760Y-42313365D01*
X70402132Y-42394025D01*
X70273733Y-42662329D01*
X70200145Y-42950526D01*
X70184196Y-43247543D01*
X70226499Y-43541963D01*
X70325428Y-43822474D01*
X70402132Y-43965975D01*
X70461483Y-43985000D01*
X70274042Y-43985000D01*
X69948504Y-44049754D01*
X69641853Y-44176772D01*
X69365875Y-44361175D01*
X69290000Y-44437050D01*
X69290000Y-42133760D01*
X70833365Y-42133760D01*
X71700000Y-43000395D01*
X72566635Y-42133760D01*
X72485975Y-41882132D01*
X72217671Y-41753733D01*
X71929474Y-41680145D01*
X71632457Y-41664196D01*
X71338037Y-41706499D01*
X71057526Y-41805428D01*
X70914025Y-41882132D01*
X70833365Y-42133760D01*
X69290000Y-42133760D01*
X69290000Y-41350000D01*
X104827332Y-41350000D01*
X104837049Y-41398853D01*
G37*
X104837049Y-41398853D02*
X104901878Y-41555363D01*
X104995995Y-41696218D01*
X105083000Y-41783223D01*
X105083001Y-48218971D01*
X105078960Y-48260000D01*
X105095082Y-48423689D01*
X105142828Y-48581087D01*
X105220364Y-48726146D01*
X105324709Y-48853291D01*
X105451854Y-48957636D01*
X105596913Y-49035172D01*
X105754311Y-49082918D01*
X105876981Y-49095000D01*
X105876982Y-49095000D01*
X105918000Y-49099040D01*
X105959019Y-49095000D01*
X107485612Y-49095000D01*
X107611297Y-49120000D01*
X107780703Y-49120000D01*
X107946853Y-49086951D01*
X108103363Y-49022122D01*
X108244218Y-48928005D01*
X108364005Y-48808218D01*
X108458122Y-48667363D01*
X108522951Y-48510853D01*
X108556000Y-48344703D01*
X108556000Y-48175297D01*
X108522951Y-48009147D01*
X108458122Y-47852637D01*
X108364005Y-47711782D01*
X108244218Y-47591995D01*
X108103363Y-47497878D01*
X107946853Y-47433049D01*
X107780703Y-47400000D01*
X107611297Y-47400000D01*
X107485612Y-47425000D01*
X106753000Y-47425000D01*
X106753000Y-45813137D01*
X107205000Y-45813137D01*
X107205000Y-46026863D01*
X107246696Y-46236483D01*
X107328485Y-46433940D01*
X107447225Y-46611647D01*
X107598353Y-46762775D01*
X107776060Y-46881515D01*
X107973517Y-46963304D01*
X108183137Y-47005000D01*
X108396863Y-47005000D01*
X108606483Y-46963304D01*
X108803940Y-46881515D01*
X108981647Y-46762775D01*
X109132775Y-46611647D01*
X109251515Y-46433940D01*
X109333304Y-46236483D01*
X109375000Y-46026863D01*
X109375000Y-45813137D01*
X111605000Y-45813137D01*
X111605000Y-46026863D01*
X111646696Y-46236483D01*
X111728485Y-46433940D01*
X111847225Y-46611647D01*
X111998353Y-46762775D01*
X112176060Y-46881515D01*
X112373517Y-46963304D01*
X112583137Y-47005000D01*
X112796863Y-47005000D01*
X113006483Y-46963304D01*
X113203940Y-46881515D01*
X113381647Y-46762775D01*
X113532775Y-46611647D01*
X113651515Y-46433940D01*
X113733304Y-46236483D01*
X113775000Y-46026863D01*
X113775000Y-45813137D01*
X113733304Y-45603517D01*
X113651515Y-45406060D01*
X113532775Y-45228353D01*
X113381647Y-45077225D01*
X113203940Y-44958485D01*
X113006483Y-44876696D01*
X112796863Y-44835000D01*
X112583137Y-44835000D01*
X112373517Y-44876696D01*
X112176060Y-44958485D01*
X111998353Y-45077225D01*
X111847225Y-45228353D01*
X111728485Y-45406060D01*
X111646696Y-45603517D01*
X111605000Y-45813137D01*
X109375000Y-45813137D01*
X109333304Y-45603517D01*
X109251515Y-45406060D01*
X109132775Y-45228353D01*
X108981647Y-45077225D01*
X108803940Y-44958485D01*
X108606483Y-44876696D01*
X108396863Y-44835000D01*
X108183137Y-44835000D01*
X107973517Y-44876696D01*
X107776060Y-44958485D01*
X107598353Y-45077225D01*
X107447225Y-45228353D01*
X107328485Y-45406060D01*
X107246696Y-45603517D01*
X107205000Y-45813137D01*
X106753000Y-45813137D01*
X106753000Y-41443015D01*
X106757040Y-41401999D01*
X106751918Y-41350000D01*
X116130001Y-41350000D01*
X116130001Y-50539199D01*
X115625804Y-50035003D01*
X115602001Y-50005999D01*
X115486276Y-49911026D01*
X115354247Y-49840454D01*
X115210986Y-49796997D01*
X115099333Y-49786000D01*
X115099322Y-49786000D01*
X115062000Y-49782324D01*
X115024678Y-49786000D01*
X111916539Y-49786000D01*
X111913363Y-49783878D01*
X111756853Y-49719049D01*
X111590703Y-49686000D01*
X111421297Y-49686000D01*
X111255147Y-49719049D01*
X111098637Y-49783878D01*
X110957782Y-49877995D01*
X110837995Y-49997782D01*
X110743878Y-50138637D01*
X110679049Y-50295147D01*
X110646000Y-50461297D01*
X110646000Y-50522946D01*
X110590637Y-50545878D01*
X110449782Y-50639995D01*
X110329995Y-50759782D01*
X110235878Y-50900637D01*
X110171049Y-51057147D01*
X110138000Y-51223297D01*
X110138000Y-51310000D01*
X109168043Y-51310000D01*
X109064637Y-51155241D01*
X108864759Y-50955363D01*
X108629727Y-50798320D01*
X108368574Y-50690147D01*
X108091335Y-50635000D01*
X107808665Y-50635000D01*
X107531426Y-50690147D01*
X107270273Y-50798320D01*
X107035241Y-50955363D01*
X106835363Y-51155241D01*
X106731957Y-51310000D01*
X105955325Y-51310000D01*
X105918000Y-51306324D01*
X105880675Y-51310000D01*
X105880667Y-51310000D01*
X105769014Y-51320997D01*
X105625753Y-51364454D01*
X105493724Y-51435026D01*
X105377999Y-51529999D01*
X105354201Y-51558997D01*
X103858072Y-53055127D01*
X103858072Y-51070000D01*
X103845812Y-50945518D01*
X103809502Y-50825820D01*
X103750537Y-50715506D01*
X103671185Y-50618815D01*
X103574494Y-50539463D01*
X103464180Y-50480498D01*
X103344482Y-50444188D01*
X103220000Y-50431928D01*
X100920000Y-50431928D01*
X100795518Y-50444188D01*
X100675820Y-50480498D01*
X100565506Y-50539463D01*
X100468815Y-50618815D01*
X100389463Y-50715506D01*
X100330498Y-50825820D01*
X100294188Y-50945518D01*
X100281928Y-51070000D01*
X100281928Y-51234113D01*
X100160703Y-51210000D01*
X99991297Y-51210000D01*
X99825147Y-51243049D01*
X99668637Y-51307878D01*
X99665461Y-51310000D01*
X97908072Y-51310000D01*
X97908072Y-51070000D01*
X97895812Y-50945518D01*
X97859502Y-50825820D01*
X97800537Y-50715506D01*
X97721185Y-50618815D01*
X97624494Y-50539463D01*
X97514180Y-50480498D01*
X97394482Y-50444188D01*
X97270000Y-50431928D01*
X95556729Y-50431928D01*
X95248000Y-50123199D01*
X95248000Y-47895750D01*
X95400000Y-47895750D01*
X95400000Y-48124250D01*
X95444578Y-48348360D01*
X95532021Y-48559466D01*
X95658969Y-48749457D01*
X95820543Y-48911031D01*
X96010534Y-49037979D01*
X96221640Y-49125422D01*
X96445750Y-49170000D01*
X96674250Y-49170000D01*
X96898360Y-49125422D01*
X97109466Y-49037979D01*
X97299457Y-48911031D01*
X97461031Y-48749457D01*
X97587979Y-48559466D01*
X97675422Y-48348360D01*
X97720000Y-48124250D01*
X97720000Y-47895750D01*
X100400000Y-47895750D01*
X100400000Y-48124250D01*
X100444578Y-48348360D01*
X100532021Y-48559466D01*
X100658969Y-48749457D01*
X100820543Y-48911031D01*
X101010534Y-49037979D01*
X101221640Y-49125422D01*
X101445750Y-49170000D01*
X101674250Y-49170000D01*
X101898360Y-49125422D01*
X102109466Y-49037979D01*
X102299457Y-48911031D01*
X102461031Y-48749457D01*
X102587979Y-48559466D01*
X102675422Y-48348360D01*
X102720000Y-48124250D01*
X102720000Y-47895750D01*
X102675422Y-47671640D01*
X102587979Y-47460534D01*
X102461031Y-47270543D01*
X102299457Y-47108969D01*
X102109466Y-46982021D01*
X101898360Y-46894578D01*
X101674250Y-46850000D01*
X101445750Y-46850000D01*
X101221640Y-46894578D01*
X101010534Y-46982021D01*
X100820543Y-47108969D01*
X100658969Y-47270543D01*
X100532021Y-47460534D01*
X100444578Y-47671640D01*
X100400000Y-47895750D01*
X97720000Y-47895750D01*
X97675422Y-47671640D01*
X97587979Y-47460534D01*
X97461031Y-47270543D01*
X97299457Y-47108969D01*
X97109466Y-46982021D01*
X96898360Y-46894578D01*
X96674250Y-46850000D01*
X96445750Y-46850000D01*
X96221640Y-46894578D01*
X96010534Y-46982021D01*
X95820543Y-47108969D01*
X95658969Y-47270543D01*
X95532021Y-47460534D01*
X95444578Y-47671640D01*
X95400000Y-47895750D01*
X95248000Y-47895750D01*
X95248000Y-47789333D01*
X95251677Y-47752000D01*
X95237003Y-47603014D01*
X95193546Y-47459753D01*
X95122974Y-47327724D01*
X95028001Y-47211999D01*
X94912276Y-47117026D01*
X94780247Y-47046454D01*
X94636986Y-47002997D01*
X94525333Y-46992000D01*
X94488000Y-46988323D01*
X94450667Y-46992000D01*
X93744407Y-46992000D01*
X93764125Y-46978825D01*
X93998825Y-46744125D01*
X94183228Y-46468147D01*
X94310246Y-46161496D01*
X94375000Y-45835958D01*
X94375000Y-45595544D01*
X94410815Y-45639185D01*
X94507506Y-45718537D01*
X94617820Y-45777502D01*
X94737518Y-45813812D01*
X94862000Y-45826072D01*
X97162000Y-45826072D01*
X97286482Y-45813812D01*
X97406180Y-45777502D01*
X97516494Y-45718537D01*
X97613185Y-45639185D01*
X97692537Y-45542494D01*
X97751502Y-45432180D01*
X97787812Y-45312482D01*
X97800072Y-45188000D01*
X97800072Y-44523000D01*
X100319928Y-44523000D01*
X100319928Y-45188000D01*
X100332188Y-45312482D01*
X100368498Y-45432180D01*
X100427463Y-45542494D01*
X100506815Y-45639185D01*
X100603506Y-45718537D01*
X100713820Y-45777502D01*
X100833518Y-45813812D01*
X100958000Y-45826072D01*
X103258000Y-45826072D01*
X103382482Y-45813812D01*
X103502180Y-45777502D01*
X103612494Y-45718537D01*
X103709185Y-45639185D01*
X103788537Y-45542494D01*
X103847502Y-45432180D01*
X103883812Y-45312482D01*
X103896072Y-45188000D01*
X103896072Y-42188000D01*
X103883812Y-42063518D01*
X103847502Y-41943820D01*
X103788537Y-41833506D01*
X103709185Y-41736815D01*
X103612494Y-41657463D01*
X103502180Y-41598498D01*
X103382482Y-41562188D01*
X103258000Y-41549928D01*
X100958000Y-41549928D01*
X100833518Y-41562188D01*
X100713820Y-41598498D01*
X100603506Y-41657463D01*
X100506815Y-41736815D01*
X100427463Y-41833506D01*
X100368498Y-41943820D01*
X100332188Y-42063518D01*
X100319928Y-42188000D01*
X100319928Y-42853000D01*
X97800072Y-42853000D01*
X97800072Y-42188000D01*
X97787812Y-42063518D01*
X97751502Y-41943820D01*
X97692537Y-41833506D01*
X97613185Y-41736815D01*
X97516494Y-41657463D01*
X97406180Y-41598498D01*
X97286482Y-41562188D01*
X97162000Y-41549928D01*
X94862000Y-41549928D01*
X94737518Y-41562188D01*
X94617820Y-41598498D01*
X94507506Y-41657463D01*
X94410815Y-41736815D01*
X94331463Y-41833506D01*
X94272498Y-41943820D01*
X94236188Y-42063518D01*
X94223928Y-42188000D01*
X94223928Y-42878060D01*
X93964445Y-42618578D01*
X93938291Y-42586709D01*
X93811146Y-42482364D01*
X93666087Y-42404828D01*
X93508689Y-42357082D01*
X93386019Y-42345000D01*
X93386018Y-42345000D01*
X93345000Y-42340960D01*
X93303982Y-42345000D01*
X92698132Y-42345000D01*
X92612893Y-42217431D01*
X92402569Y-42007107D01*
X92155253Y-41841856D01*
X91880451Y-41728029D01*
X91588722Y-41670000D01*
X91291278Y-41670000D01*
X90999549Y-41728029D01*
X90724747Y-41841856D01*
X90477431Y-42007107D01*
X90267107Y-42217431D01*
X90101856Y-42464747D01*
X89988029Y-42739549D01*
X89930000Y-43031278D01*
X89930000Y-43328722D01*
X89960264Y-43480868D01*
X89814759Y-43335363D01*
X89579727Y-43178320D01*
X89318574Y-43070147D01*
X89041335Y-43015000D01*
X88758665Y-43015000D01*
X88481426Y-43070147D01*
X88450000Y-43083164D01*
X88450000Y-43031278D01*
X88391971Y-42739549D01*
X88278144Y-42464747D01*
X88112893Y-42217431D01*
X87902569Y-42007107D01*
X87655253Y-41841856D01*
X87380451Y-41728029D01*
X87088722Y-41670000D01*
X86791278Y-41670000D01*
X86499549Y-41728029D01*
X86224747Y-41841856D01*
X85977431Y-42007107D01*
X85767107Y-42217431D01*
X85631755Y-42420000D01*
X84619322Y-42420000D01*
X84581999Y-42416324D01*
X84544676Y-42420000D01*
X84544667Y-42420000D01*
X84433014Y-42430997D01*
X84289753Y-42474454D01*
X84157724Y-42545026D01*
X84041999Y-42639999D01*
X84018201Y-42668997D01*
X82801003Y-43886196D01*
X82771999Y-43909999D01*
X82734927Y-43955172D01*
X82677026Y-44025724D01*
X82618036Y-44136086D01*
X82606454Y-44157754D01*
X82562997Y-44301015D01*
X82552000Y-44412668D01*
X82552000Y-44412678D01*
X82548324Y-44450000D01*
X82552000Y-44487323D01*
X82552001Y-47206668D01*
X82548324Y-47244000D01*
X82552001Y-47281333D01*
X82562998Y-47392986D01*
X82569159Y-47413297D01*
X82606454Y-47536246D01*
X82677026Y-47668276D01*
X82735070Y-47739002D01*
X82772000Y-47784001D01*
X82800998Y-47807799D01*
X85034201Y-50041003D01*
X85057999Y-50070001D01*
X85173724Y-50164974D01*
X85305753Y-50235546D01*
X85449014Y-50279003D01*
X85560667Y-50290000D01*
X85560676Y-50290000D01*
X85597999Y-50293676D01*
X85635322Y-50290000D01*
X87681957Y-50290000D01*
X87785363Y-50444759D01*
X87985241Y-50644637D01*
X88217759Y-50800000D01*
X87985241Y-50955363D01*
X87785363Y-51155241D01*
X87628320Y-51390273D01*
X87520147Y-51651426D01*
X87465000Y-51928665D01*
X87465000Y-52211335D01*
X87520147Y-52488574D01*
X87558017Y-52580000D01*
X87413322Y-52580000D01*
X87375999Y-52576324D01*
X87338676Y-52580000D01*
X87338667Y-52580000D01*
X87227014Y-52590997D01*
X87083753Y-52634454D01*
X86951724Y-52705026D01*
X86835999Y-52799999D01*
X86812201Y-52828997D01*
X85791199Y-53850000D01*
X74878043Y-53850000D01*
X74774637Y-53695241D01*
X74574759Y-53495363D01*
X74342241Y-53340000D01*
X74574759Y-53184637D01*
X74774637Y-52984759D01*
X74931680Y-52749727D01*
X75039853Y-52488574D01*
X75095000Y-52211335D01*
X75095000Y-51928665D01*
X75039853Y-51651426D01*
X74931680Y-51390273D01*
X74774637Y-51155241D01*
X74574759Y-50955363D01*
X74342241Y-50800000D01*
X74574759Y-50644637D01*
X74774637Y-50444759D01*
X74931680Y-50209727D01*
X75039853Y-49948574D01*
X75095000Y-49671335D01*
X75095000Y-49388665D01*
X75039853Y-49111426D01*
X74931680Y-48850273D01*
X74774637Y-48615241D01*
X74574759Y-48415363D01*
X74342241Y-48260000D01*
X74574759Y-48104637D01*
X74715194Y-47964202D01*
X74769995Y-48046218D01*
X74889782Y-48166005D01*
X75030637Y-48260122D01*
X75187147Y-48324951D01*
X75353297Y-48358000D01*
X75522703Y-48358000D01*
X75688853Y-48324951D01*
X75845363Y-48260122D01*
X75986218Y-48166005D01*
X76106005Y-48046218D01*
X76200122Y-47905363D01*
X76264951Y-47748853D01*
X76298000Y-47582703D01*
X76298000Y-47413297D01*
X76264951Y-47247147D01*
X76200122Y-47090637D01*
X76198000Y-47087461D01*
X76198000Y-46800950D01*
X76375875Y-46978825D01*
X76651853Y-47163228D01*
X76958504Y-47290246D01*
X77284042Y-47355000D01*
X77615958Y-47355000D01*
X77941496Y-47290246D01*
X78248147Y-47163228D01*
X78524125Y-46978825D01*
X78758825Y-46744125D01*
X78943228Y-46468147D01*
X79070246Y-46161496D01*
X79135000Y-45835958D01*
X79135000Y-45504042D01*
X79070246Y-45178504D01*
X78943228Y-44871853D01*
X78758825Y-44595875D01*
X78524125Y-44361175D01*
X78248147Y-44176772D01*
X77941496Y-44049754D01*
X77615958Y-43985000D01*
X77478177Y-43985000D01*
X77538144Y-43895253D01*
X77651971Y-43620451D01*
X77710000Y-43328722D01*
X77710000Y-43031278D01*
X77651971Y-42739549D01*
X77538144Y-42464747D01*
X77372893Y-42217431D01*
X77162569Y-42007107D01*
X76915253Y-41841856D01*
X76640451Y-41728029D01*
X76348722Y-41670000D01*
X76051278Y-41670000D01*
X75759549Y-41728029D01*
X75484747Y-41841856D01*
X75237431Y-42007107D01*
X75027107Y-42217431D01*
X74861856Y-42464747D01*
X74748029Y-42739549D01*
X74690000Y-43031278D01*
X74690000Y-43328722D01*
X74720264Y-43480868D01*
X74574759Y-43335363D01*
X74339727Y-43178320D01*
X74078574Y-43070147D01*
X73801335Y-43015000D01*
X73518665Y-43015000D01*
X73241426Y-43070147D01*
X73211506Y-43082540D01*
X73173501Y-42818037D01*
X73074572Y-42537526D01*
X72997868Y-42394025D01*
X72746240Y-42313365D01*
X71879605Y-43180000D01*
X71893748Y-43194143D01*
X71714143Y-43373748D01*
X71700000Y-43359605D01*
X71685858Y-43373748D01*
X71506253Y-43194143D01*
X71520395Y-43180000D01*
X70653760Y-42313365D01*
X70402132Y-42394025D01*
X70273733Y-42662329D01*
X70200145Y-42950526D01*
X70184196Y-43247543D01*
X70226499Y-43541963D01*
X70325428Y-43822474D01*
X70402132Y-43965975D01*
X70461483Y-43985000D01*
X70274042Y-43985000D01*
X69948504Y-44049754D01*
X69641853Y-44176772D01*
X69365875Y-44361175D01*
X69290000Y-44437050D01*
X69290000Y-42133760D01*
X70833365Y-42133760D01*
X71700000Y-43000395D01*
X72566635Y-42133760D01*
X72485975Y-41882132D01*
X72217671Y-41753733D01*
X71929474Y-41680145D01*
X71632457Y-41664196D01*
X71338037Y-41706499D01*
X71057526Y-41805428D01*
X70914025Y-41882132D01*
X70833365Y-42133760D01*
X69290000Y-42133760D01*
X69290000Y-41350000D01*
X104827332Y-41350000D01*
X104837049Y-41398853D01*
G36*
X70043748Y-49515858D02*
G01*
X70029605Y-49530000D01*
X70043748Y-49544143D01*
X69864143Y-49723748D01*
X69850000Y-49709605D01*
X69835858Y-49723748D01*
X69656253Y-49544143D01*
X69670395Y-49530000D01*
X69656253Y-49515858D01*
X69835858Y-49336253D01*
X69850000Y-49350395D01*
X69864143Y-49336253D01*
X70043748Y-49515858D01*
G37*
X70043748Y-49515858D02*
X70029605Y-49530000D01*
X70043748Y-49544143D01*
X69864143Y-49723748D01*
X69850000Y-49709605D01*
X69835858Y-49723748D01*
X69656253Y-49544143D01*
X69670395Y-49530000D01*
X69656253Y-49515858D01*
X69835858Y-49336253D01*
X69850000Y-49350395D01*
X69864143Y-49336253D01*
X70043748Y-49515858D01*
M02*
