PCBNEW-LibModule-V1  
# encoding utf-8
Units mm
$INDEX
SOP8-1369
$EndINDEX
$MODULE SOP8-1369
Po 0 0 0 15 00000000 00000000 ~~
Li SOP8-1369
Cd <b>SOP 8  (CASE 1369-01)</b>
Sc 00000000
At SMD
Op 0 0 0
.SolderMask 0
.SolderPaste 0
T0 -4.17224 7.41728 0.834342 0.834342 0 0.05 N V 21 "SOP8-1369"
T1 -1.2025 -0.0935248 0.673306 0.673306 0 0.05 N V 21 "VAL**"
DA -5.842 -5.842 -5.842 -6.1595 -900 0.2032 21
DS -5.842 -6.1595 5.842 -6.1595 0.2032 21
DA 5.842 -5.842 6.1595 -5.842 -900 0.2032 21
DA 5.842 5.842 5.842 6.1595 -900 0.2032 21
DS 5.842 6.1595 -5.842 6.1595 0.2032 21
DA -5.842 5.842 -6.1595 5.842 -900 0.2032 21
DS -3.81 -6.223 -3.81 -10.16 0.0508 24
DS -3.81 -10.16 -4.445 -10.16 0.0508 24
DS -4.445 -10.16 -3.81 -12.7 0.0508 24
DS -3.81 -12.7 -1.27 -12.7 0.0508 24
DS -1.27 -12.7 -0.635 -10.16 0.0508 24
DS -0.635 -10.16 -1.27 -10.16 0.0508 24
DS -1.27 -10.16 -1.27 -6.223 0.0508 24
DS -3.81 -10.16 -1.27 -10.16 0.0508 24
DC -4.7625 -3.81 -4.1635 -3.81 0 21
DP 0 0 0 0 4 0.381 24
Dl -9.35022 -4.318
Dl -6.223 -4.318
Dl -6.223 -3.47295
Dl -9.35022 -3.47295
DP 0 0 0 0 4 0.381 24
Dl 8.89 -3.47382
Dl 6.54672 -3.47382
Dl 6.54672 -4.318
Dl 8.89 -4.318
DP 0 0 0 0 4 0.381 24
Dl -9.33003 -1.778
Dl -6.223 -1.778
Dl -6.223 -0.799719
Dl -9.33003 -0.799719
DP 0 0 0 0 4 0.381 24
Dl -9.3229 0.762
Dl -6.223 0.762
Dl -6.223 1.86459
Dl -9.3229 1.86459
DP 0 0 0 0 4 0.381 24
Dl -9.37326 3.302
Dl -6.223 3.302
Dl -6.223 4.5527
Dl -9.37326 4.5527
DP 0 0 0 0 4 0.381 24
Dl 8.89 -0.802386
Dl 6.55284 -0.802386
Dl 6.55284 -1.778
Dl 8.89 -1.778
DP 0 0 0 0 4 0.381 24
Dl 8.89 1.87381
Dl 6.55821 1.87381
Dl 6.55821 0.762
Dl 8.89 0.762
DP 0 0 0 0 4 0.381 24
Dl 8.89 4.52207
Dl 6.51705 4.52207
Dl 6.51705 3.302
Dl 8.89 3.302
$PAD
Sh "1" R 2.54 1.524 0 0 0
At SMD N 00888000
.SolderMask 0
.SolderPaste 0
Ne 0 ""
Po -8.382 -3.81
$EndPAD
$PAD
Sh "2" R 2.54 1.524 0 0 0
At SMD N 00888000
.SolderMask 0
.SolderPaste 0
Ne 0 ""
Po -8.382 -1.27
$EndPAD
$PAD
Sh "3" R 2.54 1.524 0 0 0
At SMD N 00888000
.SolderMask 0
.SolderPaste 0
Ne 0 ""
Po -8.382 1.27
$EndPAD
$PAD
Sh "4" R 2.54 1.524 0 0 0
At SMD N 00888000
.SolderMask 0
.SolderPaste 0
Ne 0 ""
Po -8.382 3.81
$EndPAD
$PAD
Sh "5" R 2.54 1.524 0 0 0
At SMD N 00888000
.SolderMask 0
.SolderPaste 0
Ne 0 ""
Po 8.382 3.81
$EndPAD
$PAD
Sh "6" R 2.54 1.524 0 0 0
At SMD N 00888000
.SolderMask 0
.SolderPaste 0
Ne 0 ""
Po 8.382 1.27
$EndPAD
$PAD
Sh "7" R 2.54 1.524 0 0 0
At SMD N 00888000
.SolderMask 0
.SolderPaste 0
Ne 0 ""
Po 8.382 -1.27
$EndPAD
$PAD
Sh "8" R 2.54 1.524 0 0 0
At SMD N 00888000
.SolderMask 0
.SolderPaste 0
Ne 0 ""
Po 8.382 -3.81
$EndPAD
$EndMODULE SOP8-1369
