G04 #@! TF.GenerationSoftware,KiCad,Pcbnew,5.1.5+dfsg1-2*
G04 #@! TF.CreationDate,2020-01-10T10:39:52+05:30*
G04 #@! TF.ProjectId,flipmouse,666c6970-6d6f-4757-9365-2e6b69636164,rev?*
G04 #@! TF.SameCoordinates,Original*
G04 #@! TF.FileFunction,Profile,NP*
%FSLAX46Y46*%
G04 Gerber Fmt 4.6, Leading zero omitted, Abs format (unit mm)*
G04 Created by KiCad (PCBNEW 5.1.5+dfsg1-2) date 2020-01-10 10:39:52*
%MOMM*%
%LPD*%
G04 APERTURE LIST*
%ADD10C,0.150000*%
G04 APERTURE END LIST*
D10*
X116840000Y-76200000D02*
X116840000Y-40640000D01*
X68580000Y-76200000D02*
X116840000Y-76200000D01*
X68580000Y-40640000D02*
X68580000Y-76200000D01*
X68580000Y-40640000D02*
X116840000Y-40640000D01*
M02*
