G04 #@! TF.FileFunction,Profile,NP*
%FSLAX46Y46*%
G04 Gerber Fmt 4.6, Leading zero omitted, Abs format (unit mm)*
G04 Created by KiCad (PCBNEW 4.0.5+dfsg1-4) date Tue Oct 23 17:58:09 2018*
%MOMM*%
%LPD*%
G01*
G04 APERTURE LIST*
%ADD10C,0.100000*%
%ADD11C,0.150000*%
G04 APERTURE END LIST*
D10*
D11*
X116840000Y-76200000D02*
X116840000Y-40640000D01*
X68580000Y-76200000D02*
X116840000Y-76200000D01*
X68580000Y-40640000D02*
X68580000Y-76200000D01*
X68580000Y-40640000D02*
X116840000Y-40640000D01*
M02*
