(module MPXV7007GP (layer F.Cu) (tedit 0)
  (descr "<b>SOP 8  (CASE 1369-01)</b>")
  (attr smd)
  (fp_text reference MPX1 (at -4.17224 7.41728) (layer F.SilkS)
    (effects (font (size 0.834342 0.834342) (thickness 0.05)))
  )
  (fp_text value MPXV7007GP (at -1.2025 -0.093525) (layer F.SilkS)
    (effects (font (size 0.673306 0.673306) (thickness 0.05)))
  )
  (fp_arc (start -5.842 -5.842) (end -5.842 -6.1595) (angle -90) (layer F.SilkS) (width 0.2032))
  (fp_line (start -5.842 -6.1595) (end 5.842 -6.1595) (layer F.SilkS) (width 0.2032))
  (fp_arc (start 5.842 -5.842) (end 6.1595 -5.842) (angle -90) (layer F.SilkS) (width 0.2032))
  (fp_arc (start 5.842 5.842) (end 5.842 6.1595) (angle -90) (layer F.SilkS) (width 0.2032))
  (fp_line (start 5.842 6.1595) (end -5.842 6.1595) (layer F.SilkS) (width 0.2032))
  (fp_arc (start -5.842 5.842) (end -6.1595 5.842) (angle -90) (layer F.SilkS) (width 0.2032))
  (fp_line (start 0.508 -6.223) (end 0.508 -10.16) (layer Dwgs.User) (width 0.0508))
  (fp_line (start 0.508 -10.16) (end -0.127 -10.16) (layer Dwgs.User) (width 0.0508))
  (fp_line (start -0.127 -10.16) (end 0.508 -12.7) (layer Dwgs.User) (width 0.0508))
  (fp_line (start 0.508 -12.7) (end 3.048 -12.7) (layer Dwgs.User) (width 0.0508))
  (fp_line (start 3.048 -12.7) (end 3.683 -10.16) (layer Dwgs.User) (width 0.0508))
  (fp_line (start 3.683 -10.16) (end 3.048 -10.16) (layer Dwgs.User) (width 0.0508))
  (fp_line (start 3.048 -10.16) (end 3.048 -6.223) (layer Dwgs.User) (width 0.0508))
  (fp_line (start 0.508 -10.16) (end 3.048 -10.16) (layer Dwgs.User) (width 0.0508))
  (fp_circle (center -4.7625 -3.81) (end -4.1635 -3.81) (layer F.SilkS) (width 0))
  (fp_poly (pts (xy -9.35022 -4.318) (xy -6.223 -4.318) (xy -6.223 -3.47295) (xy -9.35022 -3.47295)) (layer Dwgs.User) (width 0.381))
  (fp_poly (pts (xy 8.89 -3.47382) (xy 6.54672 -3.47382) (xy 6.54672 -4.318) (xy 8.89 -4.318)) (layer Dwgs.User) (width 0.381))
  (fp_poly (pts (xy -9.33003 -1.778) (xy -6.223 -1.778) (xy -6.223 -0.799719) (xy -9.33003 -0.799719)) (layer Dwgs.User) (width 0.381))
  (fp_poly (pts (xy -9.3229 0.762) (xy -6.223 0.762) (xy -6.223 1.86459) (xy -9.3229 1.86459)) (layer Dwgs.User) (width 0.381))
  (fp_poly (pts (xy -9.37326 3.302) (xy -6.223 3.302) (xy -6.223 4.5527) (xy -9.37326 4.5527)) (layer Dwgs.User) (width 0.381))
  (fp_poly (pts (xy 8.89 -0.802386) (xy 6.55284 -0.802386) (xy 6.55284 -1.778) (xy 8.89 -1.778)) (layer Dwgs.User) (width 0.381))
  (fp_poly (pts (xy 8.89 1.87381) (xy 6.55821 1.87381) (xy 6.55821 0.762) (xy 8.89 0.762)) (layer Dwgs.User) (width 0.381))
  (fp_poly (pts (xy 8.89 4.52207) (xy 6.51705 4.52207) (xy 6.51705 3.302) (xy 8.89 3.302)) (layer Dwgs.User) (width 0.381))
  (pad 1 smd rect (at -8.382 -3.81) (size 2.54 1.524) (layers F.Cu F.Paste F.Mask))
  (pad 2 smd rect (at -8.382 -1.27) (size 2.54 1.524) (layers F.Cu F.Paste F.Mask))
  (pad 3 smd rect (at -8.382 1.27) (size 2.54 1.524) (layers F.Cu F.Paste F.Mask))
  (pad 4 smd rect (at -8.382 3.81) (size 2.54 1.524) (layers F.Cu F.Paste F.Mask))
  (pad 5 smd rect (at 8.382 3.81) (size 2.54 1.524) (layers F.Cu F.Paste F.Mask))
  (pad 6 smd rect (at 8.382 1.27) (size 2.54 1.524) (layers F.Cu F.Paste F.Mask))
  (pad 7 smd rect (at 8.382 -1.27) (size 2.54 1.524) (layers F.Cu F.Paste F.Mask))
  (pad 8 smd rect (at 8.382 -3.81) (size 2.54 1.524) (layers F.Cu F.Paste F.Mask))
  (model ../../../../../home/vaisakh/work/CircuitDesigns/customFootprints/Mpx7007GP.wrl
    (at (xyz 0 0 0.16))
    (scale (xyz 0.423 0.423 0.423))
    (rotate (xyz 0 0 180))
  )
)
