G04 #@! TF.GenerationSoftware,KiCad,Pcbnew,5.1.5+dfsg1-2*
G04 #@! TF.CreationDate,2020-01-10T10:39:52+05:30*
G04 #@! TF.ProjectId,flipmouse,666c6970-6d6f-4757-9365-2e6b69636164,rev?*
G04 #@! TF.SameCoordinates,Original*
G04 #@! TF.FileFunction,Legend,Top*
G04 #@! TF.FilePolarity,Positive*
%FSLAX46Y46*%
G04 Gerber Fmt 4.6, Leading zero omitted, Abs format (unit mm)*
G04 Created by KiCad (PCBNEW 5.1.5+dfsg1-2) date 2020-01-10 10:39:52*
%MOMM*%
%LPD*%
G04 APERTURE LIST*
%ADD10C,0.150000*%
G04 APERTURE END LIST*
D10*
X90170000Y-73660000D02*
X90170000Y-43180000D01*
X90170000Y-73660000D02*
X85090000Y-73660000D01*
X85090000Y-73660000D02*
X85090000Y-76200000D01*
X85090000Y-76200000D02*
X77470000Y-76200000D01*
X77470000Y-76200000D02*
X77470000Y-73660000D01*
X77470000Y-73660000D02*
X72390000Y-73660000D01*
X72390000Y-73660000D02*
X72390000Y-43180000D01*
X72390000Y-43180000D02*
X90170000Y-43180000D01*
X106550000Y-63670000D02*
X109350000Y-63670000D01*
X109350000Y-63670000D02*
X109350000Y-50630000D01*
X109350000Y-50630000D02*
X106550000Y-50630000D01*
X106550000Y-50630000D02*
X106550000Y-63670000D01*
X106550000Y-60960000D02*
X109350000Y-60960000D01*
X90254000Y-53972000D02*
X90254000Y-56772000D01*
X90254000Y-56772000D02*
X103294000Y-56772000D01*
X103294000Y-56772000D02*
X103294000Y-53972000D01*
X103294000Y-53972000D02*
X90254000Y-53972000D01*
X92964000Y-53972000D02*
X92964000Y-56772000D01*
X68580000Y-57150000D02*
X68580000Y-52070000D01*
X68580000Y-52070000D02*
X71120000Y-52070000D01*
X71120000Y-52070000D02*
X71120000Y-57150000D01*
X71120000Y-57150000D02*
X68580000Y-57150000D01*
X69850000Y-57150000D02*
X69850000Y-58420000D01*
X69850000Y-52070000D02*
X69850000Y-50800000D01*
X92750000Y-78330000D02*
X95250000Y-78330000D01*
X92250000Y-67830000D02*
X92250000Y-66080000D01*
X92250000Y-67830000D02*
X92250000Y-68080000D01*
X92250000Y-71080000D02*
X92250000Y-69580000D01*
X98250000Y-69580000D02*
X98250000Y-71080000D01*
X98250000Y-68080000D02*
X98250000Y-66080000D01*
X95000000Y-64330000D02*
X93800000Y-64330000D01*
X95000000Y-64330000D02*
X96500000Y-64330000D01*
X98250000Y-75830000D02*
X98250000Y-74780000D01*
X94500000Y-75830000D02*
X98250000Y-75830000D01*
X92250000Y-75830000D02*
X92250000Y-74780000D01*
X92250000Y-75830000D02*
X94500000Y-75830000D01*
X92750000Y-75830000D02*
X92750000Y-78330000D01*
X95250000Y-78330000D02*
X97750000Y-78330000D01*
X97750000Y-78330000D02*
X97750000Y-75830000D01*
X105450000Y-78330000D02*
X107950000Y-78330000D01*
X104950000Y-67830000D02*
X104950000Y-66080000D01*
X104950000Y-67830000D02*
X104950000Y-68080000D01*
X104950000Y-71080000D02*
X104950000Y-69580000D01*
X110950000Y-69580000D02*
X110950000Y-71080000D01*
X110950000Y-68080000D02*
X110950000Y-66080000D01*
X107700000Y-64330000D02*
X106500000Y-64330000D01*
X107700000Y-64330000D02*
X109200000Y-64330000D01*
X110950000Y-75830000D02*
X110950000Y-74780000D01*
X107200000Y-75830000D02*
X110950000Y-75830000D01*
X104950000Y-75830000D02*
X104950000Y-74780000D01*
X104950000Y-75830000D02*
X107200000Y-75830000D01*
X105450000Y-75830000D02*
X105450000Y-78330000D01*
X107950000Y-78330000D02*
X110450000Y-78330000D01*
X110450000Y-78330000D02*
X110450000Y-75830000D01*
X101560000Y-38510000D02*
X99060000Y-38510000D01*
X102060000Y-49010000D02*
X102060000Y-50760000D01*
X102060000Y-49010000D02*
X102060000Y-48760000D01*
X102060000Y-45760000D02*
X102060000Y-47260000D01*
X96060000Y-47260000D02*
X96060000Y-45760000D01*
X96060000Y-48760000D02*
X96060000Y-50760000D01*
X99310000Y-52510000D02*
X100510000Y-52510000D01*
X99310000Y-52510000D02*
X97810000Y-52510000D01*
X96060000Y-41010000D02*
X96060000Y-42060000D01*
X99810000Y-41010000D02*
X96060000Y-41010000D01*
X102060000Y-41010000D02*
X102060000Y-42060000D01*
X102060000Y-41010000D02*
X99810000Y-41010000D01*
X101560000Y-41010000D02*
X101560000Y-38510000D01*
X99060000Y-38510000D02*
X96560000Y-38510000D01*
X96560000Y-38510000D02*
X96560000Y-41010000D01*
X112492000Y-51790000D02*
X112492000Y-53340000D01*
X113792000Y-51790000D02*
X112492000Y-51790000D01*
X117983000Y-53213000D02*
X123825000Y-53213000D01*
X123825000Y-53213000D02*
X123825000Y-53467000D01*
X123825000Y-53467000D02*
X117983000Y-53467000D01*
X117983000Y-53467000D02*
X117983000Y-53340000D01*
X117983000Y-53340000D02*
X123825000Y-53340000D01*
X115316000Y-53086000D02*
X114935000Y-53086000D01*
X115316000Y-53594000D02*
X114935000Y-53594000D01*
X115316000Y-55626000D02*
X114935000Y-55626000D01*
X115316000Y-56134000D02*
X114935000Y-56134000D01*
X115316000Y-58166000D02*
X114935000Y-58166000D01*
X115316000Y-58674000D02*
X114935000Y-58674000D01*
X115316000Y-60706000D02*
X114935000Y-60706000D01*
X115316000Y-61214000D02*
X114935000Y-61214000D01*
X115316000Y-63754000D02*
X114935000Y-63754000D01*
X115316000Y-63246000D02*
X114935000Y-63246000D01*
X117856000Y-54610000D02*
X117856000Y-52070000D01*
X123952000Y-53594000D02*
X117856000Y-53594000D01*
X123952000Y-53086000D02*
X123952000Y-53594000D01*
X117856000Y-53086000D02*
X123952000Y-53086000D01*
X115316000Y-54610000D02*
X117856000Y-54610000D01*
X115316000Y-52070000D02*
X115316000Y-54610000D01*
X115316000Y-52070000D02*
X117856000Y-52070000D01*
X115316000Y-57150000D02*
X117856000Y-57150000D01*
X115316000Y-57150000D02*
X115316000Y-59690000D01*
X115316000Y-59690000D02*
X117856000Y-59690000D01*
X117856000Y-58166000D02*
X123952000Y-58166000D01*
X123952000Y-58166000D02*
X123952000Y-58674000D01*
X123952000Y-58674000D02*
X117856000Y-58674000D01*
X117856000Y-59690000D02*
X117856000Y-57150000D01*
X117856000Y-57150000D02*
X117856000Y-54610000D01*
X123952000Y-56134000D02*
X117856000Y-56134000D01*
X123952000Y-55626000D02*
X123952000Y-56134000D01*
X117856000Y-55626000D02*
X123952000Y-55626000D01*
X115316000Y-57150000D02*
X117856000Y-57150000D01*
X115316000Y-54610000D02*
X115316000Y-57150000D01*
X115316000Y-54610000D02*
X117856000Y-54610000D01*
X115316000Y-62230000D02*
X117856000Y-62230000D01*
X115316000Y-62230000D02*
X115316000Y-64770000D01*
X115316000Y-64770000D02*
X117856000Y-64770000D01*
X117856000Y-63246000D02*
X123952000Y-63246000D01*
X123952000Y-63246000D02*
X123952000Y-63754000D01*
X123952000Y-63754000D02*
X117856000Y-63754000D01*
X117856000Y-64770000D02*
X117856000Y-62230000D01*
X117856000Y-62230000D02*
X117856000Y-59690000D01*
X123952000Y-61214000D02*
X117856000Y-61214000D01*
X123952000Y-60706000D02*
X123952000Y-61214000D01*
X117856000Y-60706000D02*
X123952000Y-60706000D01*
X115316000Y-62230000D02*
X117856000Y-62230000D01*
X115316000Y-59690000D02*
X115316000Y-62230000D01*
X115316000Y-59690000D02*
X117856000Y-59690000D01*
X106002380Y-56570476D02*
X105526190Y-56903809D01*
X106002380Y-57141904D02*
X105002380Y-57141904D01*
X105002380Y-56760952D01*
X105050000Y-56665714D01*
X105097619Y-56618095D01*
X105192857Y-56570476D01*
X105335714Y-56570476D01*
X105430952Y-56618095D01*
X105478571Y-56665714D01*
X105526190Y-56760952D01*
X105526190Y-57141904D01*
X106002380Y-56141904D02*
X105002380Y-56141904D01*
X106002380Y-55570476D01*
X105002380Y-55570476D01*
X106002380Y-54570476D02*
X106002380Y-55141904D01*
X106002380Y-54856190D02*
X105002380Y-54856190D01*
X105145238Y-54951428D01*
X105240476Y-55046666D01*
X105288095Y-55141904D01*
X97353523Y-53424380D02*
X97020190Y-52948190D01*
X96782095Y-53424380D02*
X96782095Y-52424380D01*
X97163047Y-52424380D01*
X97258285Y-52472000D01*
X97305904Y-52519619D01*
X97353523Y-52614857D01*
X97353523Y-52757714D01*
X97305904Y-52852952D01*
X97258285Y-52900571D01*
X97163047Y-52948190D01*
X96782095Y-52948190D01*
X97782095Y-53424380D02*
X97782095Y-52424380D01*
X98353523Y-53424380D01*
X98353523Y-52424380D01*
X98782095Y-52519619D02*
X98829714Y-52472000D01*
X98924952Y-52424380D01*
X99163047Y-52424380D01*
X99258285Y-52472000D01*
X99305904Y-52519619D01*
X99353523Y-52614857D01*
X99353523Y-52710095D01*
X99305904Y-52852952D01*
X98734476Y-53424380D01*
X99353523Y-53424380D01*
X66802260Y-54527746D02*
X66326070Y-54861080D01*
X66802260Y-55099175D02*
X65802260Y-55099175D01*
X65802260Y-54718222D01*
X65849880Y-54622984D01*
X65897499Y-54575365D01*
X65992737Y-54527746D01*
X66135594Y-54527746D01*
X66230832Y-54575365D01*
X66278451Y-54622984D01*
X66326070Y-54718222D01*
X66326070Y-55099175D01*
X66802260Y-53575365D02*
X66802260Y-54146794D01*
X66802260Y-53861080D02*
X65802260Y-53861080D01*
X65945118Y-53956318D01*
X66040356Y-54051556D01*
X66087975Y-54146794D01*
X99162380Y-69793333D02*
X99876666Y-69793333D01*
X100019523Y-69840952D01*
X100114761Y-69936190D01*
X100162380Y-70079047D01*
X100162380Y-70174285D01*
X100162380Y-68793333D02*
X100162380Y-69364761D01*
X100162380Y-69079047D02*
X99162380Y-69079047D01*
X99305238Y-69174285D01*
X99400476Y-69269523D01*
X99448095Y-69364761D01*
X111862380Y-69793333D02*
X112576666Y-69793333D01*
X112719523Y-69840952D01*
X112814761Y-69936190D01*
X112862380Y-70079047D01*
X112862380Y-70174285D01*
X111862380Y-69412380D02*
X111862380Y-68793333D01*
X112243333Y-69126666D01*
X112243333Y-68983809D01*
X112290952Y-68888571D01*
X112338571Y-68840952D01*
X112433809Y-68793333D01*
X112671904Y-68793333D01*
X112767142Y-68840952D01*
X112814761Y-68888571D01*
X112862380Y-68983809D01*
X112862380Y-69269523D01*
X112814761Y-69364761D01*
X112767142Y-69412380D01*
X94052380Y-47713333D02*
X94766666Y-47713333D01*
X94909523Y-47760952D01*
X95004761Y-47856190D01*
X95052380Y-47999047D01*
X95052380Y-48094285D01*
X94147619Y-47284761D02*
X94100000Y-47237142D01*
X94052380Y-47141904D01*
X94052380Y-46903809D01*
X94100000Y-46808571D01*
X94147619Y-46760952D01*
X94242857Y-46713333D01*
X94338095Y-46713333D01*
X94480952Y-46760952D01*
X95052380Y-47332380D01*
X95052380Y-46713333D01*
X113053904Y-48692380D02*
X113053904Y-47692380D01*
X113434857Y-47692380D01*
X113530095Y-47740000D01*
X113577714Y-47787619D01*
X113625333Y-47882857D01*
X113625333Y-48025714D01*
X113577714Y-48120952D01*
X113530095Y-48168571D01*
X113434857Y-48216190D01*
X113053904Y-48216190D01*
X114577714Y-48692380D02*
X114006285Y-48692380D01*
X114292000Y-48692380D02*
X114292000Y-47692380D01*
X114196761Y-47835238D01*
X114101523Y-47930476D01*
X114006285Y-47978095D01*
M02*
