%!PS-Adobe-3.0
%%Creator: PCBNEW
%%CreationDate: Fri Jan 10 10:39:42 2020
%%Title: /home/ashiq/flipmouse/Circuit Design/FlipMouseIteration2/PCBPowerOutput/flip_new/flipmouse-drl_map.ps
%%Pages: 1
%%PageOrder: Ascend
%%BoundingBox: 0 0 596 842
%%DocumentMedia: A4 595 842 0 () ()
%%Orientation: Landscape
%%EndComments
%%BeginProlog
/line { newpath moveto lineto stroke } bind def
/cir0 { newpath 0 360 arc stroke } bind def
/cir1 { newpath 0 360 arc gsave fill grestore stroke } bind def
/cir2 { newpath 0 360 arc gsave fill grestore stroke } bind def
/arc0 { newpath arc stroke } bind def
/arc1 { newpath 4 index 4 index moveto arc closepath gsave fill
    grestore stroke } bind def
/arc2 { newpath 4 index 4 index moveto arc closepath gsave fill
    grestore stroke } bind def
/poly0 { stroke } bind def
/poly1 { closepath gsave fill grestore stroke } bind def
/poly2 { closepath gsave fill grestore stroke } bind def
/rect0 { rectstroke } bind def
/rect1 { rectfill } bind def
/rect2 { rectfill } bind def
/linemode0 { 0 setlinecap 0 setlinejoin 0 setlinewidth } bind def
/linemode1 { 1 setlinecap 1 setlinejoin } bind def
/dashedline { [200] 100 setdash } bind def
/solidline { [] 0 setdash } bind def
/phantomshow { moveto
    /KicadFont findfont 0.000001 scalefont setfont
    show } bind def
/textshow { gsave
    findfont exch scalefont setfont concat 1 scale 0 0 moveto show
    } bind def
/reencodefont {
  findfont dup length dict begin
  { 1 index /FID ne
    { def }
    { pop pop } ifelse
  } forall
  /Encoding ISOLatin1Encoding def
  currentdict
  end } bind def
/KicadFont /Helvetica reencodefont definefont pop
/KicadFont-Bold /Helvetica-Bold reencodefont definefont pop
/KicadFont-Oblique /Helvetica-Oblique reencodefont definefont pop
/KicadFont-BoldOblique /Helvetica-BoldOblique reencodefont definefont pop
%%EndProlog
%%Page: 1 1
%%BeginPageSetup
gsave
0.0072 0.0072 scale
linemode1
82680 0 translate 90 rotate
148.424 setlinewidth
%%EndPageSetup
0 0 0 setrgbcolor
175.304 setlinewidth
newpath
86665.5 37096.7 moveto
86665.5 78655.3 lineto
stroke
0 0 0 setrgbcolor
newpath
30264.5 37096.7 moveto
86665.5 37096.7 lineto
stroke
0 0 0 setrgbcolor
newpath
30264.5 78655.3 moveto
30264.5 37096.7 lineto
stroke
0 0 0 setrgbcolor
newpath
30264.5 78655.3 moveto
86665.5 78655.3 lineto
stroke
78.7394 setlinewidth
newpath
38162.5 70757.3 moveto
38396.2 70523.6 lineto
stroke
newpath
38396.2 70757.3 moveto
38162.5 70523.6 lineto
stroke
newpath
38459.3 51462.2 moveto
38693.1 51228.5 lineto
stroke
newpath
38693.1 51462.2 moveto
38459.3 51228.5 lineto
stroke
newpath
44990 47009.5 moveto
45223.7 46775.8 lineto
stroke
newpath
45223.7 47009.5 moveto
44990 46775.8 lineto
stroke
newpath
50926.9 52649.6 moveto
51160.7 52415.9 lineto
stroke
newpath
51160.7 52649.6 moveto
50926.9 52415.9 lineto
stroke
newpath
52411.2 39439.9 moveto
52644.9 39206.1 lineto
stroke
newpath
52644.9 39439.9 moveto
52411.2 39206.1 lineto
stroke
newpath
58348.1 52798 moveto
58581.9 52564.3 lineto
stroke
newpath
58581.9 52798 moveto
58348.1 52564.3 lineto
stroke
newpath
60574.5 53540.2 moveto
60808.2 53306.4 lineto
stroke
newpath
60808.2 53540.2 moveto
60574.5 53306.4 lineto
stroke
newpath
61613.5 47009.5 moveto
61847.2 46775.8 lineto
stroke
newpath
61847.2 47009.5 moveto
61613.5 46775.8 lineto
stroke
newpath
61910.3 51759.1 moveto
62144 51525.3 lineto
stroke
newpath
62144 51759.1 moveto
61910.3 51525.3 lineto
stroke
newpath
66956.7 65414.1 moveto
67190.5 65180.3 lineto
stroke
newpath
67190.5 65414.1 moveto
66956.7 65180.3 lineto
stroke
newpath
73190.5 48345.3 moveto
73424.3 48111.6 lineto
stroke
newpath
73424.3 48345.3 moveto
73190.5 48111.6 lineto
stroke
newpath
73487.4 78178.5 moveto
73721.1 77944.8 lineto
stroke
newpath
73721.1 78178.5 moveto
73487.4 77944.8 lineto
stroke
newpath
75862.1 69866.8 moveto
76095.9 69633 lineto
stroke
newpath
76095.9 69866.8 moveto
75862.1 69633 lineto
stroke
newpath
76752.7 51462.2 moveto
76986.4 51228.5 lineto
stroke
newpath
76986.4 51462.2 moveto
76752.7 51228.5 lineto
stroke
newpath
78385.4 48345.3 moveto
78619.1 48111.6 lineto
stroke
newpath
78619.1 48345.3 moveto
78385.4 48111.6 lineto
stroke
newpath
79721.2 66304.6 moveto
79954.9 66070.9 lineto
stroke
newpath
79954.9 66304.6 moveto
79721.2 66070.9 lineto
stroke
newpath
80314.9 67195.1 moveto
80548.6 66961.4 lineto
stroke
newpath
80548.6 67195.1 moveto
80314.9 66961.4 lineto
stroke
newpath
82095.9 49681.1 moveto
82329.7 49447.4 lineto
stroke
newpath
82329.7 49681.1 moveto
82095.9 49447.4 lineto
stroke
newpath
85064.4 50868.5 moveto
85298.2 50634.8 lineto
stroke
newpath
85298.2 50868.5 moveto
85064.4 50634.8 lineto
stroke
57277.6 61438.2 467.477 cir0
60246.1 61438.2 467.477 cir0
63214.6 61438.2 467.477 cir0
66183 61438.2 467.477 cir0
69151.5 61438.2 467.477 cir0
76275.9 65297.2 467.477 cir0
76275.9 62328.7 467.477 cir0
76275.9 59360.2 467.477 cir0
76275.9 56391.8 467.477 cir0
76275.9 53423.3 467.477 cir0
newpath
33910.8 76265.4 moveto
33910.8 75108.4 lineto
stroke
newpath
33332.3 75686.9 moveto
34489.3 75686.9 lineto
stroke
newpath
39169.9 76265.4 moveto
39169.9 75108.4 lineto
stroke
newpath
38591.4 75686.9 moveto
39748.4 75686.9 lineto
stroke
newpath
51721.6 76265.4 moveto
51721.6 75108.4 lineto
stroke
newpath
51143.1 75686.9 moveto
52300.2 75686.9 lineto
stroke
newpath
56980.8 76265.4 moveto
56980.8 75108.4 lineto
stroke
newpath
56402.3 75686.9 moveto
57559.3 75686.9 lineto
stroke
newpath
39583.4 44104.3 moveto
39583.4 44931.4 lineto
38756.4 44931.4 lineto
38756.4 44104.3 lineto
39583.4 44104.3 lineto
poly0
newpath
51457.3 44104.3 moveto
51457.3 44931.4 lineto
50630.3 44931.4 lineto
50630.3 44104.3 lineto
51457.3 44104.3 lineto
poly0
newpath
32162.2 67852.2 moveto
32162.2 68679.2 lineto
31335.2 68679.2 lineto
31335.2 67852.2 lineto
32162.2 67852.2 lineto
poly0
newpath
32162.2 55978.2 moveto
32162.2 56805.3 lineto
31335.2 56805.3 lineto
31335.2 55978.2 lineto
32162.2 55978.2 lineto
poly0
newpath
44036.1 39651.6 moveto
44036.1 40478.7 lineto
43209.1 40478.7 lineto
43209.1 39651.6 lineto
44036.1 39651.6 lineto
poly0
newpath
47004.6 39651.6 moveto
47004.6 40478.7 lineto
46177.6 40478.7 lineto
46177.6 39651.6 lineto
47004.6 39651.6 lineto
poly0
newpath
69268.2 52107.4 moveto
69268.2 52934.4 lineto
68441.2 52934.4 lineto
68441.2 52107.4 lineto
69268.2 52107.4 lineto
poly0
newpath
69268.2 43225.7 moveto
69268.2 44052.7 lineto
68441.2 44052.7 lineto
68441.2 43225.7 lineto
69268.2 43225.7 lineto
poly0
newpath
83103.4 63219.3 moveto
83697.1 63813 lineto
83103.4 64406.6 lineto
82509.7 63813 lineto
83103.4 63219.3 lineto
poly0
newpath
83103.4 60250.8 moveto
83697.1 60844.5 lineto
83103.4 61438.2 lineto
82509.7 60844.5 lineto
83103.4 60250.8 lineto
poly0
newpath
83103.4 57282.3 moveto
83697.1 57876 lineto
83103.4 58469.7 lineto
82509.7 57876 lineto
83103.4 57282.3 lineto
poly0
newpath
83103.4 54313.8 moveto
83697.1 54907.5 lineto
83103.4 55501.2 lineto
82509.7 54907.5 lineto
83103.4 54313.8 lineto
poly0
newpath
83103.4 51345.4 moveto
83697.1 51939 lineto
83103.4 52532.7 lineto
82509.7 51939 lineto
83103.4 51345.4 lineto
poly0
newpath
35558.6 74845.4 moveto
36844.2 73559.8 lineto
stroke
newpath
36844.2 74845.4 moveto
35558.6 73559.8 lineto
stroke
36201.4 74202.6 642.78 cir0
newpath
35558.6 71876.9 moveto
36844.2 70591.4 lineto
stroke
newpath
36844.2 71876.9 moveto
35558.6 70591.4 lineto
stroke
36201.4 71234.1 642.78 cir0
newpath
35558.6 68908.4 moveto
36844.2 67622.9 lineto
stroke
newpath
36844.2 68908.4 moveto
35558.6 67622.9 lineto
stroke
36201.4 68265.7 642.78 cir0
newpath
35558.6 65940 moveto
36844.2 64654.4 lineto
stroke
newpath
36844.2 65940 moveto
35558.6 64654.4 lineto
stroke
36201.4 65297.2 642.78 cir0
newpath
35558.6 62971.5 moveto
36844.2 61685.9 lineto
stroke
newpath
36844.2 62971.5 moveto
35558.6 61685.9 lineto
stroke
36201.4 62328.7 642.78 cir0
newpath
35558.6 60003 moveto
36844.2 58717.5 lineto
stroke
newpath
36844.2 60003 moveto
35558.6 58717.5 lineto
stroke
36201.4 59360.2 642.78 cir0
newpath
35558.6 57034.5 moveto
36844.2 55749 lineto
stroke
newpath
36844.2 57034.5 moveto
35558.6 55749 lineto
stroke
36201.4 56391.8 642.78 cir0
newpath
35558.6 54066.1 moveto
36844.2 52780.5 lineto
stroke
newpath
36844.2 54066.1 moveto
35558.6 52780.5 lineto
stroke
36201.4 53423.3 642.78 cir0
newpath
35558.6 51097.6 moveto
36844.2 49812 lineto
stroke
newpath
36844.2 51097.6 moveto
35558.6 49812 lineto
stroke
36201.4 50454.8 642.78 cir0
newpath
35558.6 48129.1 moveto
36844.2 46843.5 lineto
stroke
newpath
36844.2 48129.1 moveto
35558.6 46843.5 lineto
stroke
36201.4 47486.3 642.78 cir0
newpath
35558.6 45160.6 moveto
36844.2 43875.1 lineto
stroke
newpath
36844.2 45160.6 moveto
35558.6 43875.1 lineto
stroke
36201.4 44517.9 642.78 cir0
newpath
35558.6 42192.2 moveto
36844.2 40906.6 lineto
stroke
newpath
36844.2 42192.2 moveto
35558.6 40906.6 lineto
stroke
36201.4 41549.4 642.78 cir0
newpath
53369.5 74845.4 moveto
54655.1 73559.8 lineto
stroke
newpath
54655.1 74845.4 moveto
53369.5 73559.8 lineto
stroke
54012.3 74202.6 642.78 cir0
newpath
53369.5 71876.9 moveto
54655.1 70591.4 lineto
stroke
newpath
54655.1 71876.9 moveto
53369.5 70591.4 lineto
stroke
54012.3 71234.1 642.78 cir0
newpath
53369.5 68908.4 moveto
54655.1 67622.9 lineto
stroke
newpath
54655.1 68908.4 moveto
53369.5 67622.9 lineto
stroke
54012.3 68265.7 642.78 cir0
newpath
53369.5 65940 moveto
54655.1 64654.4 lineto
stroke
newpath
54655.1 65940 moveto
53369.5 64654.4 lineto
stroke
54012.3 65297.2 642.78 cir0
newpath
53369.5 62971.5 moveto
54655.1 61685.9 lineto
stroke
newpath
54655.1 62971.5 moveto
53369.5 61685.9 lineto
stroke
54012.3 62328.7 642.78 cir0
newpath
53369.5 60003 moveto
54655.1 58717.5 lineto
stroke
newpath
54655.1 60003 moveto
53369.5 58717.5 lineto
stroke
54012.3 59360.2 642.78 cir0
newpath
53369.5 57034.5 moveto
54655.1 55749 lineto
stroke
newpath
54655.1 57034.5 moveto
53369.5 55749 lineto
stroke
54012.3 56391.8 642.78 cir0
newpath
53369.5 54066.1 moveto
54655.1 52780.5 lineto
stroke
newpath
54655.1 54066.1 moveto
53369.5 52780.5 lineto
stroke
54012.3 53423.3 642.78 cir0
newpath
53369.5 51097.6 moveto
54655.1 49812 lineto
stroke
newpath
54655.1 51097.6 moveto
53369.5 49812 lineto
stroke
54012.3 50454.8 642.78 cir0
newpath
53369.5 48129.1 moveto
54655.1 46843.5 lineto
stroke
newpath
54655.1 48129.1 moveto
53369.5 46843.5 lineto
stroke
54012.3 47486.3 642.78 cir0
newpath
53369.5 45160.6 moveto
54655.1 43875.1 lineto
stroke
newpath
54655.1 45160.6 moveto
53369.5 43875.1 lineto
stroke
54012.3 44517.9 642.78 cir0
newpath
53369.5 42192.2 moveto
54655.1 40906.6 lineto
stroke
newpath
54655.1 42192.2 moveto
53369.5 40906.6 lineto
stroke
54012.3 41549.4 642.78 cir0
newpath
31678.6 73536.5 moveto
33197.9 72017.2 lineto
stroke
newpath
33197.9 73536.5 moveto
31678.6 72017.2 lineto
stroke
newpath
32438.2 73536.5 moveto
32438.2 72017.2 lineto
stroke
newpath
31678.6 72776.8 moveto
33197.9 72776.8 lineto
stroke
newpath
39871.1 73536.5 moveto
41390.4 72017.2 lineto
stroke
newpath
41390.4 73536.5 moveto
39871.1 72017.2 lineto
stroke
newpath
40630.8 73536.5 moveto
40630.8 72017.2 lineto
stroke
newpath
39871.1 72776.8 moveto
41390.4 72776.8 lineto
stroke
newpath
49489.4 73536.5 moveto
51008.7 72017.2 lineto
stroke
newpath
51008.7 73536.5 moveto
49489.4 72017.2 lineto
stroke
newpath
50249.1 73536.5 moveto
50249.1 72017.2 lineto
stroke
newpath
49489.4 72776.8 moveto
51008.7 72776.8 lineto
stroke
newpath
57682 73536.5 moveto
59201.3 72017.2 lineto
stroke
newpath
59201.3 73536.5 moveto
57682 72017.2 lineto
stroke
newpath
58441.6 73536.5 moveto
58441.6 72017.2 lineto
stroke
newpath
57682 72776.8 moveto
59201.3 72776.8 lineto
stroke
newpath
76147.3 73010.6 moveto
77199.1 71958.7 lineto
stroke
newpath
77199.1 73010.6 moveto
76147.3 71958.7 lineto
stroke
newpath
77045.1 72112.8 moveto
77045.1 72856.5 lineto
76301.3 72856.5 lineto
76301.3 72112.8 lineto
77045.1 72112.8 lineto
poly0
newpath
81289.5 73010.6 moveto
82341.4 71958.7 lineto
stroke
newpath
82341.4 73010.6 moveto
81289.5 71958.7 lineto
stroke
newpath
82187.3 72112.8 moveto
82187.3 72856.5 lineto
81443.6 72856.5 lineto
81443.6 72112.8 lineto
82187.3 72112.8 lineto
poly0
newpath
72740.6 46323.5 moveto
73967.7 45096.4 lineto
stroke
newpath
73967.7 46323.5 moveto
72740.6 45096.4 lineto
stroke
newpath
73354.1 45096.4 moveto
73967.7 45709.9 lineto
73354.1 46323.5 lineto
72740.6 45709.9 lineto
73354.1 45096.4 lineto
poly0
newpath
78584 46323.5 moveto
79811.2 45096.4 lineto
stroke
newpath
79811.2 46323.5 moveto
78584 45096.4 lineto
stroke
newpath
79197.6 45096.4 moveto
79811.2 45709.9 lineto
79197.6 46323.5 lineto
78584 45709.9 lineto
79197.6 45096.4 lineto
poly0
newpath
57898.2 46323.5 moveto
59125.3 45096.4 lineto
stroke
newpath
59125.3 46323.5 moveto
57898.2 45096.4 lineto
stroke
newpath
58511.7 45096.4 moveto
59125.3 45709.9 lineto
58511.7 46323.5 lineto
57898.2 45709.9 lineto
58511.7 45096.4 lineto
poly0
newpath
63741.6 46323.5 moveto
64968.8 45096.4 lineto
stroke
newpath
64968.8 46323.5 moveto
63741.6 45096.4 lineto
stroke
newpath
64355.2 45096.4 moveto
64968.8 45709.9 lineto
64355.2 46323.5 lineto
63741.6 45709.9 lineto
64355.2 45096.4 lineto
poly0
newpath
62350.9 70655.6 moveto
63578 69428.5 lineto
stroke
newpath
63578 70655.6 moveto
62350.9 69428.5 lineto
stroke
newpath
62964.5 69428.5 moveto
63578 70042.1 lineto
62964.5 70655.6 lineto
62350.9 70042.1 lineto
62964.5 69428.5 lineto
poly0
newpath
68194.4 70655.6 moveto
69421.5 69428.5 lineto
stroke
newpath
69421.5 70655.6 moveto
68194.4 69428.5 lineto
stroke
newpath
68807.9 69428.5 moveto
69421.5 70042.1 lineto
68807.9 70655.6 lineto
68194.4 70042.1 lineto
68807.9 69428.5 lineto
poly0
118.11 setlinewidth
0 0 0 setrgbcolor
0 0 0 setrgbcolor
newpath
31304.5 35175.5 moveto
31304.5 36356.6 lineto
31585.7 36356.6 lineto
31754.4 36300.3 lineto
31866.9 36187.9 lineto
31923.2 36075.4 lineto
31979.4 35850.4 lineto
31979.4 35681.7 lineto
31923.2 35456.7 lineto
31866.9 35344.2 lineto
31754.4 35231.7 lineto
31585.7 35175.5 lineto
31304.5 35175.5 lineto
stroke
newpath
32485.6 35175.5 moveto
32485.6 35962.9 lineto
stroke
newpath
32485.6 35737.9 moveto
32541.8 35850.4 lineto
32598.1 35906.6 lineto
32710.6 35962.9 lineto
32823 35962.9 lineto
stroke
newpath
33216.7 35175.5 moveto
33216.7 35962.9 lineto
stroke
newpath
33216.7 36356.6 moveto
33160.5 36300.3 lineto
33216.7 36244.1 lineto
33273 36300.3 lineto
33216.7 36356.6 lineto
33216.7 36244.1 lineto
stroke
newpath
33947.9 35175.5 moveto
33835.4 35231.7 lineto
33779.2 35344.2 lineto
33779.2 36356.6 lineto
stroke
newpath
34566.6 35175.5 moveto
34454.1 35231.7 lineto
34397.8 35344.2 lineto
34397.8 36356.6 lineto
stroke
newpath
35916.4 35175.5 moveto
35916.4 36356.6 lineto
36310.1 35512.9 lineto
36703.8 36356.6 lineto
36703.8 35175.5 lineto
stroke
newpath
37772.4 35175.5 moveto
37772.4 35794.2 lineto
37716.2 35906.6 lineto
37603.7 35962.9 lineto
37378.7 35962.9 lineto
37266.2 35906.6 lineto
stroke
newpath
37772.4 35231.7 moveto
37659.9 35175.5 lineto
37378.7 35175.5 lineto
37266.2 35231.7 lineto
37210 35344.2 lineto
37210 35456.7 lineto
37266.2 35569.2 lineto
37378.7 35625.4 lineto
37659.9 35625.4 lineto
37772.4 35681.7 lineto
stroke
newpath
38334.9 35962.9 moveto
38334.9 34781.8 lineto
stroke
newpath
38334.9 35906.6 moveto
38447.3 35962.9 lineto
38672.3 35962.9 lineto
38784.8 35906.6 lineto
38841 35850.4 lineto
38897.3 35737.9 lineto
38897.3 35400.5 lineto
38841 35288 lineto
38784.8 35231.7 lineto
38672.3 35175.5 lineto
38447.3 35175.5 lineto
38334.9 35231.7 lineto
stroke
newpath
39403.5 35288 moveto
39459.7 35231.7 lineto
39403.5 35175.5 lineto
39347.2 35231.7 lineto
39403.5 35288 lineto
39403.5 35175.5 lineto
stroke
newpath
39403.5 35906.6 moveto
39459.7 35850.4 lineto
39403.5 35794.2 lineto
39347.2 35850.4 lineto
39403.5 35906.6 lineto
39403.5 35794.2 lineto
stroke
newpath
29943.1 33346.3 moveto
30176.8 33112.6 lineto
stroke
newpath
30176.8 33346.3 moveto
29943.1 33112.6 lineto
stroke
0 0 0 setrgbcolor
0 0 0 setrgbcolor
newpath
31529.5 33876.3 moveto
31641.9 33876.3 lineto
31754.4 33820 lineto
31810.7 33763.8 lineto
31866.9 33651.3 lineto
31923.2 33426.3 lineto
31923.2 33145.1 lineto
31866.9 32920.1 lineto
31810.7 32807.7 lineto
31754.4 32751.4 lineto
31641.9 32695.2 lineto
31529.5 32695.2 lineto
31417 32751.4 lineto
31360.7 32807.7 lineto
31304.5 32920.1 lineto
31248.2 33145.1 lineto
31248.2 33426.3 lineto
31304.5 33651.3 lineto
31360.7 33763.8 lineto
31417 33820 lineto
31529.5 33876.3 lineto
stroke
newpath
32429.3 32807.7 moveto
32485.6 32751.4 lineto
32429.3 32695.2 lineto
32373.1 32751.4 lineto
32429.3 32807.7 lineto
32429.3 32695.2 lineto
stroke
newpath
32935.5 33763.8 moveto
32991.8 33820 lineto
33104.3 33876.3 lineto
33385.5 33876.3 lineto
33498 33820 lineto
33554.2 33763.8 lineto
33610.4 33651.3 lineto
33610.4 33538.8 lineto
33554.2 33370.1 lineto
32879.3 32695.2 lineto
33610.4 32695.2 lineto
stroke
newpath
34341.6 33876.3 moveto
34454.1 33876.3 lineto
34566.6 33820 lineto
34622.8 33763.8 lineto
34679.1 33651.3 lineto
34735.3 33426.3 lineto
34735.3 33145.1 lineto
34679.1 32920.1 lineto
34622.8 32807.7 lineto
34566.6 32751.4 lineto
34454.1 32695.2 lineto
34341.6 32695.2 lineto
34229.1 32751.4 lineto
34172.9 32807.7 lineto
34116.6 32920.1 lineto
34060.4 33145.1 lineto
34060.4 33426.3 lineto
34116.6 33651.3 lineto
34172.9 33763.8 lineto
34229.1 33820 lineto
34341.6 33876.3 lineto
stroke
newpath
35241.5 32695.2 moveto
35241.5 33482.6 lineto
stroke
newpath
35241.5 33370.1 moveto
35297.7 33426.3 lineto
35410.2 33482.6 lineto
35579 33482.6 lineto
35691.4 33426.3 lineto
35747.7 33313.8 lineto
35747.7 32695.2 lineto
stroke
newpath
35747.7 33313.8 moveto
35803.9 33426.3 lineto
35916.4 33482.6 lineto
36085.1 33482.6 lineto
36197.6 33426.3 lineto
36253.9 33313.8 lineto
36253.9 32695.2 lineto
stroke
newpath
36816.3 32695.2 moveto
36816.3 33482.6 lineto
stroke
newpath
36816.3 33370.1 moveto
36872.5 33426.3 lineto
36985 33482.6 lineto
37153.8 33482.6 lineto
37266.2 33426.3 lineto
37322.5 33313.8 lineto
37322.5 32695.2 lineto
stroke
newpath
37322.5 33313.8 moveto
37378.7 33426.3 lineto
37491.2 33482.6 lineto
37659.9 33482.6 lineto
37772.4 33426.3 lineto
37828.7 33313.8 lineto
37828.7 32695.2 lineto
stroke
newpath
40134.6 33932.5 moveto
39122.3 32414 lineto
stroke
newpath
41653.2 33876.3 moveto
41765.7 33876.3 lineto
41878.2 33820 lineto
41934.4 33763.8 lineto
41990.6 33651.3 lineto
42046.9 33426.3 lineto
42046.9 33145.1 lineto
41990.6 32920.1 lineto
41934.4 32807.7 lineto
41878.2 32751.4 lineto
41765.7 32695.2 lineto
41653.2 32695.2 lineto
41540.7 32751.4 lineto
41484.5 32807.7 lineto
41428.2 32920.1 lineto
41372 33145.1 lineto
41372 33426.3 lineto
41428.2 33651.3 lineto
41484.5 33763.8 lineto
41540.7 33820 lineto
41653.2 33876.3 lineto
stroke
newpath
42553.1 32807.7 moveto
42609.3 32751.4 lineto
42553.1 32695.2 lineto
42496.8 32751.4 lineto
42553.1 32807.7 lineto
42553.1 32695.2 lineto
stroke
newpath
43340.5 33876.3 moveto
43453 33876.3 lineto
43565.5 33820 lineto
43621.7 33763.8 lineto
43677.9 33651.3 lineto
43734.2 33426.3 lineto
43734.2 33145.1 lineto
43677.9 32920.1 lineto
43621.7 32807.7 lineto
43565.5 32751.4 lineto
43453 32695.2 lineto
43340.5 32695.2 lineto
43228 32751.4 lineto
43171.7 32807.7 lineto
43115.5 32920.1 lineto
43059.3 33145.1 lineto
43059.3 33426.3 lineto
43115.5 33651.3 lineto
43171.7 33763.8 lineto
43228 33820 lineto
43340.5 33876.3 lineto
stroke
newpath
44465.3 33876.3 moveto
44577.8 33876.3 lineto
44690.3 33820 lineto
44746.6 33763.8 lineto
44802.8 33651.3 lineto
44859 33426.3 lineto
44859 33145.1 lineto
44802.8 32920.1 lineto
44746.6 32807.7 lineto
44690.3 32751.4 lineto
44577.8 32695.2 lineto
44465.3 32695.2 lineto
44352.9 32751.4 lineto
44296.6 32807.7 lineto
44240.4 32920.1 lineto
44184.1 33145.1 lineto
44184.1 33426.3 lineto
44240.4 33651.3 lineto
44296.6 33763.8 lineto
44352.9 33820 lineto
44465.3 33876.3 lineto
stroke
newpath
45534 33370.1 moveto
45421.5 33426.3 lineto
45365.2 33482.6 lineto
45309 33595.1 lineto
45309 33651.3 lineto
45365.2 33763.8 lineto
45421.5 33820 lineto
45534 33876.3 lineto
45758.9 33876.3 lineto
45871.4 33820 lineto
45927.7 33763.8 lineto
45983.9 33651.3 lineto
45983.9 33595.1 lineto
45927.7 33482.6 lineto
45871.4 33426.3 lineto
45758.9 33370.1 lineto
45534 33370.1 lineto
45421.5 33313.8 lineto
45365.2 33257.6 lineto
45309 33145.1 lineto
45309 32920.1 lineto
45365.2 32807.7 lineto
45421.5 32751.4 lineto
45534 32695.2 lineto
45758.9 32695.2 lineto
45871.4 32751.4 lineto
45927.7 32807.7 lineto
45983.9 32920.1 lineto
45983.9 33145.1 lineto
45927.7 33257.6 lineto
45871.4 33313.8 lineto
45758.9 33370.1 lineto
stroke
newpath
46433.8 33876.3 moveto
46433.8 33651.3 lineto
stroke
newpath
46883.8 33876.3 moveto
46883.8 33651.3 lineto
stroke
newpath
48627.3 32245.2 moveto
48571.1 32301.5 lineto
48458.6 32470.2 lineto
48402.3 32582.7 lineto
48346.1 32751.4 lineto
48289.9 33032.6 lineto
48289.9 33257.6 lineto
48346.1 33538.8 lineto
48402.3 33707.5 lineto
48458.6 33820 lineto
48571.1 33988.8 lineto
48627.3 34045 lineto
stroke
newpath
49695.9 32695.2 moveto
49021 32695.2 lineto
stroke
newpath
49358.5 32695.2 moveto
49358.5 33876.3 lineto
49246 33707.5 lineto
49133.5 33595.1 lineto
49021 33538.8 lineto
stroke
newpath
50258.4 32695.2 moveto
50483.3 32695.2 lineto
50595.8 32751.4 lineto
50652.1 32807.7 lineto
50764.5 32976.4 lineto
50820.8 33201.4 lineto
50820.8 33651.3 lineto
50764.5 33763.8 lineto
50708.3 33820 lineto
50595.8 33876.3 lineto
50370.8 33876.3 lineto
50258.4 33820 lineto
50202.1 33763.8 lineto
50145.9 33651.3 lineto
50145.9 33370.1 lineto
50202.1 33257.6 lineto
50258.4 33201.4 lineto
50370.8 33145.1 lineto
50595.8 33145.1 lineto
50708.3 33201.4 lineto
50764.5 33257.6 lineto
50820.8 33370.1 lineto
stroke
newpath
52226.9 32695.2 moveto
52226.9 33876.3 lineto
stroke
newpath
52733.1 32695.2 moveto
52733.1 33313.8 lineto
52676.8 33426.3 lineto
52564.3 33482.6 lineto
52395.6 33482.6 lineto
52283.1 33426.3 lineto
52226.9 33370.1 lineto
stroke
newpath
53464.2 32695.2 moveto
53351.7 32751.4 lineto
53295.5 32807.7 lineto
53239.2 32920.1 lineto
53239.2 33257.6 lineto
53295.5 33370.1 lineto
53351.7 33426.3 lineto
53464.2 33482.6 lineto
53632.9 33482.6 lineto
53745.4 33426.3 lineto
53801.7 33370.1 lineto
53857.9 33257.6 lineto
53857.9 32920.1 lineto
53801.7 32807.7 lineto
53745.4 32751.4 lineto
53632.9 32695.2 lineto
53464.2 32695.2 lineto
stroke
newpath
54532.8 32695.2 moveto
54420.3 32751.4 lineto
54364.1 32863.9 lineto
54364.1 33876.3 lineto
stroke
newpath
55432.7 32751.4 moveto
55320.2 32695.2 lineto
55095.3 32695.2 lineto
54982.8 32751.4 lineto
54926.5 32863.9 lineto
54926.5 33313.8 lineto
54982.8 33426.3 lineto
55095.3 33482.6 lineto
55320.2 33482.6 lineto
55432.7 33426.3 lineto
55489 33313.8 lineto
55489 33201.4 lineto
54926.5 33088.9 lineto
stroke
newpath
55938.9 32751.4 moveto
56051.4 32695.2 lineto
56276.4 32695.2 lineto
56388.8 32751.4 lineto
56445.1 32863.9 lineto
56445.1 32920.1 lineto
56388.8 33032.6 lineto
56276.4 33088.9 lineto
56107.6 33088.9 lineto
55995.1 33145.1 lineto
55938.9 33257.6 lineto
55938.9 33313.8 lineto
55995.1 33426.3 lineto
56107.6 33482.6 lineto
56276.4 33482.6 lineto
56388.8 33426.3 lineto
stroke
newpath
56838.8 32245.2 moveto
56895 32301.5 lineto
57007.5 32470.2 lineto
57063.8 32582.7 lineto
57120 32751.4 lineto
57176.2 33032.6 lineto
57176.2 33257.6 lineto
57120 33538.8 lineto
57063.8 33707.5 lineto
57007.5 33820 lineto
56895 33988.8 lineto
56838.8 34045 lineto
stroke
29709.3 31670.4 467.477 cir0
0 0 0 setrgbcolor
0 0 0 setrgbcolor
newpath
31529.5 32317.2 moveto
31641.9 32317.2 lineto
31754.4 32261 lineto
31810.7 32204.7 lineto
31866.9 32092.2 lineto
31923.2 31867.3 lineto
31923.2 31586.1 lineto
31866.9 31361.1 lineto
31810.7 31248.6 lineto
31754.4 31192.4 lineto
31641.9 31136.1 lineto
31529.5 31136.1 lineto
31417 31192.4 lineto
31360.7 31248.6 lineto
31304.5 31361.1 lineto
31248.2 31586.1 lineto
31248.2 31867.3 lineto
31304.5 32092.2 lineto
31360.7 32204.7 lineto
31417 32261 lineto
31529.5 32317.2 lineto
stroke
newpath
32429.3 31248.6 moveto
32485.6 31192.4 lineto
32429.3 31136.1 lineto
32373.1 31192.4 lineto
32429.3 31248.6 lineto
32429.3 31136.1 lineto
stroke
newpath
33160.5 31811 moveto
33048 31867.3 lineto
32991.8 31923.5 lineto
32935.5 32036 lineto
32935.5 32092.2 lineto
32991.8 32204.7 lineto
33048 32261 lineto
33160.5 32317.2 lineto
33385.5 32317.2 lineto
33498 32261 lineto
33554.2 32204.7 lineto
33610.4 32092.2 lineto
33610.4 32036 lineto
33554.2 31923.5 lineto
33498 31867.3 lineto
33385.5 31811 lineto
33160.5 31811 lineto
33048 31754.8 lineto
32991.8 31698.5 lineto
32935.5 31586.1 lineto
32935.5 31361.1 lineto
32991.8 31248.6 lineto
33048 31192.4 lineto
33160.5 31136.1 lineto
33385.5 31136.1 lineto
33498 31192.4 lineto
33554.2 31248.6 lineto
33610.4 31361.1 lineto
33610.4 31586.1 lineto
33554.2 31698.5 lineto
33498 31754.8 lineto
33385.5 31811 lineto
stroke
newpath
34341.6 32317.2 moveto
34454.1 32317.2 lineto
34566.6 32261 lineto
34622.8 32204.7 lineto
34679.1 32092.2 lineto
34735.3 31867.3 lineto
34735.3 31586.1 lineto
34679.1 31361.1 lineto
34622.8 31248.6 lineto
34566.6 31192.4 lineto
34454.1 31136.1 lineto
34341.6 31136.1 lineto
34229.1 31192.4 lineto
34172.9 31248.6 lineto
34116.6 31361.1 lineto
34060.4 31586.1 lineto
34060.4 31867.3 lineto
34116.6 32092.2 lineto
34172.9 32204.7 lineto
34229.1 32261 lineto
34341.6 32317.2 lineto
stroke
newpath
35241.5 31136.1 moveto
35241.5 31923.5 lineto
stroke
newpath
35241.5 31811 moveto
35297.7 31867.3 lineto
35410.2 31923.5 lineto
35579 31923.5 lineto
35691.4 31867.3 lineto
35747.7 31754.8 lineto
35747.7 31136.1 lineto
stroke
newpath
35747.7 31754.8 moveto
35803.9 31867.3 lineto
35916.4 31923.5 lineto
36085.1 31923.5 lineto
36197.6 31867.3 lineto
36253.9 31754.8 lineto
36253.9 31136.1 lineto
stroke
newpath
36816.3 31136.1 moveto
36816.3 31923.5 lineto
stroke
newpath
36816.3 31811 moveto
36872.5 31867.3 lineto
36985 31923.5 lineto
37153.8 31923.5 lineto
37266.2 31867.3 lineto
37322.5 31754.8 lineto
37322.5 31136.1 lineto
stroke
newpath
37322.5 31754.8 moveto
37378.7 31867.3 lineto
37491.2 31923.5 lineto
37659.9 31923.5 lineto
37772.4 31867.3 lineto
37828.7 31754.8 lineto
37828.7 31136.1 lineto
stroke
newpath
40134.6 32373.5 moveto
39122.3 30854.9 lineto
stroke
newpath
41653.2 32317.2 moveto
41765.7 32317.2 lineto
41878.2 32261 lineto
41934.4 32204.7 lineto
41990.6 32092.2 lineto
42046.9 31867.3 lineto
42046.9 31586.1 lineto
41990.6 31361.1 lineto
41934.4 31248.6 lineto
41878.2 31192.4 lineto
41765.7 31136.1 lineto
41653.2 31136.1 lineto
41540.7 31192.4 lineto
41484.5 31248.6 lineto
41428.2 31361.1 lineto
41372 31586.1 lineto
41372 31867.3 lineto
41428.2 32092.2 lineto
41484.5 32204.7 lineto
41540.7 32261 lineto
41653.2 32317.2 lineto
stroke
newpath
42553.1 31248.6 moveto
42609.3 31192.4 lineto
42553.1 31136.1 lineto
42496.8 31192.4 lineto
42553.1 31248.6 lineto
42553.1 31136.1 lineto
stroke
newpath
43340.5 32317.2 moveto
43453 32317.2 lineto
43565.5 32261 lineto
43621.7 32204.7 lineto
43677.9 32092.2 lineto
43734.2 31867.3 lineto
43734.2 31586.1 lineto
43677.9 31361.1 lineto
43621.7 31248.6 lineto
43565.5 31192.4 lineto
43453 31136.1 lineto
43340.5 31136.1 lineto
43228 31192.4 lineto
43171.7 31248.6 lineto
43115.5 31361.1 lineto
43059.3 31586.1 lineto
43059.3 31867.3 lineto
43115.5 32092.2 lineto
43171.7 32204.7 lineto
43228 32261 lineto
43340.5 32317.2 lineto
stroke
newpath
44127.9 32317.2 moveto
44859 32317.2 lineto
44465.3 31867.3 lineto
44634.1 31867.3 lineto
44746.6 31811 lineto
44802.8 31754.8 lineto
44859 31642.3 lineto
44859 31361.1 lineto
44802.8 31248.6 lineto
44746.6 31192.4 lineto
44634.1 31136.1 lineto
44296.6 31136.1 lineto
44184.1 31192.4 lineto
44127.9 31248.6 lineto
stroke
newpath
45983.9 31136.1 moveto
45309 31136.1 lineto
stroke
newpath
45646.4 31136.1 moveto
45646.4 32317.2 lineto
45534 32148.5 lineto
45421.5 32036 lineto
45309 31979.8 lineto
stroke
newpath
46433.8 32317.2 moveto
46433.8 32092.2 lineto
stroke
newpath
46883.8 32317.2 moveto
46883.8 32092.2 lineto
stroke
newpath
48627.3 30686.2 moveto
48571.1 30742.4 lineto
48458.6 30911.1 lineto
48402.3 31023.6 lineto
48346.1 31192.4 lineto
48289.9 31473.6 lineto
48289.9 31698.5 lineto
48346.1 31979.8 lineto
48402.3 32148.5 lineto
48458.6 32261 lineto
48571.1 32429.7 lineto
48627.3 32485.9 lineto
stroke
newpath
49695.9 31136.1 moveto
49021 31136.1 lineto
stroke
newpath
49358.5 31136.1 moveto
49358.5 32317.2 lineto
49246 32148.5 lineto
49133.5 32036 lineto
49021 31979.8 lineto
stroke
newpath
50427.1 32317.2 moveto
50539.6 32317.2 lineto
50652.1 32261 lineto
50708.3 32204.7 lineto
50764.5 32092.2 lineto
50820.8 31867.3 lineto
50820.8 31586.1 lineto
50764.5 31361.1 lineto
50708.3 31248.6 lineto
50652.1 31192.4 lineto
50539.6 31136.1 lineto
50427.1 31136.1 lineto
50314.6 31192.4 lineto
50258.4 31248.6 lineto
50202.1 31361.1 lineto
50145.9 31586.1 lineto
50145.9 31867.3 lineto
50202.1 32092.2 lineto
50258.4 32204.7 lineto
50314.6 32261 lineto
50427.1 32317.2 lineto
stroke
newpath
52226.9 31136.1 moveto
52226.9 32317.2 lineto
stroke
newpath
52733.1 31136.1 moveto
52733.1 31754.8 lineto
52676.8 31867.3 lineto
52564.3 31923.5 lineto
52395.6 31923.5 lineto
52283.1 31867.3 lineto
52226.9 31811 lineto
stroke
newpath
53464.2 31136.1 moveto
53351.7 31192.4 lineto
53295.5 31248.6 lineto
53239.2 31361.1 lineto
53239.2 31698.5 lineto
53295.5 31811 lineto
53351.7 31867.3 lineto
53464.2 31923.5 lineto
53632.9 31923.5 lineto
53745.4 31867.3 lineto
53801.7 31811 lineto
53857.9 31698.5 lineto
53857.9 31361.1 lineto
53801.7 31248.6 lineto
53745.4 31192.4 lineto
53632.9 31136.1 lineto
53464.2 31136.1 lineto
stroke
newpath
54532.8 31136.1 moveto
54420.3 31192.4 lineto
54364.1 31304.8 lineto
54364.1 32317.2 lineto
stroke
newpath
55432.7 31192.4 moveto
55320.2 31136.1 lineto
55095.3 31136.1 lineto
54982.8 31192.4 lineto
54926.5 31304.8 lineto
54926.5 31754.8 lineto
54982.8 31867.3 lineto
55095.3 31923.5 lineto
55320.2 31923.5 lineto
55432.7 31867.3 lineto
55489 31754.8 lineto
55489 31642.3 lineto
54926.5 31529.8 lineto
stroke
newpath
55938.9 31192.4 moveto
56051.4 31136.1 lineto
56276.4 31136.1 lineto
56388.8 31192.4 lineto
56445.1 31304.8 lineto
56445.1 31361.1 lineto
56388.8 31473.6 lineto
56276.4 31529.8 lineto
56107.6 31529.8 lineto
55995.1 31586.1 lineto
55938.9 31698.5 lineto
55938.9 31754.8 lineto
55995.1 31867.3 lineto
56107.6 31923.5 lineto
56276.4 31923.5 lineto
56388.8 31867.3 lineto
stroke
newpath
56838.8 30686.2 moveto
56895 30742.4 lineto
57007.5 30911.1 lineto
57063.8 31023.6 lineto
57120 31192.4 lineto
57176.2 31473.6 lineto
57176.2 31698.5 lineto
57120 31979.8 lineto
57063.8 32148.5 lineto
57007.5 32261 lineto
56895 32429.7 lineto
56838.8 32485.9 lineto
stroke
newpath
29598.3 30689.9 moveto
29598.3 29532.9 lineto
stroke
newpath
29019.8 30111.4 moveto
30176.8 30111.4 lineto
stroke
0 0 0 setrgbcolor
0 0 0 setrgbcolor
newpath
31529.5 30758.2 moveto
31641.9 30758.2 lineto
31754.4 30701.9 lineto
31810.7 30645.7 lineto
31866.9 30533.2 lineto
31923.2 30308.2 lineto
31923.2 30027 lineto
31866.9 29802 lineto
31810.7 29689.5 lineto
31754.4 29633.3 lineto
31641.9 29577.1 lineto
31529.5 29577.1 lineto
31417 29633.3 lineto
31360.7 29689.5 lineto
31304.5 29802 lineto
31248.2 30027 lineto
31248.2 30308.2 lineto
31304.5 30533.2 lineto
31360.7 30645.7 lineto
31417 30701.9 lineto
31529.5 30758.2 lineto
stroke
newpath
32429.3 29689.5 moveto
32485.6 29633.3 lineto
32429.3 29577.1 lineto
32373.1 29633.3 lineto
32429.3 29689.5 lineto
32429.3 29577.1 lineto
stroke
newpath
33048 29577.1 moveto
33273 29577.1 lineto
33385.5 29633.3 lineto
33441.7 29689.5 lineto
33554.2 29858.3 lineto
33610.4 30083.3 lineto
33610.4 30533.2 lineto
33554.2 30645.7 lineto
33498 30701.9 lineto
33385.5 30758.2 lineto
33160.5 30758.2 lineto
33048 30701.9 lineto
32991.8 30645.7 lineto
32935.5 30533.2 lineto
32935.5 30252 lineto
32991.8 30139.5 lineto
33048 30083.3 lineto
33160.5 30027 lineto
33385.5 30027 lineto
33498 30083.3 lineto
33554.2 30139.5 lineto
33610.4 30252 lineto
stroke
newpath
34172.9 29577.1 moveto
34397.8 29577.1 lineto
34510.3 29633.3 lineto
34566.6 29689.5 lineto
34679.1 29858.3 lineto
34735.3 30083.3 lineto
34735.3 30533.2 lineto
34679.1 30645.7 lineto
34622.8 30701.9 lineto
34510.3 30758.2 lineto
34285.4 30758.2 lineto
34172.9 30701.9 lineto
34116.6 30645.7 lineto
34060.4 30533.2 lineto
34060.4 30252 lineto
34116.6 30139.5 lineto
34172.9 30083.3 lineto
34285.4 30027 lineto
34510.3 30027 lineto
34622.8 30083.3 lineto
34679.1 30139.5 lineto
34735.3 30252 lineto
stroke
newpath
35241.5 29577.1 moveto
35241.5 30364.5 lineto
stroke
newpath
35241.5 30252 moveto
35297.7 30308.2 lineto
35410.2 30364.5 lineto
35579 30364.5 lineto
35691.4 30308.2 lineto
35747.7 30195.7 lineto
35747.7 29577.1 lineto
stroke
newpath
35747.7 30195.7 moveto
35803.9 30308.2 lineto
35916.4 30364.5 lineto
36085.1 30364.5 lineto
36197.6 30308.2 lineto
36253.9 30195.7 lineto
36253.9 29577.1 lineto
stroke
newpath
36816.3 29577.1 moveto
36816.3 30364.5 lineto
stroke
newpath
36816.3 30252 moveto
36872.5 30308.2 lineto
36985 30364.5 lineto
37153.8 30364.5 lineto
37266.2 30308.2 lineto
37322.5 30195.7 lineto
37322.5 29577.1 lineto
stroke
newpath
37322.5 30195.7 moveto
37378.7 30308.2 lineto
37491.2 30364.5 lineto
37659.9 30364.5 lineto
37772.4 30308.2 lineto
37828.7 30195.7 lineto
37828.7 29577.1 lineto
stroke
newpath
40134.6 30814.4 moveto
39122.3 29295.8 lineto
stroke
newpath
41653.2 30758.2 moveto
41765.7 30758.2 lineto
41878.2 30701.9 lineto
41934.4 30645.7 lineto
41990.6 30533.2 lineto
42046.9 30308.2 lineto
42046.9 30027 lineto
41990.6 29802 lineto
41934.4 29689.5 lineto
41878.2 29633.3 lineto
41765.7 29577.1 lineto
41653.2 29577.1 lineto
41540.7 29633.3 lineto
41484.5 29689.5 lineto
41428.2 29802 lineto
41372 30027 lineto
41372 30308.2 lineto
41428.2 30533.2 lineto
41484.5 30645.7 lineto
41540.7 30701.9 lineto
41653.2 30758.2 lineto
stroke
newpath
42553.1 29689.5 moveto
42609.3 29633.3 lineto
42553.1 29577.1 lineto
42496.8 29633.3 lineto
42553.1 29689.5 lineto
42553.1 29577.1 lineto
stroke
newpath
43340.5 30758.2 moveto
43453 30758.2 lineto
43565.5 30701.9 lineto
43621.7 30645.7 lineto
43677.9 30533.2 lineto
43734.2 30308.2 lineto
43734.2 30027 lineto
43677.9 29802 lineto
43621.7 29689.5 lineto
43565.5 29633.3 lineto
43453 29577.1 lineto
43340.5 29577.1 lineto
43228 29633.3 lineto
43171.7 29689.5 lineto
43115.5 29802 lineto
43059.3 30027 lineto
43059.3 30308.2 lineto
43115.5 30533.2 lineto
43171.7 30645.7 lineto
43228 30701.9 lineto
43340.5 30758.2 lineto
stroke
newpath
44127.9 30758.2 moveto
44859 30758.2 lineto
44465.3 30308.2 lineto
44634.1 30308.2 lineto
44746.6 30252 lineto
44802.8 30195.7 lineto
44859 30083.3 lineto
44859 29802 lineto
44802.8 29689.5 lineto
44746.6 29633.3 lineto
44634.1 29577.1 lineto
44296.6 29577.1 lineto
44184.1 29633.3 lineto
44127.9 29689.5 lineto
stroke
newpath
45421.5 29577.1 moveto
45646.4 29577.1 lineto
45758.9 29633.3 lineto
45815.2 29689.5 lineto
45927.7 29858.3 lineto
45983.9 30083.3 lineto
45983.9 30533.2 lineto
45927.7 30645.7 lineto
45871.4 30701.9 lineto
45758.9 30758.2 lineto
45534 30758.2 lineto
45421.5 30701.9 lineto
45365.2 30645.7 lineto
45309 30533.2 lineto
45309 30252 lineto
45365.2 30139.5 lineto
45421.5 30083.3 lineto
45534 30027 lineto
45758.9 30027 lineto
45871.4 30083.3 lineto
45927.7 30139.5 lineto
45983.9 30252 lineto
stroke
newpath
46433.8 30758.2 moveto
46433.8 30533.2 lineto
stroke
newpath
46883.8 30758.2 moveto
46883.8 30533.2 lineto
stroke
newpath
48627.3 29127.1 moveto
48571.1 29183.4 lineto
48458.6 29352.1 lineto
48402.3 29464.6 lineto
48346.1 29633.3 lineto
48289.9 29914.5 lineto
48289.9 30139.5 lineto
48346.1 30420.7 lineto
48402.3 30589.4 lineto
48458.6 30701.9 lineto
48571.1 30870.7 lineto
48627.3 30926.9 lineto
stroke
newpath
49583.4 30364.5 moveto
49583.4 29577.1 lineto
stroke
newpath
49302.2 30814.4 moveto
49021 29970.8 lineto
49752.2 29970.8 lineto
stroke
newpath
51102 29577.1 moveto
51102 30758.2 lineto
stroke
newpath
51608.2 29577.1 moveto
51608.2 30195.7 lineto
51551.9 30308.2 lineto
51439.5 30364.5 lineto
51270.7 30364.5 lineto
51158.2 30308.2 lineto
51102 30252 lineto
stroke
newpath
52339.4 29577.1 moveto
52226.9 29633.3 lineto
52170.6 29689.5 lineto
52114.4 29802 lineto
52114.4 30139.5 lineto
52170.6 30252 lineto
52226.9 30308.2 lineto
52339.4 30364.5 lineto
52508.1 30364.5 lineto
52620.6 30308.2 lineto
52676.8 30252 lineto
52733.1 30139.5 lineto
52733.1 29802 lineto
52676.8 29689.5 lineto
52620.6 29633.3 lineto
52508.1 29577.1 lineto
52339.4 29577.1 lineto
stroke
newpath
53408 29577.1 moveto
53295.5 29633.3 lineto
53239.2 29745.8 lineto
53239.2 30758.2 lineto
stroke
newpath
54307.9 29633.3 moveto
54195.4 29577.1 lineto
53970.4 29577.1 lineto
53857.9 29633.3 lineto
53801.7 29745.8 lineto
53801.7 30195.7 lineto
53857.9 30308.2 lineto
53970.4 30364.5 lineto
54195.4 30364.5 lineto
54307.9 30308.2 lineto
54364.1 30195.7 lineto
54364.1 30083.3 lineto
53801.7 29970.8 lineto
stroke
newpath
54814 29633.3 moveto
54926.5 29577.1 lineto
55151.5 29577.1 lineto
55264 29633.3 lineto
55320.2 29745.8 lineto
55320.2 29802 lineto
55264 29914.5 lineto
55151.5 29970.8 lineto
54982.8 29970.8 lineto
54870.3 30027 lineto
54814 30139.5 lineto
54814 30195.7 lineto
54870.3 30308.2 lineto
54982.8 30364.5 lineto
55151.5 30364.5 lineto
55264 30308.2 lineto
stroke
newpath
55713.9 29127.1 moveto
55770.2 29183.4 lineto
55882.7 29352.1 lineto
55938.9 29464.6 lineto
55995.1 29633.3 lineto
56051.4 29914.5 lineto
56051.4 30139.5 lineto
55995.1 30420.7 lineto
55938.9 30589.4 lineto
55882.7 30701.9 lineto
55770.2 30870.7 lineto
55713.9 30926.9 lineto
stroke
newpath
30005.5 28029 moveto
30005.5 28856.1 lineto
29178.5 28856.1 lineto
29178.5 28029 lineto
30005.5 28029 lineto
poly0
0 0 0 setrgbcolor
0 0 0 setrgbcolor
newpath
31923.2 27908.2 moveto
31248.2 27908.2 lineto
stroke
newpath
31585.7 27908.2 moveto
31585.7 29089.4 lineto
31473.2 28920.6 lineto
31360.7 28808.1 lineto
31248.2 28751.9 lineto
stroke
newpath
32429.3 28020.7 moveto
32485.6 27964.5 lineto
32429.3 27908.2 lineto
32373.1 27964.5 lineto
32429.3 28020.7 lineto
32429.3 27908.2 lineto
stroke
newpath
33216.7 29089.4 moveto
33329.2 29089.4 lineto
33441.7 29033.1 lineto
33498 28976.9 lineto
33554.2 28864.4 lineto
33610.4 28639.4 lineto
33610.4 28358.2 lineto
33554.2 28133.2 lineto
33498 28020.7 lineto
33441.7 27964.5 lineto
33329.2 27908.2 lineto
33216.7 27908.2 lineto
33104.3 27964.5 lineto
33048 28020.7 lineto
32991.8 28133.2 lineto
32935.5 28358.2 lineto
32935.5 28639.4 lineto
32991.8 28864.4 lineto
33048 28976.9 lineto
33104.3 29033.1 lineto
33216.7 29089.4 lineto
stroke
newpath
34341.6 29089.4 moveto
34454.1 29089.4 lineto
34566.6 29033.1 lineto
34622.8 28976.9 lineto
34679.1 28864.4 lineto
34735.3 28639.4 lineto
34735.3 28358.2 lineto
34679.1 28133.2 lineto
34622.8 28020.7 lineto
34566.6 27964.5 lineto
34454.1 27908.2 lineto
34341.6 27908.2 lineto
34229.1 27964.5 lineto
34172.9 28020.7 lineto
34116.6 28133.2 lineto
34060.4 28358.2 lineto
34060.4 28639.4 lineto
34116.6 28864.4 lineto
34172.9 28976.9 lineto
34229.1 29033.1 lineto
34341.6 29089.4 lineto
stroke
newpath
35241.5 27908.2 moveto
35241.5 28695.6 lineto
stroke
newpath
35241.5 28583.2 moveto
35297.7 28639.4 lineto
35410.2 28695.6 lineto
35579 28695.6 lineto
35691.4 28639.4 lineto
35747.7 28526.9 lineto
35747.7 27908.2 lineto
stroke
newpath
35747.7 28526.9 moveto
35803.9 28639.4 lineto
35916.4 28695.6 lineto
36085.1 28695.6 lineto
36197.6 28639.4 lineto
36253.9 28526.9 lineto
36253.9 27908.2 lineto
stroke
newpath
36816.3 27908.2 moveto
36816.3 28695.6 lineto
stroke
newpath
36816.3 28583.2 moveto
36872.5 28639.4 lineto
36985 28695.6 lineto
37153.8 28695.6 lineto
37266.2 28639.4 lineto
37322.5 28526.9 lineto
37322.5 27908.2 lineto
stroke
newpath
37322.5 28526.9 moveto
37378.7 28639.4 lineto
37491.2 28695.6 lineto
37659.9 28695.6 lineto
37772.4 28639.4 lineto
37828.7 28526.9 lineto
37828.7 27908.2 lineto
stroke
newpath
40134.6 29145.6 moveto
39122.3 27627 lineto
stroke
newpath
41653.2 29089.4 moveto
41765.7 29089.4 lineto
41878.2 29033.1 lineto
41934.4 28976.9 lineto
41990.6 28864.4 lineto
42046.9 28639.4 lineto
42046.9 28358.2 lineto
41990.6 28133.2 lineto
41934.4 28020.7 lineto
41878.2 27964.5 lineto
41765.7 27908.2 lineto
41653.2 27908.2 lineto
41540.7 27964.5 lineto
41484.5 28020.7 lineto
41428.2 28133.2 lineto
41372 28358.2 lineto
41372 28639.4 lineto
41428.2 28864.4 lineto
41484.5 28976.9 lineto
41540.7 29033.1 lineto
41653.2 29089.4 lineto
stroke
newpath
42553.1 28020.7 moveto
42609.3 27964.5 lineto
42553.1 27908.2 lineto
42496.8 27964.5 lineto
42553.1 28020.7 lineto
42553.1 27908.2 lineto
stroke
newpath
43340.5 29089.4 moveto
43453 29089.4 lineto
43565.5 29033.1 lineto
43621.7 28976.9 lineto
43677.9 28864.4 lineto
43734.2 28639.4 lineto
43734.2 28358.2 lineto
43677.9 28133.2 lineto
43621.7 28020.7 lineto
43565.5 27964.5 lineto
43453 27908.2 lineto
43340.5 27908.2 lineto
43228 27964.5 lineto
43171.7 28020.7 lineto
43115.5 28133.2 lineto
43059.3 28358.2 lineto
43059.3 28639.4 lineto
43115.5 28864.4 lineto
43171.7 28976.9 lineto
43228 29033.1 lineto
43340.5 29089.4 lineto
stroke
newpath
44127.9 29089.4 moveto
44859 29089.4 lineto
44465.3 28639.4 lineto
44634.1 28639.4 lineto
44746.6 28583.2 lineto
44802.8 28526.9 lineto
44859 28414.4 lineto
44859 28133.2 lineto
44802.8 28020.7 lineto
44746.6 27964.5 lineto
44634.1 27908.2 lineto
44296.6 27908.2 lineto
44184.1 27964.5 lineto
44127.9 28020.7 lineto
stroke
newpath
45421.5 27908.2 moveto
45646.4 27908.2 lineto
45758.9 27964.5 lineto
45815.2 28020.7 lineto
45927.7 28189.5 lineto
45983.9 28414.4 lineto
45983.9 28864.4 lineto
45927.7 28976.9 lineto
45871.4 29033.1 lineto
45758.9 29089.4 lineto
45534 29089.4 lineto
45421.5 29033.1 lineto
45365.2 28976.9 lineto
45309 28864.4 lineto
45309 28583.2 lineto
45365.2 28470.7 lineto
45421.5 28414.4 lineto
45534 28358.2 lineto
45758.9 28358.2 lineto
45871.4 28414.4 lineto
45927.7 28470.7 lineto
45983.9 28583.2 lineto
stroke
newpath
46433.8 29089.4 moveto
46433.8 28864.4 lineto
stroke
newpath
46883.8 29089.4 moveto
46883.8 28864.4 lineto
stroke
newpath
48627.3 27458.3 moveto
48571.1 27514.5 lineto
48458.6 27683.3 lineto
48402.3 27795.8 lineto
48346.1 27964.5 lineto
48289.9 28245.7 lineto
48289.9 28470.7 lineto
48346.1 28751.9 lineto
48402.3 28920.6 lineto
48458.6 29033.1 lineto
48571.1 29201.8 lineto
48627.3 29258.1 lineto
stroke
newpath
49246 28583.2 moveto
49133.5 28639.4 lineto
49077.3 28695.6 lineto
49021 28808.1 lineto
49021 28864.4 lineto
49077.3 28976.9 lineto
49133.5 29033.1 lineto
49246 29089.4 lineto
49471 29089.4 lineto
49583.4 29033.1 lineto
49639.7 28976.9 lineto
49695.9 28864.4 lineto
49695.9 28808.1 lineto
49639.7 28695.6 lineto
49583.4 28639.4 lineto
49471 28583.2 lineto
49246 28583.2 lineto
49133.5 28526.9 lineto
49077.3 28470.7 lineto
49021 28358.2 lineto
49021 28133.2 lineto
49077.3 28020.7 lineto
49133.5 27964.5 lineto
49246 27908.2 lineto
49471 27908.2 lineto
49583.4 27964.5 lineto
49639.7 28020.7 lineto
49695.9 28133.2 lineto
49695.9 28358.2 lineto
49639.7 28470.7 lineto
49583.4 28526.9 lineto
49471 28583.2 lineto
stroke
newpath
51102 27908.2 moveto
51102 29089.4 lineto
stroke
newpath
51608.2 27908.2 moveto
51608.2 28526.9 lineto
51551.9 28639.4 lineto
51439.5 28695.6 lineto
51270.7 28695.6 lineto
51158.2 28639.4 lineto
51102 28583.2 lineto
stroke
newpath
52339.4 27908.2 moveto
52226.9 27964.5 lineto
52170.6 28020.7 lineto
52114.4 28133.2 lineto
52114.4 28470.7 lineto
52170.6 28583.2 lineto
52226.9 28639.4 lineto
52339.4 28695.6 lineto
52508.1 28695.6 lineto
52620.6 28639.4 lineto
52676.8 28583.2 lineto
52733.1 28470.7 lineto
52733.1 28133.2 lineto
52676.8 28020.7 lineto
52620.6 27964.5 lineto
52508.1 27908.2 lineto
52339.4 27908.2 lineto
stroke
newpath
53408 27908.2 moveto
53295.5 27964.5 lineto
53239.2 28077 lineto
53239.2 29089.4 lineto
stroke
newpath
54307.9 27964.5 moveto
54195.4 27908.2 lineto
53970.4 27908.2 lineto
53857.9 27964.5 lineto
53801.7 28077 lineto
53801.7 28526.9 lineto
53857.9 28639.4 lineto
53970.4 28695.6 lineto
54195.4 28695.6 lineto
54307.9 28639.4 lineto
54364.1 28526.9 lineto
54364.1 28414.4 lineto
53801.7 28301.9 lineto
stroke
newpath
54814 27964.5 moveto
54926.5 27908.2 lineto
55151.5 27908.2 lineto
55264 27964.5 lineto
55320.2 28077 lineto
55320.2 28133.2 lineto
55264 28245.7 lineto
55151.5 28301.9 lineto
54982.8 28301.9 lineto
54870.3 28358.2 lineto
54814 28470.7 lineto
54814 28526.9 lineto
54870.3 28639.4 lineto
54982.8 28695.6 lineto
55151.5 28695.6 lineto
55264 28639.4 lineto
stroke
newpath
55713.9 27458.3 moveto
55770.2 27514.5 lineto
55882.7 27683.3 lineto
55938.9 27795.8 lineto
55995.1 27964.5 lineto
56051.4 28245.7 lineto
56051.4 28470.7 lineto
55995.1 28751.9 lineto
55938.9 28920.6 lineto
55882.7 29033.1 lineto
55770.2 29201.8 lineto
55713.9 29258.1 lineto
stroke
newpath
29583.1 26167.5 moveto
30176.8 26761.2 lineto
29583.1 27354.9 lineto
28989.4 26761.2 lineto
29583.1 26167.5 lineto
poly0
0 0 0 setrgbcolor
0 0 0 setrgbcolor
newpath
31923.2 26226.9 moveto
31248.2 26226.9 lineto
stroke
newpath
31585.7 26226.9 moveto
31585.7 27408 lineto
31473.2 27239.2 lineto
31360.7 27126.7 lineto
31248.2 27070.5 lineto
stroke
newpath
32429.3 26339.3 moveto
32485.6 26283.1 lineto
32429.3 26226.9 lineto
32373.1 26283.1 lineto
32429.3 26339.3 lineto
32429.3 26226.9 lineto
stroke
newpath
33216.7 27408 moveto
33329.2 27408 lineto
33441.7 27351.7 lineto
33498 27295.5 lineto
33554.2 27183 lineto
33610.4 26958 lineto
33610.4 26676.8 lineto
33554.2 26451.8 lineto
33498 26339.3 lineto
33441.7 26283.1 lineto
33329.2 26226.9 lineto
33216.7 26226.9 lineto
33104.3 26283.1 lineto
33048 26339.3 lineto
32991.8 26451.8 lineto
32935.5 26676.8 lineto
32935.5 26958 lineto
32991.8 27183 lineto
33048 27295.5 lineto
33104.3 27351.7 lineto
33216.7 27408 lineto
stroke
newpath
34060.4 27295.5 moveto
34116.6 27351.7 lineto
34229.1 27408 lineto
34510.3 27408 lineto
34622.8 27351.7 lineto
34679.1 27295.5 lineto
34735.3 27183 lineto
34735.3 27070.5 lineto
34679.1 26901.8 lineto
34004.1 26226.9 lineto
34735.3 26226.9 lineto
stroke
newpath
35241.5 26226.9 moveto
35241.5 27014.3 lineto
stroke
newpath
35241.5 26901.8 moveto
35297.7 26958 lineto
35410.2 27014.3 lineto
35579 27014.3 lineto
35691.4 26958 lineto
35747.7 26845.5 lineto
35747.7 26226.9 lineto
stroke
newpath
35747.7 26845.5 moveto
35803.9 26958 lineto
35916.4 27014.3 lineto
36085.1 27014.3 lineto
36197.6 26958 lineto
36253.9 26845.5 lineto
36253.9 26226.9 lineto
stroke
newpath
36816.3 26226.9 moveto
36816.3 27014.3 lineto
stroke
newpath
36816.3 26901.8 moveto
36872.5 26958 lineto
36985 27014.3 lineto
37153.8 27014.3 lineto
37266.2 26958 lineto
37322.5 26845.5 lineto
37322.5 26226.9 lineto
stroke
newpath
37322.5 26845.5 moveto
37378.7 26958 lineto
37491.2 27014.3 lineto
37659.9 27014.3 lineto
37772.4 26958 lineto
37828.7 26845.5 lineto
37828.7 26226.9 lineto
stroke
newpath
40134.6 27464.2 moveto
39122.3 25945.6 lineto
stroke
newpath
41653.2 27408 moveto
41765.7 27408 lineto
41878.2 27351.7 lineto
41934.4 27295.5 lineto
41990.6 27183 lineto
42046.9 26958 lineto
42046.9 26676.8 lineto
41990.6 26451.8 lineto
41934.4 26339.3 lineto
41878.2 26283.1 lineto
41765.7 26226.9 lineto
41653.2 26226.9 lineto
41540.7 26283.1 lineto
41484.5 26339.3 lineto
41428.2 26451.8 lineto
41372 26676.8 lineto
41372 26958 lineto
41428.2 27183 lineto
41484.5 27295.5 lineto
41540.7 27351.7 lineto
41653.2 27408 lineto
stroke
newpath
42553.1 26339.3 moveto
42609.3 26283.1 lineto
42553.1 26226.9 lineto
42496.8 26283.1 lineto
42553.1 26339.3 lineto
42553.1 26226.9 lineto
stroke
newpath
43340.5 27408 moveto
43453 27408 lineto
43565.5 27351.7 lineto
43621.7 27295.5 lineto
43677.9 27183 lineto
43734.2 26958 lineto
43734.2 26676.8 lineto
43677.9 26451.8 lineto
43621.7 26339.3 lineto
43565.5 26283.1 lineto
43453 26226.9 lineto
43340.5 26226.9 lineto
43228 26283.1 lineto
43171.7 26339.3 lineto
43115.5 26451.8 lineto
43059.3 26676.8 lineto
43059.3 26958 lineto
43115.5 27183 lineto
43171.7 27295.5 lineto
43228 27351.7 lineto
43340.5 27408 lineto
stroke
newpath
44746.6 27014.3 moveto
44746.6 26226.9 lineto
stroke
newpath
44465.3 27464.2 moveto
44184.1 26620.6 lineto
44915.3 26620.6 lineto
stroke
newpath
45590.2 27408 moveto
45702.7 27408 lineto
45815.2 27351.7 lineto
45871.4 27295.5 lineto
45927.7 27183 lineto
45983.9 26958 lineto
45983.9 26676.8 lineto
45927.7 26451.8 lineto
45871.4 26339.3 lineto
45815.2 26283.1 lineto
45702.7 26226.9 lineto
45590.2 26226.9 lineto
45477.7 26283.1 lineto
45421.5 26339.3 lineto
45365.2 26451.8 lineto
45309 26676.8 lineto
45309 26958 lineto
45365.2 27183 lineto
45421.5 27295.5 lineto
45477.7 27351.7 lineto
45590.2 27408 lineto
stroke
newpath
46433.8 27408 moveto
46433.8 27183 lineto
stroke
newpath
46883.8 27408 moveto
46883.8 27183 lineto
stroke
newpath
48627.3 25776.9 moveto
48571.1 25833.2 lineto
48458.6 26001.9 lineto
48402.3 26114.4 lineto
48346.1 26283.1 lineto
48289.9 26564.3 lineto
48289.9 26789.3 lineto
48346.1 27070.5 lineto
48402.3 27239.2 lineto
48458.6 27351.7 lineto
48571.1 27520.4 lineto
48627.3 27576.7 lineto
stroke
newpath
49639.7 27408 moveto
49077.3 27408 lineto
49021 26845.5 lineto
49077.3 26901.8 lineto
49189.7 26958 lineto
49471 26958 lineto
49583.4 26901.8 lineto
49639.7 26845.5 lineto
49695.9 26733 lineto
49695.9 26451.8 lineto
49639.7 26339.3 lineto
49583.4 26283.1 lineto
49471 26226.9 lineto
49189.7 26226.9 lineto
49077.3 26283.1 lineto
49021 26339.3 lineto
stroke
newpath
51102 26226.9 moveto
51102 27408 lineto
stroke
newpath
51608.2 26226.9 moveto
51608.2 26845.5 lineto
51551.9 26958 lineto
51439.5 27014.3 lineto
51270.7 27014.3 lineto
51158.2 26958 lineto
51102 26901.8 lineto
stroke
newpath
52339.4 26226.9 moveto
52226.9 26283.1 lineto
52170.6 26339.3 lineto
52114.4 26451.8 lineto
52114.4 26789.3 lineto
52170.6 26901.8 lineto
52226.9 26958 lineto
52339.4 27014.3 lineto
52508.1 27014.3 lineto
52620.6 26958 lineto
52676.8 26901.8 lineto
52733.1 26789.3 lineto
52733.1 26451.8 lineto
52676.8 26339.3 lineto
52620.6 26283.1 lineto
52508.1 26226.9 lineto
52339.4 26226.9 lineto
stroke
newpath
53408 26226.9 moveto
53295.5 26283.1 lineto
53239.2 26395.6 lineto
53239.2 27408 lineto
stroke
newpath
54307.9 26283.1 moveto
54195.4 26226.9 lineto
53970.4 26226.9 lineto
53857.9 26283.1 lineto
53801.7 26395.6 lineto
53801.7 26845.5 lineto
53857.9 26958 lineto
53970.4 27014.3 lineto
54195.4 27014.3 lineto
54307.9 26958 lineto
54364.1 26845.5 lineto
54364.1 26733 lineto
53801.7 26620.6 lineto
stroke
newpath
54814 26283.1 moveto
54926.5 26226.9 lineto
55151.5 26226.9 lineto
55264 26283.1 lineto
55320.2 26395.6 lineto
55320.2 26451.8 lineto
55264 26564.3 lineto
55151.5 26620.6 lineto
54982.8 26620.6 lineto
54870.3 26676.8 lineto
54814 26789.3 lineto
54814 26845.5 lineto
54870.3 26958 lineto
54982.8 27014.3 lineto
55151.5 27014.3 lineto
55264 26958 lineto
stroke
newpath
55713.9 25776.9 moveto
55770.2 25833.2 lineto
55882.7 26001.9 lineto
55938.9 26114.4 lineto
55995.1 26283.1 lineto
56051.4 26564.3 lineto
56051.4 26789.3 lineto
55995.1 27070.5 lineto
55938.9 27239.2 lineto
55882.7 27351.7 lineto
55770.2 27520.4 lineto
55713.9 27576.7 lineto
stroke
newpath
28891.3 25704.7 moveto
30176.8 24419.2 lineto
stroke
newpath
30176.8 25704.7 moveto
28891.3 24419.2 lineto
stroke
29534 25062 642.78 cir0
0 0 0 setrgbcolor
0 0 0 setrgbcolor
newpath
31923.2 24527.7 moveto
31248.2 24527.7 lineto
stroke
newpath
31585.7 24527.7 moveto
31585.7 25708.8 lineto
31473.2 25540 lineto
31360.7 25427.5 lineto
31248.2 25371.3 lineto
stroke
newpath
32429.3 24640.1 moveto
32485.6 24583.9 lineto
32429.3 24527.7 lineto
32373.1 24583.9 lineto
32429.3 24640.1 lineto
32429.3 24527.7 lineto
stroke
newpath
33610.4 24527.7 moveto
32935.5 24527.7 lineto
stroke
newpath
33273 24527.7 moveto
33273 25708.8 lineto
33160.5 25540 lineto
33048 25427.5 lineto
32935.5 25371.3 lineto
stroke
newpath
34341.6 25708.8 moveto
34454.1 25708.8 lineto
34566.6 25652.5 lineto
34622.8 25596.3 lineto
34679.1 25483.8 lineto
34735.3 25258.8 lineto
34735.3 24977.6 lineto
34679.1 24752.6 lineto
34622.8 24640.1 lineto
34566.6 24583.9 lineto
34454.1 24527.7 lineto
34341.6 24527.7 lineto
34229.1 24583.9 lineto
34172.9 24640.1 lineto
34116.6 24752.6 lineto
34060.4 24977.6 lineto
34060.4 25258.8 lineto
34116.6 25483.8 lineto
34172.9 25596.3 lineto
34229.1 25652.5 lineto
34341.6 25708.8 lineto
stroke
newpath
35241.5 24527.7 moveto
35241.5 25315.1 lineto
stroke
newpath
35241.5 25202.6 moveto
35297.7 25258.8 lineto
35410.2 25315.1 lineto
35579 25315.1 lineto
35691.4 25258.8 lineto
35747.7 25146.3 lineto
35747.7 24527.7 lineto
stroke
newpath
35747.7 25146.3 moveto
35803.9 25258.8 lineto
35916.4 25315.1 lineto
36085.1 25315.1 lineto
36197.6 25258.8 lineto
36253.9 25146.3 lineto
36253.9 24527.7 lineto
stroke
newpath
36816.3 24527.7 moveto
36816.3 25315.1 lineto
stroke
newpath
36816.3 25202.6 moveto
36872.5 25258.8 lineto
36985 25315.1 lineto
37153.8 25315.1 lineto
37266.2 25258.8 lineto
37322.5 25146.3 lineto
37322.5 24527.7 lineto
stroke
newpath
37322.5 25146.3 moveto
37378.7 25258.8 lineto
37491.2 25315.1 lineto
37659.9 25315.1 lineto
37772.4 25258.8 lineto
37828.7 25146.3 lineto
37828.7 24527.7 lineto
stroke
newpath
40134.6 25765 moveto
39122.3 24246.4 lineto
stroke
newpath
41653.2 25708.8 moveto
41765.7 25708.8 lineto
41878.2 25652.5 lineto
41934.4 25596.3 lineto
41990.6 25483.8 lineto
42046.9 25258.8 lineto
42046.9 24977.6 lineto
41990.6 24752.6 lineto
41934.4 24640.1 lineto
41878.2 24583.9 lineto
41765.7 24527.7 lineto
41653.2 24527.7 lineto
41540.7 24583.9 lineto
41484.5 24640.1 lineto
41428.2 24752.6 lineto
41372 24977.6 lineto
41372 25258.8 lineto
41428.2 25483.8 lineto
41484.5 25596.3 lineto
41540.7 25652.5 lineto
41653.2 25708.8 lineto
stroke
newpath
42553.1 24640.1 moveto
42609.3 24583.9 lineto
42553.1 24527.7 lineto
42496.8 24583.9 lineto
42553.1 24640.1 lineto
42553.1 24527.7 lineto
stroke
newpath
43340.5 25708.8 moveto
43453 25708.8 lineto
43565.5 25652.5 lineto
43621.7 25596.3 lineto
43677.9 25483.8 lineto
43734.2 25258.8 lineto
43734.2 24977.6 lineto
43677.9 24752.6 lineto
43621.7 24640.1 lineto
43565.5 24583.9 lineto
43453 24527.7 lineto
43340.5 24527.7 lineto
43228 24583.9 lineto
43171.7 24640.1 lineto
43115.5 24752.6 lineto
43059.3 24977.6 lineto
43059.3 25258.8 lineto
43115.5 25483.8 lineto
43171.7 25596.3 lineto
43228 25652.5 lineto
43340.5 25708.8 lineto
stroke
newpath
44746.6 25315.1 moveto
44746.6 24527.7 lineto
stroke
newpath
44465.3 25765 moveto
44184.1 24921.4 lineto
44915.3 24921.4 lineto
stroke
newpath
45252.7 25708.8 moveto
45983.9 25708.8 lineto
45590.2 25258.8 lineto
45758.9 25258.8 lineto
45871.4 25202.6 lineto
45927.7 25146.3 lineto
45983.9 25033.8 lineto
45983.9 24752.6 lineto
45927.7 24640.1 lineto
45871.4 24583.9 lineto
45758.9 24527.7 lineto
45421.5 24527.7 lineto
45309 24583.9 lineto
45252.7 24640.1 lineto
stroke
newpath
46433.8 25708.8 moveto
46433.8 25483.8 lineto
stroke
newpath
46883.8 25708.8 moveto
46883.8 25483.8 lineto
stroke
newpath
48627.3 24077.7 moveto
48571.1 24134 lineto
48458.6 24302.7 lineto
48402.3 24415.2 lineto
48346.1 24583.9 lineto
48289.9 24865.1 lineto
48289.9 25090.1 lineto
48346.1 25371.3 lineto
48402.3 25540 lineto
48458.6 25652.5 lineto
48571.1 25821.2 lineto
48627.3 25877.5 lineto
stroke
newpath
49021 25596.3 moveto
49077.3 25652.5 lineto
49189.7 25708.8 lineto
49471 25708.8 lineto
49583.4 25652.5 lineto
49639.7 25596.3 lineto
49695.9 25483.8 lineto
49695.9 25371.3 lineto
49639.7 25202.6 lineto
48964.8 24527.7 lineto
49695.9 24527.7 lineto
stroke
newpath
50708.3 25315.1 moveto
50708.3 24527.7 lineto
stroke
newpath
50427.1 25765 moveto
50145.9 24921.4 lineto
50877 24921.4 lineto
stroke
newpath
52226.9 24527.7 moveto
52226.9 25708.8 lineto
stroke
newpath
52733.1 24527.7 moveto
52733.1 25146.3 lineto
52676.8 25258.8 lineto
52564.3 25315.1 lineto
52395.6 25315.1 lineto
52283.1 25258.8 lineto
52226.9 25202.6 lineto
stroke
newpath
53464.2 24527.7 moveto
53351.7 24583.9 lineto
53295.5 24640.1 lineto
53239.2 24752.6 lineto
53239.2 25090.1 lineto
53295.5 25202.6 lineto
53351.7 25258.8 lineto
53464.2 25315.1 lineto
53632.9 25315.1 lineto
53745.4 25258.8 lineto
53801.7 25202.6 lineto
53857.9 25090.1 lineto
53857.9 24752.6 lineto
53801.7 24640.1 lineto
53745.4 24583.9 lineto
53632.9 24527.7 lineto
53464.2 24527.7 lineto
stroke
newpath
54532.8 24527.7 moveto
54420.3 24583.9 lineto
54364.1 24696.4 lineto
54364.1 25708.8 lineto
stroke
newpath
55432.7 24583.9 moveto
55320.2 24527.7 lineto
55095.3 24527.7 lineto
54982.8 24583.9 lineto
54926.5 24696.4 lineto
54926.5 25146.3 lineto
54982.8 25258.8 lineto
55095.3 25315.1 lineto
55320.2 25315.1 lineto
55432.7 25258.8 lineto
55489 25146.3 lineto
55489 25033.8 lineto
54926.5 24921.4 lineto
stroke
newpath
55938.9 24583.9 moveto
56051.4 24527.7 lineto
56276.4 24527.7 lineto
56388.8 24583.9 lineto
56445.1 24696.4 lineto
56445.1 24752.6 lineto
56388.8 24865.1 lineto
56276.4 24921.4 lineto
56107.6 24921.4 lineto
55995.1 24977.6 lineto
55938.9 25090.1 lineto
55938.9 25146.3 lineto
55995.1 25258.8 lineto
56107.6 25315.1 lineto
56276.4 25315.1 lineto
56388.8 25258.8 lineto
stroke
newpath
56838.8 24077.7 moveto
56895 24134 lineto
57007.5 24302.7 lineto
57063.8 24415.2 lineto
57120 24583.9 lineto
57176.2 24865.1 lineto
57176.2 25090.1 lineto
57120 25371.3 lineto
57063.8 25540 lineto
57007.5 25652.5 lineto
56895 25821.2 lineto
56838.8 25877.5 lineto
stroke
newpath
28657.5 24024.2 moveto
30176.8 22504.9 lineto
stroke
newpath
30176.8 24024.2 moveto
28657.5 22504.9 lineto
stroke
newpath
29417.2 24024.2 moveto
29417.2 22504.9 lineto
stroke
newpath
28657.5 23264.6 moveto
30176.8 23264.6 lineto
stroke
0 0 0 setrgbcolor
0 0 0 setrgbcolor
newpath
31923.2 22730.3 moveto
31248.2 22730.3 lineto
stroke
newpath
31585.7 22730.3 moveto
31585.7 23911.4 lineto
31473.2 23742.7 lineto
31360.7 23630.2 lineto
31248.2 23573.9 lineto
stroke
newpath
32429.3 22842.8 moveto
32485.6 22786.5 lineto
32429.3 22730.3 lineto
32373.1 22786.5 lineto
32429.3 22842.8 lineto
32429.3 22730.3 lineto
stroke
newpath
32879.3 23911.4 moveto
33610.4 23911.4 lineto
33216.7 23461.4 lineto
33385.5 23461.4 lineto
33498 23405.2 lineto
33554.2 23349 lineto
33610.4 23236.5 lineto
33610.4 22955.3 lineto
33554.2 22842.8 lineto
33498 22786.5 lineto
33385.5 22730.3 lineto
33048 22730.3 lineto
32935.5 22786.5 lineto
32879.3 22842.8 lineto
stroke
newpath
34341.6 23911.4 moveto
34454.1 23911.4 lineto
34566.6 23855.1 lineto
34622.8 23798.9 lineto
34679.1 23686.4 lineto
34735.3 23461.4 lineto
34735.3 23180.2 lineto
34679.1 22955.3 lineto
34622.8 22842.8 lineto
34566.6 22786.5 lineto
34454.1 22730.3 lineto
34341.6 22730.3 lineto
34229.1 22786.5 lineto
34172.9 22842.8 lineto
34116.6 22955.3 lineto
34060.4 23180.2 lineto
34060.4 23461.4 lineto
34116.6 23686.4 lineto
34172.9 23798.9 lineto
34229.1 23855.1 lineto
34341.6 23911.4 lineto
stroke
newpath
35241.5 22730.3 moveto
35241.5 23517.7 lineto
stroke
newpath
35241.5 23405.2 moveto
35297.7 23461.4 lineto
35410.2 23517.7 lineto
35579 23517.7 lineto
35691.4 23461.4 lineto
35747.7 23349 lineto
35747.7 22730.3 lineto
stroke
newpath
35747.7 23349 moveto
35803.9 23461.4 lineto
35916.4 23517.7 lineto
36085.1 23517.7 lineto
36197.6 23461.4 lineto
36253.9 23349 lineto
36253.9 22730.3 lineto
stroke
newpath
36816.3 22730.3 moveto
36816.3 23517.7 lineto
stroke
newpath
36816.3 23405.2 moveto
36872.5 23461.4 lineto
36985 23517.7 lineto
37153.8 23517.7 lineto
37266.2 23461.4 lineto
37322.5 23349 lineto
37322.5 22730.3 lineto
stroke
newpath
37322.5 23349 moveto
37378.7 23461.4 lineto
37491.2 23517.7 lineto
37659.9 23517.7 lineto
37772.4 23461.4 lineto
37828.7 23349 lineto
37828.7 22730.3 lineto
stroke
newpath
40134.6 23967.6 moveto
39122.3 22449.1 lineto
stroke
newpath
41653.2 23911.4 moveto
41765.7 23911.4 lineto
41878.2 23855.1 lineto
41934.4 23798.9 lineto
41990.6 23686.4 lineto
42046.9 23461.4 lineto
42046.9 23180.2 lineto
41990.6 22955.3 lineto
41934.4 22842.8 lineto
41878.2 22786.5 lineto
41765.7 22730.3 lineto
41653.2 22730.3 lineto
41540.7 22786.5 lineto
41484.5 22842.8 lineto
41428.2 22955.3 lineto
41372 23180.2 lineto
41372 23461.4 lineto
41428.2 23686.4 lineto
41484.5 23798.9 lineto
41540.7 23855.1 lineto
41653.2 23911.4 lineto
stroke
newpath
42553.1 22842.8 moveto
42609.3 22786.5 lineto
42553.1 22730.3 lineto
42496.8 22786.5 lineto
42553.1 22842.8 lineto
42553.1 22730.3 lineto
stroke
newpath
43340.5 23911.4 moveto
43453 23911.4 lineto
43565.5 23855.1 lineto
43621.7 23798.9 lineto
43677.9 23686.4 lineto
43734.2 23461.4 lineto
43734.2 23180.2 lineto
43677.9 22955.3 lineto
43621.7 22842.8 lineto
43565.5 22786.5 lineto
43453 22730.3 lineto
43340.5 22730.3 lineto
43228 22786.5 lineto
43171.7 22842.8 lineto
43115.5 22955.3 lineto
43059.3 23180.2 lineto
43059.3 23461.4 lineto
43115.5 23686.4 lineto
43171.7 23798.9 lineto
43228 23855.1 lineto
43340.5 23911.4 lineto
stroke
newpath
44802.8 23911.4 moveto
44240.4 23911.4 lineto
44184.1 23349 lineto
44240.4 23405.2 lineto
44352.9 23461.4 lineto
44634.1 23461.4 lineto
44746.6 23405.2 lineto
44802.8 23349 lineto
44859 23236.5 lineto
44859 22955.3 lineto
44802.8 22842.8 lineto
44746.6 22786.5 lineto
44634.1 22730.3 lineto
44352.9 22730.3 lineto
44240.4 22786.5 lineto
44184.1 22842.8 lineto
stroke
newpath
45983.9 22730.3 moveto
45309 22730.3 lineto
stroke
newpath
45646.4 22730.3 moveto
45646.4 23911.4 lineto
45534 23742.7 lineto
45421.5 23630.2 lineto
45309 23573.9 lineto
stroke
newpath
46433.8 23911.4 moveto
46433.8 23686.4 lineto
stroke
newpath
46883.8 23911.4 moveto
46883.8 23686.4 lineto
stroke
newpath
48627.3 22280.3 moveto
48571.1 22336.6 lineto
48458.6 22505.3 lineto
48402.3 22617.8 lineto
48346.1 22786.5 lineto
48289.9 23067.7 lineto
48289.9 23292.7 lineto
48346.1 23573.9 lineto
48402.3 23742.7 lineto
48458.6 23855.1 lineto
48571.1 24023.9 lineto
48627.3 24080.1 lineto
stroke
newpath
49583.4 23517.7 moveto
49583.4 22730.3 lineto
stroke
newpath
49302.2 23967.6 moveto
49021 23124 lineto
49752.2 23124 lineto
stroke
newpath
51102 22730.3 moveto
51102 23911.4 lineto
stroke
newpath
51608.2 22730.3 moveto
51608.2 23349 lineto
51551.9 23461.4 lineto
51439.5 23517.7 lineto
51270.7 23517.7 lineto
51158.2 23461.4 lineto
51102 23405.2 lineto
stroke
newpath
52339.4 22730.3 moveto
52226.9 22786.5 lineto
52170.6 22842.8 lineto
52114.4 22955.3 lineto
52114.4 23292.7 lineto
52170.6 23405.2 lineto
52226.9 23461.4 lineto
52339.4 23517.7 lineto
52508.1 23517.7 lineto
52620.6 23461.4 lineto
52676.8 23405.2 lineto
52733.1 23292.7 lineto
52733.1 22955.3 lineto
52676.8 22842.8 lineto
52620.6 22786.5 lineto
52508.1 22730.3 lineto
52339.4 22730.3 lineto
stroke
newpath
53408 22730.3 moveto
53295.5 22786.5 lineto
53239.2 22899 lineto
53239.2 23911.4 lineto
stroke
newpath
54307.9 22786.5 moveto
54195.4 22730.3 lineto
53970.4 22730.3 lineto
53857.9 22786.5 lineto
53801.7 22899 lineto
53801.7 23349 lineto
53857.9 23461.4 lineto
53970.4 23517.7 lineto
54195.4 23517.7 lineto
54307.9 23461.4 lineto
54364.1 23349 lineto
54364.1 23236.5 lineto
53801.7 23124 lineto
stroke
newpath
54814 22786.5 moveto
54926.5 22730.3 lineto
55151.5 22730.3 lineto
55264 22786.5 lineto
55320.2 22899 lineto
55320.2 22955.3 lineto
55264 23067.7 lineto
55151.5 23124 lineto
54982.8 23124 lineto
54870.3 23180.2 lineto
54814 23292.7 lineto
54814 23349 lineto
54870.3 23461.4 lineto
54982.8 23517.7 lineto
55151.5 23517.7 lineto
55264 23461.4 lineto
stroke
newpath
55713.9 22280.3 moveto
55770.2 22336.6 lineto
55882.7 22505.3 lineto
55938.9 22617.8 lineto
55995.1 22786.5 lineto
56051.4 23067.7 lineto
56051.4 23292.7 lineto
55995.1 23573.9 lineto
55938.9 23742.7 lineto
55882.7 23855.1 lineto
55770.2 24023.9 lineto
55713.9 24080.1 lineto
stroke
newpath
29125 21759.4 moveto
30176.8 20707.6 lineto
stroke
newpath
30176.8 21759.4 moveto
29125 20707.6 lineto
stroke
newpath
30022.8 20861.6 moveto
30022.8 21605.4 lineto
29279 21605.4 lineto
29279 20861.6 lineto
30022.8 20861.6 lineto
poly0
0 0 0 setrgbcolor
0 0 0 setrgbcolor
newpath
31529.5 21880.3 moveto
31641.9 21880.3 lineto
31754.4 21824 lineto
31810.7 21767.8 lineto
31866.9 21655.3 lineto
31923.2 21430.3 lineto
31923.2 21149.1 lineto
31866.9 20924.1 lineto
31810.7 20811.7 lineto
31754.4 20755.4 lineto
31641.9 20699.2 lineto
31529.5 20699.2 lineto
31417 20755.4 lineto
31360.7 20811.7 lineto
31304.5 20924.1 lineto
31248.2 21149.1 lineto
31248.2 21430.3 lineto
31304.5 21655.3 lineto
31360.7 21767.8 lineto
31417 21824 lineto
31529.5 21880.3 lineto
stroke
newpath
32429.3 20811.7 moveto
32485.6 20755.4 lineto
32429.3 20699.2 lineto
32373.1 20755.4 lineto
32429.3 20811.7 lineto
32429.3 20699.2 lineto
stroke
newpath
33048 20699.2 moveto
33273 20699.2 lineto
33385.5 20755.4 lineto
33441.7 20811.7 lineto
33554.2 20980.4 lineto
33610.4 21205.4 lineto
33610.4 21655.3 lineto
33554.2 21767.8 lineto
33498 21824 lineto
33385.5 21880.3 lineto
33160.5 21880.3 lineto
33048 21824 lineto
32991.8 21767.8 lineto
32935.5 21655.3 lineto
32935.5 21374.1 lineto
32991.8 21261.6 lineto
33048 21205.4 lineto
33160.5 21149.1 lineto
33385.5 21149.1 lineto
33498 21205.4 lineto
33554.2 21261.6 lineto
33610.4 21374.1 lineto
stroke
newpath
34341.6 21880.3 moveto
34454.1 21880.3 lineto
34566.6 21824 lineto
34622.8 21767.8 lineto
34679.1 21655.3 lineto
34735.3 21430.3 lineto
34735.3 21149.1 lineto
34679.1 20924.1 lineto
34622.8 20811.7 lineto
34566.6 20755.4 lineto
34454.1 20699.2 lineto
34341.6 20699.2 lineto
34229.1 20755.4 lineto
34172.9 20811.7 lineto
34116.6 20924.1 lineto
34060.4 21149.1 lineto
34060.4 21430.3 lineto
34116.6 21655.3 lineto
34172.9 21767.8 lineto
34229.1 21824 lineto
34341.6 21880.3 lineto
stroke
newpath
35241.5 20699.2 moveto
35241.5 21486.6 lineto
stroke
newpath
35241.5 21374.1 moveto
35297.7 21430.3 lineto
35410.2 21486.6 lineto
35579 21486.6 lineto
35691.4 21430.3 lineto
35747.7 21317.8 lineto
35747.7 20699.2 lineto
stroke
newpath
35747.7 21317.8 moveto
35803.9 21430.3 lineto
35916.4 21486.6 lineto
36085.1 21486.6 lineto
36197.6 21430.3 lineto
36253.9 21317.8 lineto
36253.9 20699.2 lineto
stroke
newpath
36816.3 20699.2 moveto
36816.3 21486.6 lineto
stroke
newpath
36816.3 21374.1 moveto
36872.5 21430.3 lineto
36985 21486.6 lineto
37153.8 21486.6 lineto
37266.2 21430.3 lineto
37322.5 21317.8 lineto
37322.5 20699.2 lineto
stroke
newpath
37322.5 21317.8 moveto
37378.7 21430.3 lineto
37491.2 21486.6 lineto
37659.9 21486.6 lineto
37772.4 21430.3 lineto
37828.7 21317.8 lineto
37828.7 20699.2 lineto
stroke
newpath
40134.6 21936.5 moveto
39122.3 20418 lineto
stroke
newpath
41653.2 21880.3 moveto
41765.7 21880.3 lineto
41878.2 21824 lineto
41934.4 21767.8 lineto
41990.6 21655.3 lineto
42046.9 21430.3 lineto
42046.9 21149.1 lineto
41990.6 20924.1 lineto
41934.4 20811.7 lineto
41878.2 20755.4 lineto
41765.7 20699.2 lineto
41653.2 20699.2 lineto
41540.7 20755.4 lineto
41484.5 20811.7 lineto
41428.2 20924.1 lineto
41372 21149.1 lineto
41372 21430.3 lineto
41428.2 21655.3 lineto
41484.5 21767.8 lineto
41540.7 21824 lineto
41653.2 21880.3 lineto
stroke
newpath
42553.1 20811.7 moveto
42609.3 20755.4 lineto
42553.1 20699.2 lineto
42496.8 20755.4 lineto
42553.1 20811.7 lineto
42553.1 20699.2 lineto
stroke
newpath
43340.5 21880.3 moveto
43453 21880.3 lineto
43565.5 21824 lineto
43621.7 21767.8 lineto
43677.9 21655.3 lineto
43734.2 21430.3 lineto
43734.2 21149.1 lineto
43677.9 20924.1 lineto
43621.7 20811.7 lineto
43565.5 20755.4 lineto
43453 20699.2 lineto
43340.5 20699.2 lineto
43228 20755.4 lineto
43171.7 20811.7 lineto
43115.5 20924.1 lineto
43059.3 21149.1 lineto
43059.3 21430.3 lineto
43115.5 21655.3 lineto
43171.7 21767.8 lineto
43228 21824 lineto
43340.5 21880.3 lineto
stroke
newpath
44127.9 21880.3 moveto
44859 21880.3 lineto
44465.3 21430.3 lineto
44634.1 21430.3 lineto
44746.6 21374.1 lineto
44802.8 21317.8 lineto
44859 21205.4 lineto
44859 20924.1 lineto
44802.8 20811.7 lineto
44746.6 20755.4 lineto
44634.1 20699.2 lineto
44296.6 20699.2 lineto
44184.1 20755.4 lineto
44127.9 20811.7 lineto
stroke
newpath
45927.7 21880.3 moveto
45365.2 21880.3 lineto
45309 21317.8 lineto
45365.2 21374.1 lineto
45477.7 21430.3 lineto
45758.9 21430.3 lineto
45871.4 21374.1 lineto
45927.7 21317.8 lineto
45983.9 21205.4 lineto
45983.9 20924.1 lineto
45927.7 20811.7 lineto
45871.4 20755.4 lineto
45758.9 20699.2 lineto
45477.7 20699.2 lineto
45365.2 20755.4 lineto
45309 20811.7 lineto
stroke
newpath
46433.8 21880.3 moveto
46433.8 21655.3 lineto
stroke
newpath
46883.8 21880.3 moveto
46883.8 21655.3 lineto
stroke
newpath
48627.3 20249.2 moveto
48571.1 20305.5 lineto
48458.6 20474.2 lineto
48402.3 20586.7 lineto
48346.1 20755.4 lineto
48289.9 21036.6 lineto
48289.9 21261.6 lineto
48346.1 21542.8 lineto
48402.3 21711.5 lineto
48458.6 21824 lineto
48571.1 21992.8 lineto
48627.3 22049 lineto
stroke
newpath
49021 21767.8 moveto
49077.3 21824 lineto
49189.7 21880.3 lineto
49471 21880.3 lineto
49583.4 21824 lineto
49639.7 21767.8 lineto
49695.9 21655.3 lineto
49695.9 21542.8 lineto
49639.7 21374.1 lineto
48964.8 20699.2 lineto
49695.9 20699.2 lineto
stroke
newpath
51102 20699.2 moveto
51102 21880.3 lineto
stroke
newpath
51608.2 20699.2 moveto
51608.2 21317.8 lineto
51551.9 21430.3 lineto
51439.5 21486.6 lineto
51270.7 21486.6 lineto
51158.2 21430.3 lineto
51102 21374.1 lineto
stroke
newpath
52339.4 20699.2 moveto
52226.9 20755.4 lineto
52170.6 20811.7 lineto
52114.4 20924.1 lineto
52114.4 21261.6 lineto
52170.6 21374.1 lineto
52226.9 21430.3 lineto
52339.4 21486.6 lineto
52508.1 21486.6 lineto
52620.6 21430.3 lineto
52676.8 21374.1 lineto
52733.1 21261.6 lineto
52733.1 20924.1 lineto
52676.8 20811.7 lineto
52620.6 20755.4 lineto
52508.1 20699.2 lineto
52339.4 20699.2 lineto
stroke
newpath
53408 20699.2 moveto
53295.5 20755.4 lineto
53239.2 20867.9 lineto
53239.2 21880.3 lineto
stroke
newpath
54307.9 20755.4 moveto
54195.4 20699.2 lineto
53970.4 20699.2 lineto
53857.9 20755.4 lineto
53801.7 20867.9 lineto
53801.7 21317.8 lineto
53857.9 21430.3 lineto
53970.4 21486.6 lineto
54195.4 21486.6 lineto
54307.9 21430.3 lineto
54364.1 21317.8 lineto
54364.1 21205.4 lineto
53801.7 21092.9 lineto
stroke
newpath
54814 20755.4 moveto
54926.5 20699.2 lineto
55151.5 20699.2 lineto
55264 20755.4 lineto
55320.2 20867.9 lineto
55320.2 20924.1 lineto
55264 21036.6 lineto
55151.5 21092.9 lineto
54982.8 21092.9 lineto
54870.3 21149.1 lineto
54814 21261.6 lineto
54814 21317.8 lineto
54870.3 21430.3 lineto
54982.8 21486.6 lineto
55151.5 21486.6 lineto
55264 21430.3 lineto
stroke
newpath
55713.9 20249.2 moveto
55770.2 20305.5 lineto
55882.7 20474.2 lineto
55938.9 20586.7 lineto
55995.1 20755.4 lineto
56051.4 21036.6 lineto
56051.4 21261.6 lineto
55995.1 21542.8 lineto
55938.9 21711.5 lineto
55882.7 21824 lineto
55770.2 21992.8 lineto
55713.9 22049 lineto
stroke
newpath
57851.2 20249.2 moveto
57794.9 20305.5 lineto
57682.4 20474.2 lineto
57626.2 20586.7 lineto
57569.9 20755.4 lineto
57513.7 21036.6 lineto
57513.7 21261.6 lineto
57569.9 21542.8 lineto
57626.2 21711.5 lineto
57682.4 21824 lineto
57794.9 21992.8 lineto
57851.2 22049 lineto
stroke
newpath
58301.1 21486.6 moveto
58301.1 20699.2 lineto
stroke
newpath
58301.1 21374.1 moveto
58357.3 21430.3 lineto
58469.8 21486.6 lineto
58638.6 21486.6 lineto
58751 21430.3 lineto
58807.3 21317.8 lineto
58807.3 20699.2 lineto
stroke
newpath
59538.5 20699.2 moveto
59426 20755.4 lineto
59369.7 20811.7 lineto
59313.5 20924.1 lineto
59313.5 21261.6 lineto
59369.7 21374.1 lineto
59426 21430.3 lineto
59538.5 21486.6 lineto
59707.2 21486.6 lineto
59819.7 21430.3 lineto
59875.9 21374.1 lineto
59932.2 21261.6 lineto
59932.2 20924.1 lineto
59875.9 20811.7 lineto
59819.7 20755.4 lineto
59707.2 20699.2 lineto
59538.5 20699.2 lineto
stroke
newpath
60269.6 21486.6 moveto
60719.6 21486.6 lineto
stroke
newpath
60438.3 21880.3 moveto
60438.3 20867.9 lineto
60494.6 20755.4 lineto
60607.1 20699.2 lineto
60719.6 20699.2 lineto
stroke
newpath
62013.1 21486.6 moveto
62013.1 20305.5 lineto
stroke
newpath
62013.1 21430.3 moveto
62125.6 21486.6 lineto
62350.6 21486.6 lineto
62463.1 21430.3 lineto
62519.3 21374.1 lineto
62575.6 21261.6 lineto
62575.6 20924.1 lineto
62519.3 20811.7 lineto
62463.1 20755.4 lineto
62350.6 20699.2 lineto
62125.6 20699.2 lineto
62013.1 20755.4 lineto
stroke
newpath
63250.5 20699.2 moveto
63138 20755.4 lineto
63081.8 20867.9 lineto
63081.8 21880.3 lineto
stroke
newpath
64206.6 20699.2 moveto
64206.6 21317.8 lineto
64150.4 21430.3 lineto
64037.9 21486.6 lineto
63812.9 21486.6 lineto
63700.4 21430.3 lineto
stroke
newpath
64206.6 20755.4 moveto
64094.1 20699.2 lineto
63812.9 20699.2 lineto
63700.4 20755.4 lineto
63644.2 20867.9 lineto
63644.2 20980.4 lineto
63700.4 21092.9 lineto
63812.9 21149.1 lineto
64094.1 21149.1 lineto
64206.6 21205.4 lineto
stroke
newpath
64600.3 21486.6 moveto
65050.3 21486.6 lineto
stroke
newpath
64769 21880.3 moveto
64769 20867.9 lineto
64825.3 20755.4 lineto
64937.8 20699.2 lineto
65050.3 20699.2 lineto
stroke
newpath
65893.9 20755.4 moveto
65781.4 20699.2 lineto
65556.4 20699.2 lineto
65444 20755.4 lineto
65387.7 20867.9 lineto
65387.7 21317.8 lineto
65444 21430.3 lineto
65556.4 21486.6 lineto
65781.4 21486.6 lineto
65893.9 21430.3 lineto
65950.1 21317.8 lineto
65950.1 21205.4 lineto
65387.7 21092.9 lineto
stroke
newpath
66962.5 20699.2 moveto
66962.5 21880.3 lineto
stroke
newpath
66962.5 20755.4 moveto
66850 20699.2 lineto
66625.1 20699.2 lineto
66512.6 20755.4 lineto
66456.3 20811.7 lineto
66400.1 20924.1 lineto
66400.1 21261.6 lineto
66456.3 21374.1 lineto
66512.6 21430.3 lineto
66625.1 21486.6 lineto
66850 21486.6 lineto
66962.5 21430.3 lineto
stroke
newpath
67412.5 20249.2 moveto
67468.7 20305.5 lineto
67581.2 20474.2 lineto
67637.4 20586.7 lineto
67693.7 20755.4 lineto
67749.9 21036.6 lineto
67749.9 21261.6 lineto
67693.7 21542.8 lineto
67637.4 21711.5 lineto
67581.2 21824 lineto
67468.7 21992.8 lineto
67412.5 22049 lineto
stroke
newpath
28949.7 20283.4 moveto
30176.8 19056.3 lineto
stroke
newpath
30176.8 20283.4 moveto
28949.7 19056.3 lineto
stroke
newpath
29563.3 19056.3 moveto
30176.8 19669.8 lineto
29563.3 20283.4 lineto
28949.7 19669.8 lineto
29563.3 19056.3 lineto
poly0
0 0 0 setrgbcolor
0 0 0 setrgbcolor
newpath
31923.2 19135.5 moveto
31248.2 19135.5 lineto
stroke
newpath
31585.7 19135.5 moveto
31585.7 20316.6 lineto
31473.2 20147.9 lineto
31360.7 20035.4 lineto
31248.2 19979.2 lineto
stroke
newpath
32429.3 19248 moveto
32485.6 19191.8 lineto
32429.3 19135.5 lineto
32373.1 19191.8 lineto
32429.3 19248 lineto
32429.3 19135.5 lineto
stroke
newpath
33216.7 20316.6 moveto
33329.2 20316.6 lineto
33441.7 20260.4 lineto
33498 20204.2 lineto
33554.2 20091.7 lineto
33610.4 19866.7 lineto
33610.4 19585.5 lineto
33554.2 19360.5 lineto
33498 19248 lineto
33441.7 19191.8 lineto
33329.2 19135.5 lineto
33216.7 19135.5 lineto
33104.3 19191.8 lineto
33048 19248 lineto
32991.8 19360.5 lineto
32935.5 19585.5 lineto
32935.5 19866.7 lineto
32991.8 20091.7 lineto
33048 20204.2 lineto
33104.3 20260.4 lineto
33216.7 20316.6 lineto
stroke
newpath
34679.1 20316.6 moveto
34116.6 20316.6 lineto
34060.4 19754.2 lineto
34116.6 19810.5 lineto
34229.1 19866.7 lineto
34510.3 19866.7 lineto
34622.8 19810.5 lineto
34679.1 19754.2 lineto
34735.3 19641.7 lineto
34735.3 19360.5 lineto
34679.1 19248 lineto
34622.8 19191.8 lineto
34510.3 19135.5 lineto
34229.1 19135.5 lineto
34116.6 19191.8 lineto
34060.4 19248 lineto
stroke
newpath
35241.5 19135.5 moveto
35241.5 19922.9 lineto
stroke
newpath
35241.5 19810.5 moveto
35297.7 19866.7 lineto
35410.2 19922.9 lineto
35579 19922.9 lineto
35691.4 19866.7 lineto
35747.7 19754.2 lineto
35747.7 19135.5 lineto
stroke
newpath
35747.7 19754.2 moveto
35803.9 19866.7 lineto
35916.4 19922.9 lineto
36085.1 19922.9 lineto
36197.6 19866.7 lineto
36253.9 19754.2 lineto
36253.9 19135.5 lineto
stroke
newpath
36816.3 19135.5 moveto
36816.3 19922.9 lineto
stroke
newpath
36816.3 19810.5 moveto
36872.5 19866.7 lineto
36985 19922.9 lineto
37153.8 19922.9 lineto
37266.2 19866.7 lineto
37322.5 19754.2 lineto
37322.5 19135.5 lineto
stroke
newpath
37322.5 19754.2 moveto
37378.7 19866.7 lineto
37491.2 19922.9 lineto
37659.9 19922.9 lineto
37772.4 19866.7 lineto
37828.7 19754.2 lineto
37828.7 19135.5 lineto
stroke
newpath
40134.6 20372.9 moveto
39122.3 18854.3 lineto
stroke
newpath
41653.2 20316.6 moveto
41765.7 20316.6 lineto
41878.2 20260.4 lineto
41934.4 20204.2 lineto
41990.6 20091.7 lineto
42046.9 19866.7 lineto
42046.9 19585.5 lineto
41990.6 19360.5 lineto
41934.4 19248 lineto
41878.2 19191.8 lineto
41765.7 19135.5 lineto
41653.2 19135.5 lineto
41540.7 19191.8 lineto
41484.5 19248 lineto
41428.2 19360.5 lineto
41372 19585.5 lineto
41372 19866.7 lineto
41428.2 20091.7 lineto
41484.5 20204.2 lineto
41540.7 20260.4 lineto
41653.2 20316.6 lineto
stroke
newpath
42553.1 19248 moveto
42609.3 19191.8 lineto
42553.1 19135.5 lineto
42496.8 19191.8 lineto
42553.1 19248 lineto
42553.1 19135.5 lineto
stroke
newpath
43340.5 20316.6 moveto
43453 20316.6 lineto
43565.5 20260.4 lineto
43621.7 20204.2 lineto
43677.9 20091.7 lineto
43734.2 19866.7 lineto
43734.2 19585.5 lineto
43677.9 19360.5 lineto
43621.7 19248 lineto
43565.5 19191.8 lineto
43453 19135.5 lineto
43340.5 19135.5 lineto
43228 19191.8 lineto
43171.7 19248 lineto
43115.5 19360.5 lineto
43059.3 19585.5 lineto
43059.3 19866.7 lineto
43115.5 20091.7 lineto
43171.7 20204.2 lineto
43228 20260.4 lineto
43340.5 20316.6 lineto
stroke
newpath
44746.6 19922.9 moveto
44746.6 19135.5 lineto
stroke
newpath
44465.3 20372.9 moveto
44184.1 19529.2 lineto
44915.3 19529.2 lineto
stroke
newpath
45983.9 19135.5 moveto
45309 19135.5 lineto
stroke
newpath
45646.4 19135.5 moveto
45646.4 20316.6 lineto
45534 20147.9 lineto
45421.5 20035.4 lineto
45309 19979.2 lineto
stroke
newpath
46433.8 20316.6 moveto
46433.8 20091.7 lineto
stroke
newpath
46883.8 20316.6 moveto
46883.8 20091.7 lineto
stroke
newpath
48627.3 18685.6 moveto
48571.1 18741.8 lineto
48458.6 18910.6 lineto
48402.3 19023.1 lineto
48346.1 19191.8 lineto
48289.9 19473 lineto
48289.9 19698 lineto
48346.1 19979.2 lineto
48402.3 20147.9 lineto
48458.6 20260.4 lineto
48571.1 20429.1 lineto
48627.3 20485.4 lineto
stroke
newpath
49583.4 20316.6 moveto
49358.5 20316.6 lineto
49246 20260.4 lineto
49189.7 20204.2 lineto
49077.3 20035.4 lineto
49021 19810.5 lineto
49021 19360.5 lineto
49077.3 19248 lineto
49133.5 19191.8 lineto
49246 19135.5 lineto
49471 19135.5 lineto
49583.4 19191.8 lineto
49639.7 19248 lineto
49695.9 19360.5 lineto
49695.9 19641.7 lineto
49639.7 19754.2 lineto
49583.4 19810.5 lineto
49471 19866.7 lineto
49246 19866.7 lineto
49133.5 19810.5 lineto
49077.3 19754.2 lineto
49021 19641.7 lineto
stroke
newpath
51102 19135.5 moveto
51102 20316.6 lineto
stroke
newpath
51608.2 19135.5 moveto
51608.2 19754.2 lineto
51551.9 19866.7 lineto
51439.5 19922.9 lineto
51270.7 19922.9 lineto
51158.2 19866.7 lineto
51102 19810.5 lineto
stroke
newpath
52339.4 19135.5 moveto
52226.9 19191.8 lineto
52170.6 19248 lineto
52114.4 19360.5 lineto
52114.4 19698 lineto
52170.6 19810.5 lineto
52226.9 19866.7 lineto
52339.4 19922.9 lineto
52508.1 19922.9 lineto
52620.6 19866.7 lineto
52676.8 19810.5 lineto
52733.1 19698 lineto
52733.1 19360.5 lineto
52676.8 19248 lineto
52620.6 19191.8 lineto
52508.1 19135.5 lineto
52339.4 19135.5 lineto
stroke
newpath
53408 19135.5 moveto
53295.5 19191.8 lineto
53239.2 19304.3 lineto
53239.2 20316.6 lineto
stroke
newpath
54307.9 19191.8 moveto
54195.4 19135.5 lineto
53970.4 19135.5 lineto
53857.9 19191.8 lineto
53801.7 19304.3 lineto
53801.7 19754.2 lineto
53857.9 19866.7 lineto
53970.4 19922.9 lineto
54195.4 19922.9 lineto
54307.9 19866.7 lineto
54364.1 19754.2 lineto
54364.1 19641.7 lineto
53801.7 19529.2 lineto
stroke
newpath
54814 19191.8 moveto
54926.5 19135.5 lineto
55151.5 19135.5 lineto
55264 19191.8 lineto
55320.2 19304.3 lineto
55320.2 19360.5 lineto
55264 19473 lineto
55151.5 19529.2 lineto
54982.8 19529.2 lineto
54870.3 19585.5 lineto
54814 19698 lineto
54814 19754.2 lineto
54870.3 19866.7 lineto
54982.8 19922.9 lineto
55151.5 19922.9 lineto
55264 19866.7 lineto
stroke
newpath
55713.9 18685.6 moveto
55770.2 18741.8 lineto
55882.7 18910.6 lineto
55938.9 19023.1 lineto
55995.1 19191.8 lineto
56051.4 19473 lineto
56051.4 19698 lineto
55995.1 19979.2 lineto
55938.9 20147.9 lineto
55882.7 20260.4 lineto
55770.2 20429.1 lineto
55713.9 20485.4 lineto
stroke
newpath
57851.2 18685.6 moveto
57794.9 18741.8 lineto
57682.4 18910.6 lineto
57626.2 19023.1 lineto
57569.9 19191.8 lineto
57513.7 19473 lineto
57513.7 19698 lineto
57569.9 19979.2 lineto
57626.2 20147.9 lineto
57682.4 20260.4 lineto
57794.9 20429.1 lineto
57851.2 20485.4 lineto
stroke
newpath
58301.1 19922.9 moveto
58301.1 19135.5 lineto
stroke
newpath
58301.1 19810.5 moveto
58357.3 19866.7 lineto
58469.8 19922.9 lineto
58638.6 19922.9 lineto
58751 19866.7 lineto
58807.3 19754.2 lineto
58807.3 19135.5 lineto
stroke
newpath
59538.5 19135.5 moveto
59426 19191.8 lineto
59369.7 19248 lineto
59313.5 19360.5 lineto
59313.5 19698 lineto
59369.7 19810.5 lineto
59426 19866.7 lineto
59538.5 19922.9 lineto
59707.2 19922.9 lineto
59819.7 19866.7 lineto
59875.9 19810.5 lineto
59932.2 19698 lineto
59932.2 19360.5 lineto
59875.9 19248 lineto
59819.7 19191.8 lineto
59707.2 19135.5 lineto
59538.5 19135.5 lineto
stroke
newpath
60269.6 19922.9 moveto
60719.6 19922.9 lineto
stroke
newpath
60438.3 20316.6 moveto
60438.3 19304.3 lineto
60494.6 19191.8 lineto
60607.1 19135.5 lineto
60719.6 19135.5 lineto
stroke
newpath
62013.1 19922.9 moveto
62013.1 18741.8 lineto
stroke
newpath
62013.1 19866.7 moveto
62125.6 19922.9 lineto
62350.6 19922.9 lineto
62463.1 19866.7 lineto
62519.3 19810.5 lineto
62575.6 19698 lineto
62575.6 19360.5 lineto
62519.3 19248 lineto
62463.1 19191.8 lineto
62350.6 19135.5 lineto
62125.6 19135.5 lineto
62013.1 19191.8 lineto
stroke
newpath
63250.5 19135.5 moveto
63138 19191.8 lineto
63081.8 19304.3 lineto
63081.8 20316.6 lineto
stroke
newpath
64206.6 19135.5 moveto
64206.6 19754.2 lineto
64150.4 19866.7 lineto
64037.9 19922.9 lineto
63812.9 19922.9 lineto
63700.4 19866.7 lineto
stroke
newpath
64206.6 19191.8 moveto
64094.1 19135.5 lineto
63812.9 19135.5 lineto
63700.4 19191.8 lineto
63644.2 19304.3 lineto
63644.2 19416.8 lineto
63700.4 19529.2 lineto
63812.9 19585.5 lineto
64094.1 19585.5 lineto
64206.6 19641.7 lineto
stroke
newpath
64600.3 19922.9 moveto
65050.3 19922.9 lineto
stroke
newpath
64769 20316.6 moveto
64769 19304.3 lineto
64825.3 19191.8 lineto
64937.8 19135.5 lineto
65050.3 19135.5 lineto
stroke
newpath
65893.9 19191.8 moveto
65781.4 19135.5 lineto
65556.4 19135.5 lineto
65444 19191.8 lineto
65387.7 19304.3 lineto
65387.7 19754.2 lineto
65444 19866.7 lineto
65556.4 19922.9 lineto
65781.4 19922.9 lineto
65893.9 19866.7 lineto
65950.1 19754.2 lineto
65950.1 19641.7 lineto
65387.7 19529.2 lineto
stroke
newpath
66962.5 19135.5 moveto
66962.5 20316.6 lineto
stroke
newpath
66962.5 19191.8 moveto
66850 19135.5 lineto
66625.1 19135.5 lineto
66512.6 19191.8 lineto
66456.3 19248 lineto
66400.1 19360.5 lineto
66400.1 19698 lineto
66456.3 19810.5 lineto
66512.6 19866.7 lineto
66625.1 19922.9 lineto
66850 19922.9 lineto
66962.5 19866.7 lineto
stroke
newpath
67412.5 18685.6 moveto
67468.7 18741.8 lineto
67581.2 18910.6 lineto
67637.4 19023.1 lineto
67693.7 19191.8 lineto
67749.9 19473 lineto
67749.9 19698 lineto
67693.7 19979.2 lineto
67637.4 20147.9 lineto
67581.2 20260.4 lineto
67468.7 20429.1 lineto
67412.5 20485.4 lineto
stroke
showpage
grestore
%%EOF
