G04 #@! TF.FileFunction,Other,User*
%FSLAX46Y46*%
G04 Gerber Fmt 4.6, Leading zero omitted, Abs format (unit mm)*
G04 Created by KiCad (PCBNEW 4.0.5+dfsg1-4) date Wed Jun 13 15:22:26 2018*
%MOMM*%
%LPD*%
G01*
G04 APERTURE LIST*
%ADD10C,0.100000*%
%ADD11C,0.300000*%
G04 APERTURE END LIST*
D10*
D11*
X142204816Y-137068475D02*
X143133387Y-137069149D01*
X142632972Y-137640215D01*
X142847258Y-137640370D01*
X142990063Y-137711903D01*
X143061440Y-137783383D01*
X143132764Y-137926291D01*
X143132505Y-138283434D01*
X143060974Y-138426239D01*
X142989493Y-138497617D01*
X142846584Y-138568941D01*
X142418012Y-138568630D01*
X142275207Y-138497098D01*
X142203831Y-138425617D01*
X144490529Y-137070133D02*
X143776243Y-137069615D01*
X143704296Y-137783849D01*
X143775777Y-137712473D01*
X143918686Y-137641148D01*
X144275829Y-137641407D01*
X144418634Y-137712939D01*
X144490011Y-137784419D01*
X144561335Y-137927328D01*
X144561076Y-138284471D01*
X144489544Y-138427276D01*
X144418063Y-138498653D01*
X144275155Y-138569978D01*
X143918012Y-138569718D01*
X143775207Y-138498187D01*
X143703829Y-138426706D01*
X145203829Y-138427794D02*
X145275205Y-138499275D01*
X145203725Y-138570651D01*
X145132348Y-138499172D01*
X145203829Y-138427794D01*
X145203725Y-138570651D01*
X146204814Y-137071377D02*
X146347671Y-137071481D01*
X146490476Y-137143014D01*
X146561853Y-137214495D01*
X146633178Y-137357403D01*
X146704399Y-137643169D01*
X146704140Y-138000312D01*
X146632504Y-138285974D01*
X146560972Y-138428779D01*
X146489491Y-138500156D01*
X146346582Y-138571481D01*
X146203725Y-138571377D01*
X146060920Y-138499845D01*
X145989543Y-138428365D01*
X145918219Y-138285456D01*
X145846997Y-137999690D01*
X145847256Y-137642547D01*
X145918892Y-137356885D01*
X145990424Y-137214080D01*
X146061905Y-137142703D01*
X146204814Y-137071377D01*
X147633384Y-137072414D02*
X147776241Y-137072518D01*
X147919046Y-137144051D01*
X147990424Y-137215531D01*
X148061749Y-137358440D01*
X148132970Y-137644206D01*
X148132710Y-138001349D01*
X148061075Y-138287011D01*
X147989542Y-138429816D01*
X147918062Y-138501193D01*
X147775153Y-138572517D01*
X147632296Y-138572414D01*
X147489491Y-138500882D01*
X147418114Y-138429401D01*
X147346789Y-138286493D01*
X147275568Y-138000727D01*
X147275827Y-137643584D01*
X147347463Y-137357922D01*
X147418995Y-137215117D01*
X147490476Y-137143740D01*
X147633384Y-137072414D01*
X149560866Y-138573813D02*
X148703724Y-138573191D01*
X149132295Y-138573502D02*
X149133384Y-137073503D01*
X148990371Y-137287685D01*
X148847410Y-137430438D01*
X148704501Y-137501764D01*
X151346580Y-138575109D02*
X151347306Y-137575109D01*
X151347202Y-137717967D02*
X151418682Y-137646590D01*
X151561591Y-137575265D01*
X151775876Y-137575420D01*
X151918682Y-137646953D01*
X151990007Y-137789862D01*
X151989437Y-138575576D01*
X151990007Y-137789862D02*
X152061539Y-137647057D01*
X152204448Y-137575732D01*
X152418733Y-137575887D01*
X152561539Y-137647420D01*
X152632864Y-137790328D01*
X152632293Y-138576042D01*
X153346579Y-138576561D02*
X153347305Y-137576561D01*
X153347201Y-137719419D02*
X153418681Y-137648042D01*
X153561591Y-137576716D01*
X153775876Y-137576872D01*
X153918681Y-137648405D01*
X153990006Y-137791313D01*
X153989436Y-138577027D01*
X153990006Y-137791313D02*
X154061539Y-137648508D01*
X154204448Y-137577183D01*
X154418733Y-137577338D01*
X154561539Y-137648871D01*
X154632863Y-137791780D01*
X154632293Y-138577494D01*
X130990311Y-136531766D02*
X165991511Y-136557166D01*
X131000500Y-122491500D02*
X130988352Y-139231765D01*
X166001700Y-122516900D02*
X165989552Y-139257165D01*
X165991511Y-136557166D02*
X164864582Y-137142769D01*
X165991511Y-136557166D02*
X164865433Y-135969928D01*
X130990311Y-136531766D02*
X132116389Y-137119004D01*
X130990311Y-136531766D02*
X132117240Y-135946163D01*
X118322613Y-98725322D02*
X118323623Y-99653892D01*
X117751650Y-99154514D01*
X117751884Y-99368800D01*
X117680610Y-99511735D01*
X117609260Y-99583242D01*
X117466481Y-99654825D01*
X117109338Y-99655214D01*
X116966403Y-99583941D01*
X116894897Y-99512590D01*
X116823313Y-99369811D01*
X116822847Y-98941239D01*
X116894119Y-98798304D01*
X116965471Y-98726799D01*
X118325100Y-101011035D02*
X118324323Y-100296749D01*
X117609959Y-100226097D01*
X117681465Y-100297448D01*
X117753050Y-100440228D01*
X117753438Y-100797370D01*
X117682165Y-100940305D01*
X117610814Y-101011812D01*
X117468035Y-101083395D01*
X117110892Y-101083784D01*
X116967958Y-101012511D01*
X116896451Y-100941160D01*
X116824868Y-100798381D01*
X116824479Y-100441238D01*
X116895752Y-100298303D01*
X116967103Y-100226797D01*
X116968735Y-101726796D02*
X116897384Y-101798302D01*
X116825878Y-101726951D01*
X116897228Y-101655445D01*
X116968735Y-101726796D01*
X116825878Y-101726951D01*
X118326965Y-102725319D02*
X118327121Y-102868175D01*
X118255847Y-103011110D01*
X118184496Y-103082617D01*
X118041717Y-103154201D01*
X117756081Y-103225940D01*
X117398938Y-103226329D01*
X117113146Y-103155212D01*
X116970212Y-103083938D01*
X116898705Y-103012587D01*
X116827122Y-102869808D01*
X116826966Y-102726951D01*
X116898239Y-102584016D01*
X116969590Y-102512509D01*
X117112369Y-102440926D01*
X117398005Y-102369186D01*
X117755148Y-102368798D01*
X118040940Y-102439916D01*
X118183874Y-102511188D01*
X118255381Y-102582539D01*
X118326965Y-102725319D01*
X116829065Y-104655521D02*
X116828132Y-103798378D01*
X116828598Y-104226950D02*
X118328598Y-104225318D01*
X118114156Y-104082694D01*
X117971144Y-103939991D01*
X117899559Y-103797212D01*
X117830463Y-105940146D02*
X116830464Y-105941234D01*
X118401502Y-105582381D02*
X117329686Y-105226404D01*
X117330697Y-106154976D01*
X116832562Y-107869804D02*
X117832562Y-107868716D01*
X117689704Y-107868871D02*
X117761211Y-107940221D01*
X117832795Y-108083001D01*
X117833028Y-108297286D01*
X117761755Y-108440221D01*
X117618975Y-108511805D01*
X116833262Y-108512660D01*
X117618975Y-108511805D02*
X117761910Y-108583079D01*
X117833494Y-108725858D01*
X117833728Y-108940143D01*
X117762454Y-109083079D01*
X117619675Y-109154662D01*
X116833961Y-109155517D01*
X116834739Y-109869803D02*
X117834738Y-109868714D01*
X117691880Y-109868870D02*
X117763387Y-109940220D01*
X117834971Y-110083000D01*
X117835204Y-110297285D01*
X117763931Y-110440220D01*
X117621152Y-110511804D01*
X116835438Y-110512659D01*
X117621152Y-110511804D02*
X117764086Y-110583078D01*
X117835671Y-110725857D01*
X117835904Y-110940142D01*
X117764630Y-111083077D01*
X117621851Y-111154661D01*
X116836138Y-111155516D01*
X118838973Y-87503506D02*
X118877073Y-122517406D01*
X130975100Y-87490300D02*
X116138975Y-87506444D01*
X131013200Y-122504200D02*
X116177075Y-122520344D01*
X118877073Y-122517406D02*
X118289427Y-121391541D01*
X118877073Y-122517406D02*
X119462268Y-121390265D01*
X118838973Y-87503506D02*
X118253778Y-88630647D01*
X118838973Y-87503506D02*
X119426619Y-88629371D01*
X129446512Y-77529377D02*
X128933225Y-78026107D01*
X129378625Y-78589068D01*
X129380282Y-78488066D01*
X129433266Y-78337392D01*
X129689910Y-78089027D01*
X129842240Y-78041010D01*
X129943242Y-78042665D01*
X130093916Y-78095650D01*
X130342281Y-78352293D01*
X130390298Y-78504623D01*
X130388643Y-78605626D01*
X130335658Y-78756300D01*
X130079014Y-79004665D01*
X129926684Y-79052682D01*
X129825682Y-79051026D01*
X130903585Y-78007894D02*
X131004587Y-78009551D01*
X131002931Y-78110552D01*
X130901929Y-78108897D01*
X130903585Y-78007894D01*
X131002931Y-78110552D01*
X131282755Y-76448163D02*
X131978177Y-77166765D01*
X130628728Y-76285899D02*
X131117179Y-77304194D01*
X131784452Y-76658445D01*
X131397003Y-75641806D02*
X132115605Y-74946384D01*
X132696779Y-76471344D01*
X133620695Y-75577231D02*
X133826010Y-75378539D01*
X133878995Y-75227865D01*
X133880650Y-75126863D01*
X133834290Y-74873531D01*
X133686926Y-74618543D01*
X133289543Y-74207914D01*
X133138869Y-74154929D01*
X133037866Y-74153273D01*
X132885536Y-74201290D01*
X132680221Y-74399982D01*
X132627236Y-74550657D01*
X132625581Y-74651659D01*
X132673598Y-74803989D01*
X132921963Y-75060633D01*
X133072638Y-75113617D01*
X133173639Y-75115273D01*
X133325970Y-75067256D01*
X133531285Y-74868564D01*
X133584269Y-74717889D01*
X133585925Y-74616888D01*
X133537908Y-74464558D01*
X135417200Y-73838678D02*
X134721779Y-73120076D01*
X134821126Y-73222734D02*
X134822781Y-73121732D01*
X134875765Y-72971057D01*
X135029751Y-72822038D01*
X135182082Y-72774022D01*
X135332757Y-72827006D01*
X135879159Y-73391621D01*
X135332757Y-72827006D02*
X135284740Y-72674675D01*
X135337724Y-72524000D01*
X135491709Y-72374982D01*
X135644041Y-72326964D01*
X135794715Y-72379949D01*
X136341117Y-72944565D01*
X136854405Y-72447835D02*
X136158983Y-71729233D01*
X136258330Y-71831891D02*
X136259985Y-71730889D01*
X136312970Y-71580214D01*
X136466955Y-71431195D01*
X136619286Y-71383179D01*
X136769961Y-71436163D01*
X137316363Y-72000779D01*
X136769961Y-71436163D02*
X136721944Y-71283832D01*
X136774928Y-71133157D01*
X136928914Y-70984139D01*
X137081245Y-70936121D01*
X137231919Y-70989106D01*
X137778322Y-71553722D01*
X136312765Y-73906357D02*
X132375765Y-77716357D01*
X153035000Y-91186000D02*
X134435127Y-71966131D01*
X149098000Y-94996000D02*
X130498127Y-75776131D01*
X132375765Y-77716357D02*
X132777463Y-76511559D01*
X132375765Y-77716357D02*
X133593083Y-77354365D01*
X136312765Y-73906357D02*
X135095447Y-74268349D01*
X136312765Y-73906357D02*
X135911067Y-75111155D01*
X122453350Y-110309605D02*
X121932251Y-109821076D01*
X121391612Y-110293321D01*
X121492574Y-110290065D01*
X121645647Y-110335660D01*
X121906196Y-110579925D01*
X121961562Y-110729741D01*
X121964820Y-110830703D01*
X121919224Y-110983776D01*
X121674959Y-111244325D01*
X121525144Y-111299692D01*
X121424180Y-111302948D01*
X121271108Y-111257352D01*
X121010559Y-111013087D01*
X120955192Y-110863272D01*
X120951935Y-110762309D01*
X122046241Y-111788220D02*
X122049497Y-111889183D01*
X121948535Y-111892440D01*
X121945278Y-111791477D01*
X122046241Y-111788220D01*
X121948535Y-111892440D01*
X124016643Y-111775193D02*
X123495545Y-111286664D01*
X122954906Y-111758909D01*
X123055868Y-111755653D01*
X123208941Y-111801248D01*
X123469490Y-112045513D01*
X123524856Y-112195329D01*
X123528114Y-112296292D01*
X123482517Y-112449364D01*
X123238253Y-112709913D01*
X123088437Y-112765280D01*
X122987474Y-112768536D01*
X122834402Y-112722940D01*
X122573853Y-112478675D01*
X122518486Y-112328860D01*
X122515229Y-112227897D01*
X124433521Y-112166016D02*
X125163059Y-112849958D01*
X123668159Y-113504587D01*
X125127232Y-114872469D02*
X124501915Y-114286233D01*
X124814574Y-114579351D02*
X125840486Y-113485045D01*
X125589707Y-113543669D01*
X125387781Y-113550182D01*
X125234708Y-113504587D01*
X126429977Y-116093792D02*
X127113918Y-115364255D01*
X127016212Y-115468475D02*
X127117175Y-115465217D01*
X127270248Y-115510814D01*
X127426577Y-115657372D01*
X127481943Y-115807188D01*
X127436348Y-115960261D01*
X126898965Y-116533468D01*
X127436348Y-115960261D02*
X127586163Y-115904894D01*
X127739236Y-115950490D01*
X127895565Y-116097048D01*
X127950932Y-116246865D01*
X127905336Y-116399937D01*
X127367953Y-116973145D01*
X127889052Y-117461674D02*
X128572993Y-116732137D01*
X128475286Y-116836357D02*
X128576249Y-116833100D01*
X128729322Y-116878696D01*
X128885651Y-117025254D01*
X128941018Y-117175070D01*
X128895422Y-117328143D01*
X128358040Y-117901350D01*
X128895422Y-117328143D02*
X129045238Y-117272777D01*
X129198311Y-117318372D01*
X129354639Y-117464931D01*
X129410006Y-117614747D01*
X129364410Y-117767819D01*
X128827028Y-118341027D01*
X124222107Y-111243286D02*
X128286107Y-115053286D01*
X133858000Y-100965000D02*
X122375466Y-113213036D01*
X137922000Y-104775000D02*
X126439466Y-117023036D01*
X128286107Y-115053286D02*
X127063203Y-114710639D01*
X128286107Y-115053286D02*
X127865358Y-113855008D01*
X124222107Y-111243286D02*
X124642856Y-112441564D01*
X124222107Y-111243286D02*
X125445011Y-111585933D01*
X153468550Y-130425676D02*
X152971554Y-130938705D01*
X153434883Y-131487005D01*
X153433280Y-131386002D01*
X153481376Y-131233697D01*
X153729875Y-130977182D01*
X153880577Y-130924277D01*
X153981579Y-130922673D01*
X154133884Y-130970770D01*
X154390399Y-131219268D01*
X154443305Y-131369970D01*
X154444908Y-131470973D01*
X154396812Y-131623278D01*
X154148313Y-131879792D01*
X153997611Y-131932699D01*
X153896608Y-131934302D01*
X154940301Y-130856941D02*
X155041304Y-130855339D01*
X155042907Y-130956341D01*
X154941904Y-130957945D01*
X154940301Y-130856941D01*
X155042907Y-130956341D01*
X154909840Y-128937893D02*
X154711042Y-129143104D01*
X154662946Y-129295410D01*
X154664549Y-129396413D01*
X154719058Y-129648117D01*
X154874570Y-129898220D01*
X155284992Y-130295816D01*
X155437298Y-130343912D01*
X155538300Y-130342310D01*
X155689003Y-130289403D01*
X155887801Y-130084192D01*
X155935898Y-129931887D01*
X155934295Y-129830884D01*
X155881388Y-129680182D01*
X155624874Y-129431683D01*
X155472569Y-129383587D01*
X155371567Y-129385191D01*
X155220864Y-129438096D01*
X155022066Y-129643308D01*
X154973969Y-129795614D01*
X154975572Y-129896616D01*
X155028478Y-130047318D01*
X155953533Y-127860533D02*
X155456536Y-128373562D01*
X155919865Y-128921862D01*
X155918263Y-128820859D01*
X155966359Y-128668554D01*
X156214857Y-128412039D01*
X156365559Y-128359133D01*
X156466562Y-128357530D01*
X156618867Y-128405626D01*
X156875381Y-128654125D01*
X156928288Y-128804826D01*
X156929891Y-128905830D01*
X156881794Y-129058134D01*
X156633296Y-129314649D01*
X156482594Y-129367555D01*
X156381591Y-129369159D01*
X157061355Y-127640893D02*
X156910652Y-127693800D01*
X156809649Y-127695402D01*
X156657344Y-127647306D01*
X156606041Y-127597607D01*
X156553135Y-127446904D01*
X156551531Y-127345902D01*
X156599628Y-127193596D01*
X156798427Y-126988384D01*
X156949129Y-126935479D01*
X157050132Y-126933876D01*
X157202437Y-126981972D01*
X157253740Y-127031672D01*
X157306646Y-127182373D01*
X157308249Y-127283376D01*
X157260153Y-127435682D01*
X157061355Y-127640893D01*
X157013257Y-127793199D01*
X157014861Y-127894201D01*
X157067767Y-128044904D01*
X157272978Y-128243702D01*
X157425284Y-128291798D01*
X157526286Y-128290196D01*
X157676989Y-128237289D01*
X157875787Y-128032077D01*
X157923884Y-127879772D01*
X157922280Y-127778769D01*
X157869374Y-127628068D01*
X157664163Y-127429269D01*
X157511858Y-127381172D01*
X157410855Y-127382776D01*
X157260153Y-127435682D01*
X159317077Y-126544294D02*
X158598836Y-125848499D01*
X158701443Y-125947899D02*
X158699839Y-125846897D01*
X158747936Y-125694590D01*
X158897034Y-125540682D01*
X159047736Y-125487777D01*
X159200042Y-125535873D01*
X159764373Y-126082569D01*
X159200042Y-125535873D02*
X159147136Y-125385170D01*
X159195232Y-125232865D01*
X159344331Y-125078956D01*
X159495034Y-125026050D01*
X159647339Y-125074147D01*
X160211670Y-125620843D01*
X160708667Y-125107814D02*
X159990427Y-124412019D01*
X160093033Y-124511419D02*
X160091429Y-124410416D01*
X160139526Y-124258110D01*
X160288624Y-124104202D01*
X160439327Y-124051296D01*
X160591632Y-124099392D01*
X161155964Y-124646088D01*
X160591632Y-124099392D02*
X160538727Y-123948690D01*
X160586823Y-123796384D01*
X160735921Y-123642476D01*
X160886624Y-123589570D01*
X161038929Y-123637666D01*
X161603261Y-124184362D01*
X158337586Y-124639911D02*
X154400586Y-128703911D01*
X148844000Y-115443000D02*
X160276835Y-126518558D01*
X144907000Y-119507000D02*
X156339835Y-130582558D01*
X154400586Y-128703911D02*
X154763211Y-127486782D01*
X154400586Y-128703911D02*
X155605593Y-128302839D01*
X158337586Y-124639911D02*
X157132579Y-125040983D01*
X158337586Y-124639911D02*
X157974961Y-125857040D01*
X169720755Y-89645136D02*
X169191478Y-89165479D01*
X168658893Y-89646789D01*
X168759786Y-89641828D01*
X168913607Y-89684831D01*
X169178246Y-89924660D01*
X169236135Y-90073519D01*
X169241098Y-90174412D01*
X169198094Y-90328233D01*
X168958265Y-90592871D01*
X168809407Y-90650761D01*
X168708513Y-90655723D01*
X168554692Y-90612719D01*
X168290054Y-90372890D01*
X168232164Y-90224032D01*
X168227202Y-90123138D01*
X169338683Y-91130417D02*
X169343644Y-91231310D01*
X169242751Y-91236272D01*
X169237789Y-91135379D01*
X169338683Y-91130417D01*
X169242751Y-91236272D01*
X170919896Y-91406633D02*
X170248377Y-92147620D01*
X171038983Y-90743384D02*
X170054860Y-91297470D01*
X170742919Y-91921024D01*
X171564951Y-92184009D02*
X171507061Y-92035149D01*
X171502100Y-91934255D01*
X171545103Y-91780434D01*
X171593068Y-91727507D01*
X171741928Y-91669618D01*
X171842821Y-91664655D01*
X171996643Y-91707659D01*
X172208353Y-91899522D01*
X172266242Y-92048381D01*
X172271204Y-92149275D01*
X172228200Y-92303095D01*
X172180235Y-92356022D01*
X172031376Y-92413912D01*
X171930483Y-92418874D01*
X171776661Y-92375871D01*
X171564951Y-92184009D01*
X171411130Y-92141004D01*
X171310237Y-92145966D01*
X171161377Y-92203856D01*
X170969515Y-92415566D01*
X170926512Y-92569387D01*
X170931473Y-92670280D01*
X170989364Y-92819140D01*
X171201074Y-93011002D01*
X171354894Y-93054006D01*
X171455788Y-93049044D01*
X171604647Y-92991154D01*
X171796509Y-92779444D01*
X171839513Y-92625623D01*
X171834551Y-92524729D01*
X171776661Y-92375871D01*
X173425689Y-93002732D02*
X172896412Y-92523075D01*
X172363827Y-93004386D01*
X172464720Y-92999424D01*
X172618542Y-93042428D01*
X172883180Y-93282256D01*
X172941069Y-93431115D01*
X172946032Y-93532009D01*
X172903028Y-93685829D01*
X172663199Y-93950467D01*
X172514341Y-94008357D01*
X172413447Y-94013319D01*
X172259626Y-93970315D01*
X171994988Y-93730487D01*
X171937098Y-93581628D01*
X171932136Y-93480734D01*
X173794527Y-95361319D02*
X174466047Y-94620332D01*
X174370115Y-94726188D02*
X174471008Y-94721226D01*
X174624830Y-94764230D01*
X174783612Y-94908126D01*
X174841502Y-95056985D01*
X174798498Y-95210806D01*
X174270876Y-95793010D01*
X174798498Y-95210806D02*
X174947358Y-95152917D01*
X175101179Y-95195921D01*
X175259961Y-95339817D01*
X175317851Y-95488677D01*
X175274847Y-95642497D01*
X174747225Y-96224701D01*
X175276501Y-96704358D02*
X175948021Y-95963371D01*
X175852089Y-96069227D02*
X175952982Y-96064265D01*
X176106804Y-96107268D01*
X176265586Y-96251165D01*
X176323476Y-96400024D01*
X176280472Y-96553845D01*
X175752850Y-97136049D01*
X176280472Y-96553845D02*
X176429331Y-96495956D01*
X176583153Y-96538959D01*
X176741935Y-96682856D01*
X176799825Y-96831716D01*
X176756821Y-96985536D01*
X176229199Y-97567740D01*
X169723821Y-92578370D02*
X173787821Y-96261370D01*
X159131000Y-104267000D02*
X171536923Y-90577705D01*
X163195000Y-107950000D02*
X175600923Y-94260705D01*
X173787821Y-96261370D02*
X172559303Y-95939431D01*
X173787821Y-96261370D02*
X173346889Y-95070371D01*
X169723821Y-92578370D02*
X170164753Y-93769369D01*
X169723821Y-92578370D02*
X170952339Y-92900309D01*
M02*
