G04 #@! TF.FileFunction,Other,User*
%FSLAX46Y46*%
G04 Gerber Fmt 4.6, Leading zero omitted, Abs format (unit mm)*
G04 Created by KiCad (PCBNEW 4.0.5+dfsg1-4) date Wed Jan  9 14:35:25 2019*
%MOMM*%
%LPD*%
G01*
G04 APERTURE LIST*
%ADD10C,0.100000*%
%ADD11C,0.050000*%
G04 APERTURE END LIST*
D10*
D11*
X163350000Y-97310000D02*
X163350000Y-111010000D01*
X166850000Y-97310000D02*
X166850000Y-111010000D01*
X163350000Y-97310000D02*
X166850000Y-97310000D01*
X163350000Y-111010000D02*
X166850000Y-111010000D01*
X149223604Y-92562994D02*
X152547006Y-95886396D01*
X152547006Y-95886396D02*
X150496396Y-97937006D01*
X150496396Y-97937006D02*
X147172994Y-94613604D01*
X147172994Y-94613604D02*
X149223604Y-92562994D01*
X151763604Y-90022994D02*
X155087006Y-93346396D01*
X155087006Y-93346396D02*
X153036396Y-95397006D01*
X153036396Y-95397006D02*
X149712994Y-92073604D01*
X149712994Y-92073604D02*
X151763604Y-90022994D01*
X133202994Y-102236396D02*
X136526396Y-98912994D01*
X136526396Y-98912994D02*
X138577006Y-100963604D01*
X138577006Y-100963604D02*
X135253604Y-104287006D01*
X135253604Y-104287006D02*
X133202994Y-102236396D01*
X135742994Y-104776396D02*
X139066396Y-101452994D01*
X139066396Y-101452994D02*
X141117006Y-103503604D01*
X141117006Y-103503604D02*
X137793604Y-106827006D01*
X137793604Y-106827006D02*
X135742994Y-104776396D01*
X154792994Y-107316396D02*
X158116396Y-103992994D01*
X158116396Y-103992994D02*
X160167006Y-106043604D01*
X160167006Y-106043604D02*
X156843604Y-109367006D01*
X156843604Y-109367006D02*
X154792994Y-107316396D01*
X157332994Y-109856396D02*
X160656396Y-106532994D01*
X160656396Y-106532994D02*
X162707006Y-108583604D01*
X162707006Y-108583604D02*
X159383604Y-111907006D01*
X159383604Y-111907006D02*
X157332994Y-109856396D01*
X146683604Y-111612994D02*
X150007006Y-114936396D01*
X150007006Y-114936396D02*
X147956396Y-116987006D01*
X147956396Y-116987006D02*
X144632994Y-113663604D01*
X144632994Y-113663604D02*
X146683604Y-111612994D01*
X144143604Y-114152994D02*
X147467006Y-117476396D01*
X147467006Y-117476396D02*
X145416396Y-119527006D01*
X145416396Y-119527006D02*
X142092994Y-116203604D01*
X142092994Y-116203604D02*
X144143604Y-114152994D01*
M02*
