G04 #@! TF.FileFunction,Other,User*
%FSLAX46Y46*%
G04 Gerber Fmt 4.6, Leading zero omitted, Abs format (unit mm)*
G04 Created by KiCad (PCBNEW 4.0.5+dfsg1-4) date Wed Jun 13 14:41:34 2018*
%MOMM*%
%LPD*%
G01*
G04 APERTURE LIST*
%ADD10C,0.100000*%
%ADD11C,0.050000*%
G04 APERTURE END LIST*
D10*
D11*
X160487600Y-86143200D02*
X160487600Y-95843200D01*
X160487600Y-95843200D02*
X149087600Y-95843200D01*
X149087600Y-95843200D02*
X149087600Y-86143200D01*
X149087600Y-86143200D02*
X160487600Y-86143200D01*
X162380400Y-106399600D02*
X162380400Y-103099600D01*
X162380400Y-103099600D02*
X148780400Y-103099600D01*
X148780400Y-103099600D02*
X148780400Y-106399600D01*
X148780400Y-106399600D02*
X162380400Y-106399600D01*
X149270400Y-99439600D02*
X161920400Y-99439600D01*
X149270400Y-102439600D02*
X149270400Y-99439600D01*
X161920400Y-99439600D02*
X161920400Y-102439600D01*
X149270400Y-102439600D02*
X161920400Y-102439600D01*
X162431600Y-98427600D02*
X162431600Y-112127600D01*
X174581600Y-98427600D02*
X174581600Y-112127600D01*
X162431600Y-98427600D02*
X174581600Y-98427600D01*
X162431600Y-112127600D02*
X174581600Y-112127600D01*
M02*
