EESchema Schematic File Version 2
LIBS:nxp_armmcu
LIBS:power
LIBS:device
LIBS:transistors
LIBS:conn
LIBS:linear
LIBS:regul
LIBS:74xx
LIBS:cmos4000
LIBS:adc-dac
LIBS:memory
LIBS:xilinx
LIBS:microcontrollers
LIBS:dsp
LIBS:microchip
LIBS:analog_switches
LIBS:motorola
LIBS:texas
LIBS:intel
LIBS:audio
LIBS:interface
LIBS:digital-audio
LIBS:philips
LIBS:display
LIBS:cypress
LIBS:siliconi
LIBS:opto
LIBS:atmel
LIBS:contrib
LIBS:valves
LIBS:nxp
LIBS:dk_Pressure-Sensors-Transducers
LIBS:dk_Sensors-Transducers_Accessories
LIBS:dk_Specialized-Sensors
LIBS:mpxv7007gp
LIBS:promicro
LIBS:switches
LIBS:flipmouse-cache
EELAYER 25 0
EELAYER END
$Descr A4 11693 8268
encoding utf-8
Sheet 1 1
Title ""
Date ""
Rev ""
Comp ""
Comment1 ""
Comment2 ""
Comment3 ""
Comment4 ""
$EndDescr
$Comp
L ProMicro U1
U 1 1 5AEC1DA8
P 5200 3850
F 0 "U1" H 5200 4800 60  0000 C CNN
F 1 "ProMicro" H 5200 3300 60  0000 C CNN
F 2 "promicro:ProMicro" H 5300 2800 60  0001 C CNN
F 3 "" H 5300 2800 60  0000 C CNN
	1    5200 3850
	1    0    0    -1  
$EndComp
$Comp
L R_Network04 RN1
U 1 1 5AEC2168
P 7200 3500
F 0 "RN1" V 6900 3500 50  0000 C CNN
F 1 "RNet 10k" V 7400 3500 50  0000 C CNN
F 2 "Resistors_THT:Resistor_Array_SIP5" V 7475 3500 50  0001 C CNN
F 3 "" H 7200 3500 50  0000 C CNN
	1    7200 3500
	1    0    0    -1  
$EndComp
$Comp
L MPXV7007GP MPX1
U 1 1 5AED4843
P 3350 3250
F 0 "MPX1" H 3350 3300 60  0000 C CNN
F 1 "MPXV7007GP" H 3350 3450 60  0000 C CNN
F 2 "SOP8-1369:SOP8-1369" H 3350 3250 60  0001 C CNN
F 3 "" H 3350 3250 60  0001 C CNN
	1    3350 3250
	1    0    0    -1  
$EndComp
$Comp
L JACK_2P J1
U 1 1 5AED5077
P 2850 5600
F 0 "J1" H 2500 5400 50  0000 C CNN
F 1 "JACK External Switch" H 2700 5850 50  0000 C CNN
F 2 "tht:Lumberg-1503" H 2850 5600 50  0001 C CNN
F 3 "" H 2850 5600 50  0000 C CNN
	1    2850 5600
	0    -1   -1   0   
$EndComp
$Comp
L JACK_2P J2
U 1 1 5AED50FD
P 3750 5600
F 0 "J2" H 3400 5400 50  0000 C CNN
F 1 "JACK External Switch" H 3600 5850 50  0000 C CNN
F 2 "tht:Lumberg-1503" H 3750 5600 50  0001 C CNN
F 3 "" H 3750 5600 50  0000 C CNN
	1    3750 5600
	0    -1   -1   0   
$EndComp
$Comp
L SW_Push SW1
U 1 1 5AED5B84
P 6700 2300
F 0 "SW1" H 6750 2400 50  0000 L CNN
F 1 "RST" H 6700 2240 50  0000 C CNN
F 2 "Buttons_Switches_THT:SW_Tactile_SPST_Angled" H 6700 2500 50  0001 C CNN
F 3 "" H 6700 2500 50  0001 C CNN
	1    6700 2300
	1    0    0    -1  
$EndComp
$Comp
L SW_Push SW2
U 1 1 5AED5CBF
P 2250 3650
F 0 "SW2" H 2300 3750 50  0000 L CNN
F 1 "Mode Selector" H 2250 3590 50  0000 C CNN
F 2 "Buttons_Switches_THT:SW_Tactile_SPST_Angled" H 2250 3850 50  0001 C CNN
F 3 "" H 2250 3850 50  0001 C CNN
	1    2250 3650
	1    0    0    -1  
$EndComp
$Comp
L JACK_2P J3
U 1 1 5AED63DF
P 4550 5600
F 0 "J3" H 4200 5400 50  0000 C CNN
F 1 "JACK External Switch" H 4400 5850 50  0000 C CNN
F 2 "tht:Lumberg-1503" H 4550 5600 50  0001 C CNN
F 3 "" H 4550 5600 50  0000 C CNN
	1    4550 5600
	0    -1   -1   0   
$EndComp
$Comp
L R_Network04 RN2
U 1 1 5AED69C9
P 3050 4400
F 0 "RN2" V 2750 4400 50  0000 C CNN
F 1 "RNet 10k" V 3250 4400 50  0000 C CNN
F 2 "Resistors_THT:Resistor_Array_SIP5" V 3325 4400 50  0001 C CNN
F 3 "" H 3050 4400 50  0000 C CNN
	1    3050 4400
	1    0    0    -1  
$EndComp
$Comp
L CONN_01X05 P1
U 1 1 5AF14E8A
P 7100 4350
F 0 "P1" H 7100 4650 50  0000 C CNN
F 1 "CONN_01X05" V 7200 4350 50  0000 C CNN
F 2 "Pin_Headers:Pin_Header_Straight_1x05" H 7100 4350 50  0001 C CNN
F 3 "" H 7100 4350 50  0000 C CNN
	1    7100 4350
	0    1    1    0   
$EndComp
NoConn ~ 5900 3900
NoConn ~ 5900 4000
NoConn ~ 5900 4100
NoConn ~ 4500 3800
NoConn ~ 4500 3200
NoConn ~ 4500 3100
$Comp
L +5V #PWR01
U 1 1 5AF155C1
P 3850 2250
F 0 "#PWR01" H 3850 2100 50  0001 C CNN
F 1 "+5V" H 3850 2390 50  0000 C CNN
F 2 "" H 3850 2250 50  0000 C CNN
F 3 "" H 3850 2250 50  0000 C CNN
	1    3850 2250
	-1   0    0    1   
$EndComp
$Comp
L +5V #PWR02
U 1 1 5AF1595E
P 2700 5100
F 0 "#PWR02" H 2700 4950 50  0001 C CNN
F 1 "+5V" H 2700 5240 50  0000 C CNN
F 2 "" H 2700 5100 50  0000 C CNN
F 3 "" H 2700 5100 50  0000 C CNN
	1    2700 5100
	1    0    0    -1  
$EndComp
$Comp
L +5V #PWR03
U 1 1 5AF159C8
P 3600 5100
F 0 "#PWR03" H 3600 4950 50  0001 C CNN
F 1 "+5V" H 3600 5240 50  0000 C CNN
F 2 "" H 3600 5100 50  0000 C CNN
F 3 "" H 3600 5100 50  0000 C CNN
	1    3600 5100
	1    0    0    -1  
$EndComp
$Comp
L +5V #PWR04
U 1 1 5AF15A6D
P 4400 5100
F 0 "#PWR04" H 4400 4950 50  0001 C CNN
F 1 "+5V" H 4400 5240 50  0000 C CNN
F 2 "" H 4400 5100 50  0000 C CNN
F 3 "" H 4400 5100 50  0000 C CNN
	1    4400 5100
	1    0    0    -1  
$EndComp
$Comp
L +5V #PWR05
U 1 1 5AF1626E
P 1900 3600
F 0 "#PWR05" H 1900 3450 50  0001 C CNN
F 1 "+5V" H 1900 3740 50  0000 C CNN
F 2 "" H 1900 3600 50  0000 C CNN
F 3 "" H 1900 3600 50  0000 C CNN
	1    1900 3600
	1    0    0    -1  
$EndComp
$Comp
L GND #PWR06
U 1 1 5AF1657A
P 2700 4000
F 0 "#PWR06" H 2700 3750 50  0001 C CNN
F 1 "GND" H 2700 3850 50  0000 C CNN
F 2 "" H 2700 4000 50  0000 C CNN
F 3 "" H 2700 4000 50  0000 C CNN
	1    2700 4000
	1    0    0    -1  
$EndComp
$Comp
L GND #PWR07
U 1 1 5AF16741
P 2650 3350
F 0 "#PWR07" H 2650 3100 50  0001 C CNN
F 1 "GND" H 2650 3200 50  0000 C CNN
F 2 "" H 2650 3350 50  0000 C CNN
F 3 "" H 2650 3350 50  0000 C CNN
	1    2650 3350
	1    0    0    -1  
$EndComp
$Comp
L +5V #PWR08
U 1 1 5AF1694D
P 2900 3150
F 0 "#PWR08" H 2900 3000 50  0001 C CNN
F 1 "+5V" H 2900 3290 50  0000 C CNN
F 2 "" H 2900 3150 50  0000 C CNN
F 3 "" H 2900 3150 50  0000 C CNN
	1    2900 3150
	1    0    0    -1  
$EndComp
$Comp
L +5V #PWR09
U 1 1 5AF17781
P 6800 3400
F 0 "#PWR09" H 6800 3250 50  0001 C CNN
F 1 "+5V" H 6800 3540 50  0000 C CNN
F 2 "" H 6800 3400 50  0000 C CNN
F 3 "" H 6800 3400 50  0000 C CNN
	1    6800 3400
	1    0    0    -1  
$EndComp
$Comp
L +5V #PWR010
U 1 1 5AF17882
P 7000 3150
F 0 "#PWR010" H 7000 3000 50  0001 C CNN
F 1 "+5V" H 7000 3290 50  0000 C CNN
F 2 "" H 7000 3150 50  0000 C CNN
F 3 "" H 7000 3150 50  0000 C CNN
	1    7000 3150
	1    0    0    -1  
$EndComp
$Comp
L GND #PWR011
U 1 1 5AF17994
P 6600 4200
F 0 "#PWR011" H 6600 3950 50  0001 C CNN
F 1 "GND" H 6600 4050 50  0000 C CNN
F 2 "" H 6600 4200 50  0000 C CNN
F 3 "" H 6600 4200 50  0000 C CNN
	1    6600 4200
	1    0    0    -1  
$EndComp
$Comp
L GND #PWR012
U 1 1 5AF17A75
P 6300 3100
F 0 "#PWR012" H 6300 2850 50  0001 C CNN
F 1 "GND" H 6300 2950 50  0000 C CNN
F 2 "" H 6300 3100 50  0000 C CNN
F 3 "" H 6300 3100 50  0000 C CNN
	1    6300 3100
	1    0    0    -1  
$EndComp
$Comp
L GND #PWR013
U 1 1 5AF17C8F
P 7100 2450
F 0 "#PWR013" H 7100 2200 50  0001 C CNN
F 1 "GND" H 7100 2300 50  0000 C CNN
F 2 "" H 7100 2450 50  0000 C CNN
F 3 "" H 7100 2450 50  0000 C CNN
	1    7100 2450
	1    0    0    -1  
$EndComp
$Comp
L GND #PWR014
U 1 1 5AF16C58
P 4150 2200
F 0 "#PWR014" H 4150 1950 50  0001 C CNN
F 1 "GND" H 4150 2050 50  0000 C CNN
F 2 "" H 4150 2200 50  0000 C CNN
F 3 "" H 4150 2200 50  0000 C CNN
	1    4150 2200
	1    0    0    -1  
$EndComp
$Comp
L R R1
U 1 1 5AF9533F
P 5700 4900
F 0 "R1" V 5780 4900 50  0000 C CNN
F 1 "1K" V 5700 4900 50  0000 C CNN
F 2 "Resistors_THT:Resistor_Horizontal_RM15mm" V 5630 4900 50  0001 C CNN
F 3 "" H 5700 4900 50  0000 C CNN
	1    5700 4900
	1    0    0    -1  
$EndComp
$Comp
L GND #PWR015
U 1 1 5AF95505
P 5700 5150
F 0 "#PWR015" H 5700 4900 50  0001 C CNN
F 1 "GND" H 5700 5000 50  0000 C CNN
F 2 "" H 5700 5150 50  0000 C CNN
F 3 "" H 5700 5150 50  0000 C CNN
	1    5700 5150
	1    0    0    -1  
$EndComp
$Comp
L Buzzer BZ1
U 1 1 5B04FE7B
P 4550 2450
F 0 "BZ1" H 4700 2500 50  0000 L CNN
F 1 "Buzzer" H 4700 2400 50  0000 L CNN
F 2 "Buzzers_Beepers:Buzzer_12x9.5RM7.6" V 4525 2550 50  0001 C CNN
F 3 "" V 4525 2550 50  0000 C CNN
	1    4550 2450
	0    -1   -1   0   
$EndComp
$Comp
L GND #PWR016
U 1 1 5B05042A
P 4650 2700
F 0 "#PWR016" H 4650 2450 50  0001 C CNN
F 1 "GND" H 4650 2550 50  0000 C CNN
F 2 "" H 4650 2700 50  0000 C CNN
F 3 "" H 4650 2700 50  0000 C CNN
	1    4650 2700
	1    0    0    -1  
$EndComp
$Comp
L LED DG_1
U 1 1 5B06B7D4
P 6400 5650
F 0 "DG_1" H 6400 5750 50  0000 C CNN
F 1 "LED" H 6400 5550 50  0000 C CNN
F 2 "LEDs:LED-3MM" H 6400 5650 50  0001 C CNN
F 3 "" H 6400 5650 50  0000 C CNN
	1    6400 5650
	0    1    1    0   
$EndComp
$Comp
L GND #PWR017
U 1 1 5B06BBE3
P 6400 5850
F 0 "#PWR017" H 6400 5600 50  0001 C CNN
F 1 "GND" H 6400 5700 50  0000 C CNN
F 2 "" H 6400 5850 50  0000 C CNN
F 3 "" H 6400 5850 50  0000 C CNN
	1    6400 5850
	1    0    0    -1  
$EndComp
$Comp
L R R2
U 1 1 5B06BEC6
P 6400 5250
F 0 "R2" V 6480 5250 50  0000 C CNN
F 1 "1K" V 6400 5250 50  0000 C CNN
F 2 "Resistors_THT:Resistor_Horizontal_RM15mm" V 6330 5250 50  0001 C CNN
F 3 "" H 6400 5250 50  0000 C CNN
	1    6400 5250
	1    0    0    -1  
$EndComp
$Comp
L +5V #PWR018
U 1 1 5B0BDC67
P 6400 5000
F 0 "#PWR018" H 6400 4850 50  0001 C CNN
F 1 "+5V" H 6400 5140 50  0000 C CNN
F 2 "" H 6400 5000 50  0000 C CNN
F 3 "" H 6400 5000 50  0000 C CNN
	1    6400 5000
	1    0    0    -1  
$EndComp
$Comp
L USB_B P2
U 1 1 5B18DB83
P 4050 1700
F 0 "P2" H 4250 1500 50  0000 C CNN
F 1 "USB_I2C" H 4000 1900 50  0000 C CNN
F 2 "Connectors:USB_Mini-B" V 4000 1600 50  0001 C CNN
F 3 "" V 4000 1600 50  0000 C CNN
	1    4050 1700
	1    0    0    -1  
$EndComp
$Comp
L PWR_FLAG #FLG019
U 1 1 5B18EE22
P 5900 2850
F 0 "#FLG019" H 5900 2945 50  0001 C CNN
F 1 "PWR_FLAG" H 5900 3030 50  0000 C CNN
F 2 "" H 5900 2850 50  0000 C CNN
F 3 "" H 5900 2850 50  0000 C CNN
	1    5900 2850
	1    0    0    -1  
$EndComp
$Comp
L PWR_FLAG #FLG020
U 1 1 5AF180EE
P 6300 2950
F 0 "#FLG020" H 6300 3045 50  0001 C CNN
F 1 "PWR_FLAG" H 6300 3130 50  0000 C CNN
F 2 "" H 6300 2950 50  0000 C CNN
F 3 "" H 6300 2950 50  0000 C CNN
	1    6300 2950
	1    0    0    -1  
$EndComp
Wire Wire Line
	6300 2950 6300 3100
Connection ~ 6300 3050
Wire Wire Line
	6600 4150 6900 4150
Wire Wire Line
	6600 4200 6600 4150
Connection ~ 4150 2050
Wire Wire Line
	4350 2050 4150 2050
Wire Wire Line
	4350 1600 4350 2050
Wire Wire Line
	6400 5000 6400 5100
Wire Wire Line
	6400 5400 6400 5500
Wire Wire Line
	6400 5800 6400 5850
Wire Wire Line
	4650 2550 4650 2700
Wire Wire Line
	4150 2550 4450 2550
Wire Wire Line
	4150 3700 4150 2550
Wire Wire Line
	4150 3700 4500 3700
Wire Wire Line
	5700 5050 5700 5150
Connection ~ 5700 4700
Wire Wire Line
	5700 4750 5700 4700
Wire Wire Line
	4150 2000 4150 2200
Wire Wire Line
	3850 2000 3850 2250
Wire Wire Line
	7100 2300 7100 2450
Wire Wire Line
	6900 2300 7100 2300
Wire Wire Line
	6000 3050 6300 3050
Wire Wire Line
	6000 3200 6000 3050
Wire Wire Line
	5900 3200 6000 3200
Wire Wire Line
	7000 3150 7000 3300
Wire Wire Line
	5900 3400 6800 3400
Wire Wire Line
	2900 3150 2900 3300
Wire Wire Line
	2900 3350 2900 3450
Wire Wire Line
	2650 3350 2900 3350
Wire Wire Line
	2850 4000 2850 4200
Wire Wire Line
	2700 4000 2850 4000
Wire Wire Line
	1900 3650 2050 3650
Wire Wire Line
	1900 3600 1900 3650
Wire Wire Line
	4400 5100 4400 5150
Wire Wire Line
	3600 5100 3600 5150
Wire Wire Line
	2700 5100 2700 5150
Wire Wire Line
	7200 3700 7200 4150
Wire Wire Line
	7100 3700 7100 4150
Wire Wire Line
	7000 3700 7000 4150
Wire Wire Line
	4050 2000 4050 3600
Wire Wire Line
	4050 3600 4500 3600
Wire Wire Line
	3950 3500 4500 3500
Wire Wire Line
	3950 2000 3950 3500
Wire Wire Line
	6700 3800 6700 3900
Wire Wire Line
	5900 3800 6700 3800
Wire Wire Line
	6750 3700 6750 3850
Wire Wire Line
	5900 3700 6750 3700
Wire Wire Line
	6800 3600 6800 3800
Wire Wire Line
	5900 3600 6800 3600
Wire Wire Line
	6850 3500 6850 3750
Wire Wire Line
	5900 3500 6850 3500
Wire Wire Line
	3350 5100 3350 3900
Wire Wire Line
	3350 3900 4500 3900
Connection ~ 3850 4900
Wire Wire Line
	4500 4100 3850 4100
Connection ~ 4500 4850
Wire Wire Line
	4500 4200 4500 4850
Connection ~ 4650 5100
Wire Wire Line
	4550 5100 4650 5100
Wire Wire Line
	4550 5150 4550 5100
Connection ~ 3850 5100
Wire Wire Line
	3850 5100 3750 5100
Wire Wire Line
	3750 5100 3750 5150
Connection ~ 2950 5100
Wire Wire Line
	2850 5100 3350 5100
Wire Wire Line
	2850 5100 2850 5150
Wire Wire Line
	2950 4600 2950 5150
Wire Wire Line
	3150 4900 3150 4600
Wire Wire Line
	3850 4900 3150 4900
Wire Wire Line
	3850 4100 3850 5150
Wire Wire Line
	4650 4850 4650 5150
Wire Wire Line
	3050 4850 4650 4850
Wire Wire Line
	3050 4600 3050 4850
Connection ~ 2600 3650
Wire Wire Line
	2600 4600 2600 3650
Wire Wire Line
	2850 4600 2600 4600
Wire Wire Line
	2950 4000 4500 4000
Wire Wire Line
	2950 3650 2950 4000
Wire Wire Line
	2450 3650 2950 3650
Wire Wire Line
	6500 3300 6500 2300
Wire Wire Line
	5900 3300 6500 3300
Wire Wire Line
	5900 4700 5900 4200
Wire Wire Line
	3800 4700 5900 4700
Wire Wire Line
	3800 3350 3800 4700
Wire Wire Line
	5900 2850 5900 3100
$Comp
L GND #PWR?
U 1 1 5B1A2771
P 4300 3000
F 0 "#PWR?" H 4300 2750 50  0001 C CNN
F 1 "GND" H 4300 2850 50  0000 C CNN
F 2 "" H 4300 3000 50  0000 C CNN
F 3 "" H 4300 3000 50  0000 C CNN
	1    4300 3000
	1    0    0    -1  
$EndComp
$Comp
L GND #PWR?
U 1 1 5B1A28A8
P 4250 3300
F 0 "#PWR?" H 4250 3050 50  0001 C CNN
F 1 "GND" H 4250 3150 50  0000 C CNN
F 2 "" H 4250 3300 50  0000 C CNN
F 3 "" H 4250 3300 50  0000 C CNN
	1    4250 3300
	1    0    0    -1  
$EndComp
Wire Wire Line
	4300 3000 4400 3000
Wire Wire Line
	4400 3000 4400 3300
Wire Wire Line
	4400 3300 4500 3300
Wire Wire Line
	4250 3300 4350 3300
Wire Wire Line
	4350 3300 4350 3400
Wire Wire Line
	4350 3400 4500 3400
Wire Wire Line
	6850 3750 7000 3750
Connection ~ 7000 3750
Wire Wire Line
	7300 3700 7300 4150
Wire Wire Line
	6800 3800 7100 3800
Connection ~ 7100 3800
Wire Wire Line
	6750 3850 7200 3850
Connection ~ 7200 3850
Wire Wire Line
	6700 3900 7300 3900
Connection ~ 7300 3900
$EndSCHEMATC
