G04 #@! TF.GenerationSoftware,KiCad,Pcbnew,5.1.5+dfsg1-2*
G04 #@! TF.CreationDate,2020-02-11T15:18:20+05:30*
G04 #@! TF.ProjectId,flipmouse,666c6970-6d6f-4757-9365-2e6b69636164,rev?*
G04 #@! TF.SameCoordinates,Original*
G04 #@! TF.FileFunction,Soldermask,Top*
G04 #@! TF.FilePolarity,Negative*
%FSLAX46Y46*%
G04 Gerber Fmt 4.6, Leading zero omitted, Abs format (unit mm)*
G04 Created by KiCad (PCBNEW 5.1.5+dfsg1-2) date 2020-02-11 15:18:20*
%MOMM*%
%LPD*%
G04 APERTURE LIST*
%ADD10R,2.000000X2.000000*%
%ADD11C,2.000000*%
%ADD12C,2.400000*%
%ADD13R,2.400000X2.400000*%
%ADD14O,2.000000X2.000000*%
%ADD15C,2.500000*%
%ADD16C,2.150000*%
%ADD17C,2.398980*%
%ADD18R,2.700000X3.400000*%
%ADD19R,2.700000X2.400000*%
%ADD20C,1.700000*%
%ADD21C,1.300000*%
%ADD22R,2.432000X2.127200*%
%ADD23O,2.432000X2.127200*%
G04 APERTURE END LIST*
D10*
X88900000Y-72390000D03*
D11*
X88900000Y-69850000D03*
X88900000Y-67310000D03*
X88900000Y-64770000D03*
X88900000Y-62230000D03*
X88900000Y-59690000D03*
X88900000Y-57150000D03*
X88900000Y-54610000D03*
X88900000Y-52070000D03*
X88900000Y-49530000D03*
X88900000Y-46990000D03*
X88900000Y-44450000D03*
X73660000Y-44450000D03*
X73660000Y-46990000D03*
X73660000Y-49530000D03*
X73660000Y-52070000D03*
X73660000Y-54610000D03*
X73660000Y-57150000D03*
X73660000Y-59690000D03*
X73660000Y-62230000D03*
X73660000Y-64770000D03*
X73660000Y-67310000D03*
X73660000Y-69850000D03*
X73660000Y-72390000D03*
D12*
X101600000Y-70601840D03*
X101600000Y-63002160D03*
D13*
X82550000Y-73660000D03*
D12*
X80010000Y-73660000D03*
D10*
X107950000Y-62230000D03*
D14*
X107950000Y-59690000D03*
X107950000Y-57150000D03*
X107950000Y-54610000D03*
X107950000Y-52070000D03*
D10*
X91694000Y-55372000D03*
D14*
X94234000Y-55372000D03*
X96774000Y-55372000D03*
X99314000Y-55372000D03*
X101854000Y-55372000D03*
D15*
X70440000Y-45670000D03*
D16*
X71700000Y-43180000D03*
X76200000Y-43180000D03*
D15*
X77450000Y-45670000D03*
X85680000Y-45670000D03*
D16*
X86940000Y-43180000D03*
X91440000Y-43180000D03*
D15*
X92690000Y-45670000D03*
D17*
X76200000Y-69850000D03*
X86360000Y-69850000D03*
X69850000Y-59690000D03*
X69850000Y-49530000D03*
D18*
X98298000Y-73152000D03*
X92202000Y-73152000D03*
D19*
X98190000Y-64770000D03*
X92240000Y-64770000D03*
D20*
X97750000Y-68830000D03*
X92750000Y-68830000D03*
D18*
X110998000Y-73152000D03*
X104902000Y-73152000D03*
D19*
X110890000Y-64770000D03*
X104940000Y-64770000D03*
D20*
X110450000Y-68830000D03*
X105450000Y-68830000D03*
D18*
X96012000Y-43688000D03*
X102108000Y-43688000D03*
D19*
X96120000Y-52070000D03*
X102070000Y-52070000D03*
D20*
X96560000Y-48010000D03*
X101560000Y-48010000D03*
D21*
X108290000Y-45920000D03*
X112690000Y-45920000D03*
D22*
X113792000Y-53340000D03*
D23*
X113792000Y-55880000D03*
X113792000Y-58420000D03*
X113792000Y-60960000D03*
X113792000Y-63500000D03*
M02*
