G04 #@! TF.GenerationSoftware,KiCad,Pcbnew,5.1.5+dfsg1-2*
G04 #@! TF.CreationDate,2020-01-10T10:39:52+05:30*
G04 #@! TF.ProjectId,flipmouse,666c6970-6d6f-4757-9365-2e6b69636164,rev?*
G04 #@! TF.SameCoordinates,Original*
G04 #@! TF.FileFunction,Paste,Bot*
G04 #@! TF.FilePolarity,Positive*
%FSLAX46Y46*%
G04 Gerber Fmt 4.6, Leading zero omitted, Abs format (unit mm)*
G04 Created by KiCad (PCBNEW 5.1.5+dfsg1-2) date 2020-01-10 10:39:52*
%MOMM*%
%LPD*%
G04 APERTURE LIST*
%ADD10R,1.524000X2.540000*%
%ADD11R,0.500000X2.300000*%
%ADD12R,2.000000X2.500000*%
G04 APERTURE END LIST*
D10*
X85090000Y-65532000D03*
X82550000Y-65532000D03*
X80010000Y-65532000D03*
X77470000Y-65532000D03*
X77470000Y-48768000D03*
X80010000Y-48768000D03*
X82550000Y-48768000D03*
X85090000Y-48768000D03*
D11*
X108890000Y-48520000D03*
X109690000Y-48520000D03*
X110490000Y-48520000D03*
X111290000Y-48520000D03*
X112090000Y-48520000D03*
D12*
X106040000Y-48420000D03*
X106040000Y-42920000D03*
X114940000Y-48420000D03*
X114940000Y-42920000D03*
M02*
