(footprint "Side View RGB Chip LED" (version 20211014) (generator pcbnew)
  (layer "F.Cu")
  (tedit 61DBBD5C)
  (descr "LED RGB, APFA3010, http://www.kingbrightusa.com/images/catalog/SPEC/APFA3010LSEEZGKQBKC.pdf")
  (tags "LED RGB APFA3010 KINGBRIGHT 3x1.5mm")
  (attr smd)
  (fp_text reference "REF**" (at 0 1.8) (layer "F.SilkS")
    (effects (font (size 1 1) (thickness 0.15)))
    (tstamp ac537336-33a0-47bc-90e1-5082b69cc9ca)
  )
  (fp_text value "Side View RGB Chip LED" (at 0 3) (layer "F.Fab")
    (effects (font (size 0.5 0.5) (thickness 0.075)))
    (tstamp b7f8440c-23b7-437b-b935-4fbe03161fd7)
  )
  (fp_text user "${REFERENCE}" (at 0 0) (layer "F.Fab")
    (effects (font (size 0.3 0.3) (thickness 0.045)))
    (tstamp 56809caa-e153-470f-aa02-e08a3f50a375)
  )
  (fp_line (start -2.2 0.65) (end -1.5 0.65) (layer "F.SilkS") (width 0.12) (tstamp 8b6bf445-c726-4109-9f29-b5151aea8368))
  (fp_line (start -2.2 0) (end -2.2 0.65) (layer "F.SilkS") (width 0.12) (tstamp b57f3629-fd6e-4aaf-ae00-740863a9d7ca))
  (fp_arc (start -1 -0.65) (mid 0 -1.327033) (end 1 -0.65) (layer "F.SilkS") (width 0.12) (tstamp 1c4e2cc3-1e5c-4915-8731-7fa81de8c0b1))
  (fp_line (start -0.85 0.7) (end -0.85 1.1) (layer "F.CrtYd") (width 0.05) (tstamp 182453ab-fe88-4ddd-ac38-e1316b6ce90f))
  (fp_line (start -2.25 -0.7) (end -1.17 -0.7) (layer "F.CrtYd") (width 0.05) (tstamp 1da83280-6f9f-4b9f-a9be-273fd68fc7cf))
  (fp_line (start 0.85 1.1) (end 0.85 0.7) (layer "F.CrtYd") (width 0.05) (tstamp 3a8ce589-0588-4bbd-b6b0-56afa7e14f46))
  (fp_line (start -2.25 0.7) (end -0.85 0.7) (layer "F.CrtYd") (width 0.05) (tstamp 3fc37943-8d57-4586-af0d-999df180df70))
  (fp_line (start 2.25 -0.7) (end 1.17 -0.7) (layer "F.CrtYd") (width 0.05) (tstamp 6e73c79b-3b9f-46bf-98c4-16462bf4adaf))
  (fp_line (start -2.25 0.7) (end -2.25 -0.7) (layer "F.CrtYd") (width 0.05) (tstamp 72d95b6f-c92a-43d5-9d3f-1403c61ef42a))
  (fp_line (start 2.25 0.7) (end 2.25 -0.7) (layer "F.CrtYd") (width 0.05) (tstamp 7fed9ee8-035d-44c3-a220-a2db37b1c99c))
  (fp_line (start 0.85 0.7) (end 2.25 0.7) (layer "F.CrtYd") (width 0.05) (tstamp beadb26d-5d17-4a15-a38c-dc37773bbb03))
  (fp_line (start -0.85 1.1) (end 0.85 1.1) (layer "F.CrtYd") (width 0.05) (tstamp dae719b9-2b36-4a6c-8399-1d5f2e561efd))
  (fp_arc (start -1.17 -0.7) (mid 0 -1.503555) (end 1.17 -0.7) (layer "F.CrtYd") (width 0.05) (tstamp 5a100e45-f471-4461-9578-4903d311ca5e))
  (fp_line (start -1.5 -0.25) (end -1.5 0.25) (layer "F.Fab") (width 0.1) (tstamp 02e91bca-8f19-4b78-972e-626c50366aea))
  (fp_line (start 1.5 0.25) (end 1.5 -0.25) (layer "F.Fab") (width 0.1) (tstamp 076dedcc-771e-437a-814c-4567b92a4b5a))
  (fp_line (start -1.5 0.25) (end 1.5 0.25) (layer "F.Fab") (width 0.1) (tstamp 193c6262-8bec-41dc-80dc-fa3cc70dacec))
  (fp_line (start -0.75 -0.25) (end -1.25 0.25) (layer "F.Fab") (width 0.1) (tstamp af655c64-008f-4ecc-b615-20ea755c744c))
  (fp_line (start 1.5 -0.25) (end -1.5 -0.25) (layer "F.Fab") (width 0.1) (tstamp b52a215e-a06d-4895-a903-68c5aea8acfd))
  (fp_arc (start -1 -0.25) (mid 0 -1.25) (end 1 -0.25) (layer "F.Fab") (width 0.1) (tstamp 1928ea0f-1556-47b4-a373-051ec2056356))
  (pad "1" smd rect (at -1.4 0) (size 0.7 0.9) (layers "F.Cu" "F.Paste" "F.Mask") (tstamp 78e17a01-26e3-468c-86a7-6890ed9e73c4))
  (pad "2" smd rect (at -0.425 0.45) (size 0.55 0.7) (layers "F.Cu" "F.Paste" "F.Mask") (tstamp 41c614d0-9505-469f-810e-cbd6247c6a10))
  (pad "3" smd rect (at 0.425 0.45) (size 0.55 0.7) (layers "F.Cu" "F.Paste" "F.Mask") (tstamp a3a178f8-ad5c-4757-9f2a-0c8ca7814040))
  (pad "4" smd rect (at 1.4 0) (size 0.7 0.9) (layers "F.Cu" "F.Paste" "F.Mask") (tstamp 99ac923f-78c4-4f03-8904-9f70d791f7bc))
  (model "${KICAD6_3DMODEL_DIR}/LED_SMD.3dshapes/LED_Kingbright_APFA3010_3x1.5mm_Horizontal.wrl"
    (offset (xyz 0 0 0))
    (scale (xyz 1 1 1))
    (rotate (xyz 0 0 0))
  )
)
