(kicad_sch (version 20230121) (generator eeschema)

  (uuid 97082934-77f5-4c1d-b31a-cbbb6fa08175)

  (paper "A4")

  (title_block
    (title "MCU")
    (date "2020-12-12")
    (rev "1")
    (company "Castrlab")
    (comment 1 "This work is licensed under a Creative Commons Attribution 4.0 International License")
    (comment 4 "https://castrlab.com")
  )

  (lib_symbols
    (symbol "Device:C" (pin_numbers hide) (pin_names (offset 0.254)) (in_bom yes) (on_board yes)
      (property "Reference" "C" (at 0.635 2.54 0)
        (effects (font (size 1.27 1.27)) (justify left))
      )
      (property "Value" "C" (at 0.635 -2.54 0)
        (effects (font (size 1.27 1.27)) (justify left))
      )
      (property "Footprint" "" (at 0.9652 -3.81 0)
        (effects (font (size 1.27 1.27)) hide)
      )
      (property "Datasheet" "~" (at 0 0 0)
        (effects (font (size 1.27 1.27)) hide)
      )
      (property "ki_keywords" "cap capacitor" (at 0 0 0)
        (effects (font (size 1.27 1.27)) hide)
      )
      (property "ki_description" "Unpolarized capacitor" (at 0 0 0)
        (effects (font (size 1.27 1.27)) hide)
      )
      (property "ki_fp_filters" "C_*" (at 0 0 0)
        (effects (font (size 1.27 1.27)) hide)
      )
      (symbol "C_0_1"
        (polyline
          (pts
            (xy -2.032 -0.762)
            (xy 2.032 -0.762)
          )
          (stroke (width 0.508) (type default))
          (fill (type none))
        )
        (polyline
          (pts
            (xy -2.032 0.762)
            (xy 2.032 0.762)
          )
          (stroke (width 0.508) (type default))
          (fill (type none))
        )
      )
      (symbol "C_1_1"
        (pin passive line (at 0 3.81 270) (length 2.794)
          (name "~" (effects (font (size 1.27 1.27))))
          (number "1" (effects (font (size 1.27 1.27))))
        )
        (pin passive line (at 0 -3.81 90) (length 2.794)
          (name "~" (effects (font (size 1.27 1.27))))
          (number "2" (effects (font (size 1.27 1.27))))
        )
      )
    )
    (symbol "Device:LED_RGBA" (pin_names (offset 0) hide) (in_bom yes) (on_board yes)
      (property "Reference" "D" (at 0 9.398 0)
        (effects (font (size 1.27 1.27)))
      )
      (property "Value" "LED_RGBA" (at 0 -8.89 0)
        (effects (font (size 1.27 1.27)))
      )
      (property "Footprint" "" (at 0 -1.27 0)
        (effects (font (size 1.27 1.27)) hide)
      )
      (property "Datasheet" "~" (at 0 -1.27 0)
        (effects (font (size 1.27 1.27)) hide)
      )
      (property "ki_keywords" "LED RGB diode" (at 0 0 0)
        (effects (font (size 1.27 1.27)) hide)
      )
      (property "ki_description" "RGB LED, red/green/blue/anode" (at 0 0 0)
        (effects (font (size 1.27 1.27)) hide)
      )
      (property "ki_fp_filters" "LED* LED_SMD:* LED_THT:*" (at 0 0 0)
        (effects (font (size 1.27 1.27)) hide)
      )
      (symbol "LED_RGBA_0_0"
        (text "B" (at -1.905 -6.35 0)
          (effects (font (size 1.27 1.27)))
        )
        (text "G" (at -1.905 -1.27 0)
          (effects (font (size 1.27 1.27)))
        )
        (text "R" (at -1.905 3.81 0)
          (effects (font (size 1.27 1.27)))
        )
      )
      (symbol "LED_RGBA_0_1"
        (polyline
          (pts
            (xy -1.27 -5.08)
            (xy -2.54 -5.08)
          )
          (stroke (width 0) (type default))
          (fill (type none))
        )
        (polyline
          (pts
            (xy -1.27 -5.08)
            (xy 1.27 -5.08)
          )
          (stroke (width 0) (type default))
          (fill (type none))
        )
        (polyline
          (pts
            (xy -1.27 -3.81)
            (xy -1.27 -6.35)
          )
          (stroke (width 0.254) (type default))
          (fill (type none))
        )
        (polyline
          (pts
            (xy -1.27 0)
            (xy -2.54 0)
          )
          (stroke (width 0) (type default))
          (fill (type none))
        )
        (polyline
          (pts
            (xy -1.27 1.27)
            (xy -1.27 -1.27)
          )
          (stroke (width 0.254) (type default))
          (fill (type none))
        )
        (polyline
          (pts
            (xy -1.27 5.08)
            (xy -2.54 5.08)
          )
          (stroke (width 0) (type default))
          (fill (type none))
        )
        (polyline
          (pts
            (xy -1.27 5.08)
            (xy 1.27 5.08)
          )
          (stroke (width 0) (type default))
          (fill (type none))
        )
        (polyline
          (pts
            (xy -1.27 6.35)
            (xy -1.27 3.81)
          )
          (stroke (width 0.254) (type default))
          (fill (type none))
        )
        (polyline
          (pts
            (xy 1.27 0)
            (xy -1.27 0)
          )
          (stroke (width 0) (type default))
          (fill (type none))
        )
        (polyline
          (pts
            (xy 1.27 0)
            (xy 2.54 0)
          )
          (stroke (width 0) (type default))
          (fill (type none))
        )
        (polyline
          (pts
            (xy -1.27 1.27)
            (xy -1.27 -1.27)
            (xy -1.27 -1.27)
          )
          (stroke (width 0) (type default))
          (fill (type none))
        )
        (polyline
          (pts
            (xy -1.27 6.35)
            (xy -1.27 3.81)
            (xy -1.27 3.81)
          )
          (stroke (width 0) (type default))
          (fill (type none))
        )
        (polyline
          (pts
            (xy 1.27 -5.08)
            (xy 2.032 -5.08)
            (xy 2.032 5.08)
            (xy 1.27 5.08)
          )
          (stroke (width 0) (type default))
          (fill (type none))
        )
        (polyline
          (pts
            (xy 1.27 -3.81)
            (xy 1.27 -6.35)
            (xy -1.27 -5.08)
            (xy 1.27 -3.81)
          )
          (stroke (width 0.254) (type default))
          (fill (type none))
        )
        (polyline
          (pts
            (xy 1.27 1.27)
            (xy 1.27 -1.27)
            (xy -1.27 0)
            (xy 1.27 1.27)
          )
          (stroke (width 0.254) (type default))
          (fill (type none))
        )
        (polyline
          (pts
            (xy 1.27 6.35)
            (xy 1.27 3.81)
            (xy -1.27 5.08)
            (xy 1.27 6.35)
          )
          (stroke (width 0.254) (type default))
          (fill (type none))
        )
        (polyline
          (pts
            (xy -1.016 -3.81)
            (xy 0.508 -2.286)
            (xy -0.254 -2.286)
            (xy 0.508 -2.286)
            (xy 0.508 -3.048)
          )
          (stroke (width 0) (type default))
          (fill (type none))
        )
        (polyline
          (pts
            (xy -1.016 1.27)
            (xy 0.508 2.794)
            (xy -0.254 2.794)
            (xy 0.508 2.794)
            (xy 0.508 2.032)
          )
          (stroke (width 0) (type default))
          (fill (type none))
        )
        (polyline
          (pts
            (xy -1.016 6.35)
            (xy 0.508 7.874)
            (xy -0.254 7.874)
            (xy 0.508 7.874)
            (xy 0.508 7.112)
          )
          (stroke (width 0) (type default))
          (fill (type none))
        )
        (polyline
          (pts
            (xy 0 -3.81)
            (xy 1.524 -2.286)
            (xy 0.762 -2.286)
            (xy 1.524 -2.286)
            (xy 1.524 -3.048)
          )
          (stroke (width 0) (type default))
          (fill (type none))
        )
        (polyline
          (pts
            (xy 0 1.27)
            (xy 1.524 2.794)
            (xy 0.762 2.794)
            (xy 1.524 2.794)
            (xy 1.524 2.032)
          )
          (stroke (width 0) (type default))
          (fill (type none))
        )
        (polyline
          (pts
            (xy 0 6.35)
            (xy 1.524 7.874)
            (xy 0.762 7.874)
            (xy 1.524 7.874)
            (xy 1.524 7.112)
          )
          (stroke (width 0) (type default))
          (fill (type none))
        )
        (rectangle (start 1.27 -1.27) (end 1.27 1.27)
          (stroke (width 0) (type default))
          (fill (type none))
        )
        (rectangle (start 1.27 1.27) (end 1.27 1.27)
          (stroke (width 0) (type default))
          (fill (type none))
        )
        (rectangle (start 1.27 3.81) (end 1.27 6.35)
          (stroke (width 0) (type default))
          (fill (type none))
        )
        (rectangle (start 1.27 6.35) (end 1.27 6.35)
          (stroke (width 0) (type default))
          (fill (type none))
        )
        (circle (center 2.032 0) (radius 0.254)
          (stroke (width 0) (type default))
          (fill (type outline))
        )
        (rectangle (start 2.794 8.382) (end -2.794 -7.62)
          (stroke (width 0.254) (type default))
          (fill (type background))
        )
      )
      (symbol "LED_RGBA_1_1"
        (pin passive line (at -5.08 5.08 0) (length 2.54)
          (name "RK" (effects (font (size 1.27 1.27))))
          (number "1" (effects (font (size 1.27 1.27))))
        )
        (pin passive line (at -5.08 0 0) (length 2.54)
          (name "GK" (effects (font (size 1.27 1.27))))
          (number "2" (effects (font (size 1.27 1.27))))
        )
        (pin passive line (at -5.08 -5.08 0) (length 2.54)
          (name "BK" (effects (font (size 1.27 1.27))))
          (number "3" (effects (font (size 1.27 1.27))))
        )
        (pin passive line (at 5.08 0 180) (length 2.54)
          (name "A" (effects (font (size 1.27 1.27))))
          (number "4" (effects (font (size 1.27 1.27))))
        )
      )
    )
    (symbol "Device:Q_Dual_NMOS_S1G1D2S2G2D1" (pin_names (offset 0) hide) (in_bom yes) (on_board yes)
      (property "Reference" "Q" (at 6.35 1.27 0)
        (effects (font (size 1.27 1.27)))
      )
      (property "Value" "Q_Dual_NMOS_S1G1D2S2G2D1" (at 19.05 -1.27 0)
        (effects (font (size 1.27 1.27)))
      )
      (property "Footprint" "" (at 5.08 0 0)
        (effects (font (size 1.27 1.27)) hide)
      )
      (property "Datasheet" "~" (at 5.08 0 0)
        (effects (font (size 1.27 1.27)) hide)
      )
      (property "ki_keywords" "transistor NMOS N-MOS N-MOSFET" (at 0 0 0)
        (effects (font (size 1.27 1.27)) hide)
      )
      (property "ki_description" "Dual NMOS transistor, 6 pin package" (at 0 0 0)
        (effects (font (size 1.27 1.27)) hide)
      )
      (property "ki_fp_filters" "TSOP* SC?70* SC?88* SOT?363*" (at 0 0 0)
        (effects (font (size 1.27 1.27)) hide)
      )
      (symbol "Q_Dual_NMOS_S1G1D2S2G2D1_0_1"
        (polyline
          (pts
            (xy 0.254 0)
            (xy -2.54 0)
          )
          (stroke (width 0) (type default))
          (fill (type none))
        )
        (polyline
          (pts
            (xy 0.254 1.905)
            (xy 0.254 -1.905)
          )
          (stroke (width 0.254) (type default))
          (fill (type none))
        )
        (polyline
          (pts
            (xy 0.762 -1.27)
            (xy 0.762 -2.286)
          )
          (stroke (width 0.254) (type default))
          (fill (type none))
        )
        (polyline
          (pts
            (xy 0.762 0.508)
            (xy 0.762 -0.508)
          )
          (stroke (width 0.254) (type default))
          (fill (type none))
        )
        (polyline
          (pts
            (xy 0.762 2.286)
            (xy 0.762 1.27)
          )
          (stroke (width 0.254) (type default))
          (fill (type none))
        )
        (polyline
          (pts
            (xy 2.54 2.54)
            (xy 2.54 1.778)
          )
          (stroke (width 0) (type default))
          (fill (type none))
        )
        (polyline
          (pts
            (xy 2.54 -2.54)
            (xy 2.54 0)
            (xy 0.762 0)
          )
          (stroke (width 0) (type default))
          (fill (type none))
        )
        (polyline
          (pts
            (xy 0.762 -1.778)
            (xy 3.302 -1.778)
            (xy 3.302 1.778)
            (xy 0.762 1.778)
          )
          (stroke (width 0) (type default))
          (fill (type none))
        )
        (polyline
          (pts
            (xy 1.016 0)
            (xy 2.032 0.381)
            (xy 2.032 -0.381)
            (xy 1.016 0)
          )
          (stroke (width 0) (type default))
          (fill (type outline))
        )
        (polyline
          (pts
            (xy 2.794 0.508)
            (xy 2.921 0.381)
            (xy 3.683 0.381)
            (xy 3.81 0.254)
          )
          (stroke (width 0) (type default))
          (fill (type none))
        )
        (polyline
          (pts
            (xy 3.302 0.381)
            (xy 2.921 -0.254)
            (xy 3.683 -0.254)
            (xy 3.302 0.381)
          )
          (stroke (width 0) (type default))
          (fill (type none))
        )
        (circle (center 1.651 0) (radius 2.794)
          (stroke (width 0.254) (type default))
          (fill (type none))
        )
        (circle (center 2.54 -1.778) (radius 0.254)
          (stroke (width 0) (type default))
          (fill (type outline))
        )
        (circle (center 2.54 1.778) (radius 0.254)
          (stroke (width 0) (type default))
          (fill (type outline))
        )
      )
      (symbol "Q_Dual_NMOS_S1G1D2S2G2D1_1_1"
        (pin passive line (at 2.54 -5.08 90) (length 2.54)
          (name "S" (effects (font (size 1.27 1.27))))
          (number "1" (effects (font (size 1.27 1.27))))
        )
        (pin input line (at -5.08 0 0) (length 2.54)
          (name "G" (effects (font (size 1.27 1.27))))
          (number "2" (effects (font (size 1.27 1.27))))
        )
        (pin passive line (at 2.54 5.08 270) (length 2.54)
          (name "D" (effects (font (size 1.27 1.27))))
          (number "6" (effects (font (size 1.27 1.27))))
        )
      )
      (symbol "Q_Dual_NMOS_S1G1D2S2G2D1_2_1"
        (pin passive line (at 2.54 5.08 270) (length 2.54)
          (name "D" (effects (font (size 1.27 1.27))))
          (number "3" (effects (font (size 1.27 1.27))))
        )
        (pin passive line (at 2.54 -5.08 90) (length 2.54)
          (name "S" (effects (font (size 1.27 1.27))))
          (number "4" (effects (font (size 1.27 1.27))))
        )
        (pin input line (at -5.08 0 0) (length 2.54)
          (name "G" (effects (font (size 1.27 1.27))))
          (number "5" (effects (font (size 1.27 1.27))))
        )
      )
    )
    (symbol "Device:R" (pin_numbers hide) (pin_names (offset 0)) (in_bom yes) (on_board yes)
      (property "Reference" "R" (at 2.032 0 90)
        (effects (font (size 1.27 1.27)))
      )
      (property "Value" "R" (at 0 0 90)
        (effects (font (size 1.27 1.27)))
      )
      (property "Footprint" "" (at -1.778 0 90)
        (effects (font (size 1.27 1.27)) hide)
      )
      (property "Datasheet" "~" (at 0 0 0)
        (effects (font (size 1.27 1.27)) hide)
      )
      (property "ki_keywords" "R res resistor" (at 0 0 0)
        (effects (font (size 1.27 1.27)) hide)
      )
      (property "ki_description" "Resistor" (at 0 0 0)
        (effects (font (size 1.27 1.27)) hide)
      )
      (property "ki_fp_filters" "R_*" (at 0 0 0)
        (effects (font (size 1.27 1.27)) hide)
      )
      (symbol "R_0_1"
        (rectangle (start -1.016 -2.54) (end 1.016 2.54)
          (stroke (width 0.254) (type default))
          (fill (type none))
        )
      )
      (symbol "R_1_1"
        (pin passive line (at 0 3.81 270) (length 1.27)
          (name "~" (effects (font (size 1.27 1.27))))
          (number "1" (effects (font (size 1.27 1.27))))
        )
        (pin passive line (at 0 -3.81 90) (length 1.27)
          (name "~" (effects (font (size 1.27 1.27))))
          (number "2" (effects (font (size 1.27 1.27))))
        )
      )
    )
    (symbol "MCU_ST_STM32L0:STM32L051K8Ux" (in_bom yes) (on_board yes)
      (property "Reference" "U" (at -12.7 21.59 0)
        (effects (font (size 1.27 1.27)) (justify left))
      )
      (property "Value" "STM32L051K8Ux" (at 5.08 21.59 0)
        (effects (font (size 1.27 1.27)) (justify left))
      )
      (property "Footprint" "Package_DFN_QFN:QFN-32-1EP_5x5mm_P0.5mm_EP3.45x3.45mm" (at -12.7 -22.86 0)
        (effects (font (size 1.27 1.27)) (justify right) hide)
      )
      (property "Datasheet" "http://www.st.com/st-web-ui/static/active/en/resource/technical/document/datasheet/DM00108219.pdf" (at 0 0 0)
        (effects (font (size 1.27 1.27)) hide)
      )
      (property "ki_keywords" "ARM Cortex-M0+ STM32L0 STM32L0x1" (at 0 0 0)
        (effects (font (size 1.27 1.27)) hide)
      )
      (property "ki_description" "ARM Cortex-M0+ MCU, 64KB flash, 8KB RAM, 32MHz, 1.65-3.6V, 27 GPIO, UFQFPN-32" (at 0 0 0)
        (effects (font (size 1.27 1.27)) hide)
      )
      (property "ki_fp_filters" "QFN*1EP*5x5mm*P0.5mm*" (at 0 0 0)
        (effects (font (size 1.27 1.27)) hide)
      )
      (symbol "STM32L051K8Ux_0_1"
        (rectangle (start -12.7 -22.86) (end 10.16 20.32)
          (stroke (width 0.254) (type default))
          (fill (type background))
        )
      )
      (symbol "STM32L051K8Ux_1_1"
        (pin power_in line (at -2.54 22.86 270) (length 2.54)
          (name "VDD" (effects (font (size 1.27 1.27))))
          (number "1" (effects (font (size 1.27 1.27))))
        )
        (pin bidirectional line (at 12.7 7.62 180) (length 2.54)
          (name "PA4" (effects (font (size 1.27 1.27))))
          (number "10" (effects (font (size 1.27 1.27))))
        )
        (pin bidirectional line (at 12.7 5.08 180) (length 2.54)
          (name "PA5" (effects (font (size 1.27 1.27))))
          (number "11" (effects (font (size 1.27 1.27))))
        )
        (pin bidirectional line (at 12.7 2.54 180) (length 2.54)
          (name "PA6" (effects (font (size 1.27 1.27))))
          (number "12" (effects (font (size 1.27 1.27))))
        )
        (pin bidirectional line (at 12.7 0 180) (length 2.54)
          (name "PA7" (effects (font (size 1.27 1.27))))
          (number "13" (effects (font (size 1.27 1.27))))
        )
        (pin bidirectional line (at -15.24 0 0) (length 2.54)
          (name "PB0" (effects (font (size 1.27 1.27))))
          (number "14" (effects (font (size 1.27 1.27))))
        )
        (pin bidirectional line (at -15.24 -2.54 0) (length 2.54)
          (name "PB1" (effects (font (size 1.27 1.27))))
          (number "15" (effects (font (size 1.27 1.27))))
        )
        (pin bidirectional line (at -15.24 -5.08 0) (length 2.54)
          (name "PB2" (effects (font (size 1.27 1.27))))
          (number "16" (effects (font (size 1.27 1.27))))
        )
        (pin power_in line (at 0 22.86 270) (length 2.54)
          (name "VDD" (effects (font (size 1.27 1.27))))
          (number "17" (effects (font (size 1.27 1.27))))
        )
        (pin bidirectional line (at 12.7 -2.54 180) (length 2.54)
          (name "PA8" (effects (font (size 1.27 1.27))))
          (number "18" (effects (font (size 1.27 1.27))))
        )
        (pin bidirectional line (at 12.7 -5.08 180) (length 2.54)
          (name "PA9" (effects (font (size 1.27 1.27))))
          (number "19" (effects (font (size 1.27 1.27))))
        )
        (pin bidirectional line (at -15.24 7.62 0) (length 2.54)
          (name "PC14" (effects (font (size 1.27 1.27))))
          (number "2" (effects (font (size 1.27 1.27))))
        )
        (pin bidirectional line (at 12.7 -7.62 180) (length 2.54)
          (name "PA10" (effects (font (size 1.27 1.27))))
          (number "20" (effects (font (size 1.27 1.27))))
        )
        (pin bidirectional line (at 12.7 -10.16 180) (length 2.54)
          (name "PA11" (effects (font (size 1.27 1.27))))
          (number "21" (effects (font (size 1.27 1.27))))
        )
        (pin bidirectional line (at 12.7 -12.7 180) (length 2.54)
          (name "PA12" (effects (font (size 1.27 1.27))))
          (number "22" (effects (font (size 1.27 1.27))))
        )
        (pin bidirectional line (at 12.7 -15.24 180) (length 2.54)
          (name "PA13" (effects (font (size 1.27 1.27))))
          (number "23" (effects (font (size 1.27 1.27))))
        )
        (pin bidirectional line (at 12.7 -17.78 180) (length 2.54)
          (name "PA14" (effects (font (size 1.27 1.27))))
          (number "24" (effects (font (size 1.27 1.27))))
        )
        (pin bidirectional line (at 12.7 -20.32 180) (length 2.54)
          (name "PA15" (effects (font (size 1.27 1.27))))
          (number "25" (effects (font (size 1.27 1.27))))
        )
        (pin bidirectional line (at -15.24 -7.62 0) (length 2.54)
          (name "PB3" (effects (font (size 1.27 1.27))))
          (number "26" (effects (font (size 1.27 1.27))))
        )
        (pin bidirectional line (at -15.24 -10.16 0) (length 2.54)
          (name "PB4" (effects (font (size 1.27 1.27))))
          (number "27" (effects (font (size 1.27 1.27))))
        )
        (pin bidirectional line (at -15.24 -12.7 0) (length 2.54)
          (name "PB5" (effects (font (size 1.27 1.27))))
          (number "28" (effects (font (size 1.27 1.27))))
        )
        (pin bidirectional line (at -15.24 -15.24 0) (length 2.54)
          (name "PB6" (effects (font (size 1.27 1.27))))
          (number "29" (effects (font (size 1.27 1.27))))
        )
        (pin bidirectional line (at -15.24 5.08 0) (length 2.54)
          (name "PC15" (effects (font (size 1.27 1.27))))
          (number "3" (effects (font (size 1.27 1.27))))
        )
        (pin bidirectional line (at -15.24 -17.78 0) (length 2.54)
          (name "PB7" (effects (font (size 1.27 1.27))))
          (number "30" (effects (font (size 1.27 1.27))))
        )
        (pin input line (at -15.24 12.7 0) (length 2.54)
          (name "BOOT0" (effects (font (size 1.27 1.27))))
          (number "31" (effects (font (size 1.27 1.27))))
        )
        (pin bidirectional line (at -15.24 -20.32 0) (length 2.54)
          (name "PB8" (effects (font (size 1.27 1.27))))
          (number "32" (effects (font (size 1.27 1.27))))
        )
        (pin power_in line (at 0 -25.4 90) (length 2.54)
          (name "VSS" (effects (font (size 1.27 1.27))))
          (number "33" (effects (font (size 1.27 1.27))))
        )
        (pin input line (at -15.24 17.78 0) (length 2.54)
          (name "NRST" (effects (font (size 1.27 1.27))))
          (number "4" (effects (font (size 1.27 1.27))))
        )
        (pin power_in line (at 2.54 22.86 270) (length 2.54)
          (name "VDDA" (effects (font (size 1.27 1.27))))
          (number "5" (effects (font (size 1.27 1.27))))
        )
        (pin bidirectional line (at 12.7 17.78 180) (length 2.54)
          (name "PA0" (effects (font (size 1.27 1.27))))
          (number "6" (effects (font (size 1.27 1.27))))
        )
        (pin bidirectional line (at 12.7 15.24 180) (length 2.54)
          (name "PA1" (effects (font (size 1.27 1.27))))
          (number "7" (effects (font (size 1.27 1.27))))
        )
        (pin bidirectional line (at 12.7 12.7 180) (length 2.54)
          (name "PA2" (effects (font (size 1.27 1.27))))
          (number "8" (effects (font (size 1.27 1.27))))
        )
        (pin bidirectional line (at 12.7 10.16 180) (length 2.54)
          (name "PA3" (effects (font (size 1.27 1.27))))
          (number "9" (effects (font (size 1.27 1.27))))
        )
      )
    )
    (symbol "Switch:SW_MEC_5E" (pin_names (offset 1.016) hide) (in_bom yes) (on_board yes)
      (property "Reference" "SW" (at 0.635 5.715 0)
        (effects (font (size 1.27 1.27)) (justify left))
      )
      (property "Value" "SW_MEC_5E" (at 0 -3.175 0)
        (effects (font (size 1.27 1.27)))
      )
      (property "Footprint" "" (at 0 7.62 0)
        (effects (font (size 1.27 1.27)) hide)
      )
      (property "Datasheet" "http://www.apem.com/int/index.php?controller=attachment&id_attachment=1371" (at 0 7.62 0)
        (effects (font (size 1.27 1.27)) hide)
      )
      (property "ki_keywords" "switch normally-open pushbutton push-button" (at 0 0 0)
        (effects (font (size 1.27 1.27)) hide)
      )
      (property "ki_description" "MEC 5E single pole normally-open tactile switch" (at 0 0 0)
        (effects (font (size 1.27 1.27)) hide)
      )
      (property "ki_fp_filters" "SW*MEC*5G*" (at 0 0 0)
        (effects (font (size 1.27 1.27)) hide)
      )
      (symbol "SW_MEC_5E_0_1"
        (circle (center -1.778 2.54) (radius 0.508)
          (stroke (width 0) (type default))
          (fill (type none))
        )
        (polyline
          (pts
            (xy -2.286 3.81)
            (xy 2.286 3.81)
          )
          (stroke (width 0) (type default))
          (fill (type none))
        )
        (polyline
          (pts
            (xy 0 3.81)
            (xy 0 5.588)
          )
          (stroke (width 0) (type default))
          (fill (type none))
        )
        (polyline
          (pts
            (xy -2.54 0)
            (xy -2.54 2.54)
            (xy -2.286 2.54)
          )
          (stroke (width 0) (type default))
          (fill (type none))
        )
        (polyline
          (pts
            (xy 2.54 0)
            (xy 2.54 2.54)
            (xy 2.286 2.54)
          )
          (stroke (width 0) (type default))
          (fill (type none))
        )
        (circle (center 1.778 2.54) (radius 0.508)
          (stroke (width 0) (type default))
          (fill (type none))
        )
        (pin passive line (at -5.08 2.54 0) (length 2.54)
          (name "1" (effects (font (size 1.27 1.27))))
          (number "1" (effects (font (size 1.27 1.27))))
        )
        (pin passive line (at -5.08 0 0) (length 2.54)
          (name "2" (effects (font (size 1.27 1.27))))
          (number "2" (effects (font (size 1.27 1.27))))
        )
        (pin passive line (at 5.08 0 180) (length 2.54)
          (name "K" (effects (font (size 1.27 1.27))))
          (number "3" (effects (font (size 1.27 1.27))))
        )
        (pin passive line (at 5.08 2.54 180) (length 2.54)
          (name "A" (effects (font (size 1.27 1.27))))
          (number "4" (effects (font (size 1.27 1.27))))
        )
      )
    )
    (symbol "power:GND" (power) (pin_names (offset 0)) (in_bom yes) (on_board yes)
      (property "Reference" "#PWR" (at 0 -6.35 0)
        (effects (font (size 1.27 1.27)) hide)
      )
      (property "Value" "GND" (at 0 -3.81 0)
        (effects (font (size 1.27 1.27)))
      )
      (property "Footprint" "" (at 0 0 0)
        (effects (font (size 1.27 1.27)) hide)
      )
      (property "Datasheet" "" (at 0 0 0)
        (effects (font (size 1.27 1.27)) hide)
      )
      (property "ki_keywords" "power-flag" (at 0 0 0)
        (effects (font (size 1.27 1.27)) hide)
      )
      (property "ki_description" "Power symbol creates a global label with name \"GND\" , ground" (at 0 0 0)
        (effects (font (size 1.27 1.27)) hide)
      )
      (symbol "GND_0_1"
        (polyline
          (pts
            (xy 0 0)
            (xy 0 -1.27)
            (xy 1.27 -1.27)
            (xy 0 -2.54)
            (xy -1.27 -1.27)
            (xy 0 -1.27)
          )
          (stroke (width 0) (type default))
          (fill (type none))
        )
      )
      (symbol "GND_1_1"
        (pin power_in line (at 0 0 270) (length 0) hide
          (name "GND" (effects (font (size 1.27 1.27))))
          (number "1" (effects (font (size 1.27 1.27))))
        )
      )
    )
  )

  (junction (at 58.42 46.99) (diameter 0) (color 0 0 0 0)
    (uuid 0e4c46d3-f146-4e8d-bea8-a2fe0824afa5)
  )
  (junction (at 81.28 46.99) (diameter 0) (color 0 0 0 0)
    (uuid 1c05bd26-ff0c-47de-8990-68f22c08c1b0)
  )
  (junction (at 90.17 46.99) (diameter 0) (color 0 0 0 0)
    (uuid 2528a007-b508-410a-ae46-6e1ef0f30101)
  )
  (junction (at 58.42 67.31) (diameter 0) (color 0 0 0 0)
    (uuid 2e9024a0-659c-4a7f-8b21-6753c9ff14e1)
  )
  (junction (at 39.37 67.31) (diameter 0) (color 0 0 0 0)
    (uuid 59019cee-9ece-43a8-b021-40426cbb9d7e)
  )
  (junction (at 69.85 46.99) (diameter 0) (color 0 0 0 0)
    (uuid 5bed2db0-95dc-4ee2-8730-fcd3d9e5c981)
  )
  (junction (at 52.07 72.39) (diameter 0) (color 0 0 0 0)
    (uuid 6c845cd7-93a3-421f-b94a-f0a3d49e2118)
  )
  (junction (at 52.07 67.31) (diameter 0) (color 0 0 0 0)
    (uuid 86410c08-85a0-475b-bc93-eb3847bcde73)
  )
  (junction (at 58.42 72.39) (diameter 0) (color 0 0 0 0)
    (uuid b0012fb1-a2a8-4a52-a7e0-583bd89b757f)
  )
  (junction (at 39.37 72.39) (diameter 0) (color 0 0 0 0)
    (uuid bf98897b-54c3-4a0f-ba3d-606d4ee6ac0d)
  )

  (no_connect (at 95.25 62.23) (uuid 31a86bef-90f5-47a9-9b95-49abf4ba4160))

  (wire (pts (xy 209.55 44.45) (xy 215.9 44.45))
    (stroke (width 0) (type default))
    (uuid 0073e97d-544a-4298-9e1b-c91abb09ddc8)
  )
  (wire (pts (xy 73.66 85.09) (xy 77.47 85.09))
    (stroke (width 0) (type default))
    (uuid 03ccc500-7031-44c9-863a-0cce8d8900a6)
  )
  (wire (pts (xy 50.8 67.31) (xy 52.07 67.31))
    (stroke (width 0) (type default))
    (uuid 04de5990-4348-4724-a47a-c0e59aa408b4)
  )
  (wire (pts (xy 105.41 77.47) (xy 111.76 77.47))
    (stroke (width 0) (type default))
    (uuid 05c73320-30e0-470c-af92-c723048b8e7b)
  )
  (wire (pts (xy 195.58 114.3) (xy 207.01 114.3))
    (stroke (width 0) (type default))
    (uuid 067ddb5a-0fe1-4162-959a-9f2b31c1ce25)
  )
  (wire (pts (xy 73.66 80.01) (xy 77.47 80.01))
    (stroke (width 0) (type default))
    (uuid 08e7633d-8bbe-4ee1-aeab-fe27466ad49c)
  )
  (wire (pts (xy 81.28 46.99) (xy 81.28 49.53))
    (stroke (width 0) (type default))
    (uuid 10d14cde-5cc7-4d04-9fc1-3c87982b22a2)
  )
  (wire (pts (xy 213.36 133.35) (xy 213.36 135.89))
    (stroke (width 0) (type default))
    (uuid 122cb1dc-0c36-430c-8ed0-13e05a9a3bc0)
  )
  (wire (pts (xy 105.41 67.31) (xy 118.11 67.31))
    (stroke (width 0) (type default))
    (uuid 1783c6ca-71bd-443d-96fd-823f64fcb87f)
  )
  (wire (pts (xy 105.41 85.09) (xy 111.76 85.09))
    (stroke (width 0) (type default))
    (uuid 1beca797-2dda-4b9f-bf45-c1d61cb7fb1a)
  )
  (wire (pts (xy 105.41 95.25) (xy 111.76 95.25))
    (stroke (width 0) (type default))
    (uuid 220b232a-cb58-412f-b3ff-0b388e853bfe)
  )
  (polyline (pts (xy 176.53 13.97) (xy 283.21 13.97))
    (stroke (width 0.5) (type default))
    (uuid 236e398a-cf1d-432f-8c38-ed90d82b0819)
  )

  (wire (pts (xy 195.58 148.59) (xy 205.74 148.59))
    (stroke (width 0) (type default))
    (uuid 23f6efb7-5821-4fb4-beed-de6a9496e3e0)
  )
  (wire (pts (xy 236.22 114.3) (xy 247.65 114.3))
    (stroke (width 0) (type default))
    (uuid 263ea703-f7f6-41b4-b152-377093677d19)
  )
  (wire (pts (xy 269.24 39.37) (xy 262.89 39.37))
    (stroke (width 0) (type default))
    (uuid 26ca0dcc-cc21-4d2f-873c-f0100d0fe3cb)
  )
  (wire (pts (xy 213.36 59.69) (xy 213.36 62.23))
    (stroke (width 0) (type default))
    (uuid 2806be2d-f2a8-42ed-bc80-3d0d995308c1)
  )
  (wire (pts (xy 105.41 80.01) (xy 118.11 80.01))
    (stroke (width 0) (type default))
    (uuid 28dee4ea-6e94-4fcf-a2cc-666a15dec77c)
  )
  (wire (pts (xy 58.42 46.99) (xy 69.85 46.99))
    (stroke (width 0) (type default))
    (uuid 2d2c2bd4-d948-465d-bce4-2646935e439a)
  )
  (wire (pts (xy 81.28 46.99) (xy 90.17 46.99))
    (stroke (width 0) (type default))
    (uuid 328b991e-7db7-4d7a-a132-531c9ce6d077)
  )
  (polyline (pts (xy 283.21 13.97) (xy 283.21 163.83))
    (stroke (width 0.5) (type default))
    (uuid 32f43a01-9cd0-4bdc-884f-dc1981bffa55)
  )
  (polyline (pts (xy 173.99 194.31) (xy 13.97 194.31))
    (stroke (width 0.5) (type default))
    (uuid 33310d76-3737-42f0-a38e-45b14928c7dd)
  )
  (polyline (pts (xy 13.97 13.97) (xy 13.97 194.31))
    (stroke (width 0.5) (type default))
    (uuid 33686bad-efbd-4426-a336-61335c6f6d56)
  )

  (wire (pts (xy 209.55 39.37) (xy 215.9 39.37))
    (stroke (width 0) (type default))
    (uuid 38a9c60b-f05f-4067-8dfe-6795cd962fcd)
  )
  (wire (pts (xy 209.55 34.29) (xy 215.9 34.29))
    (stroke (width 0) (type default))
    (uuid 3b70d9b5-4de7-47a2-ace1-6565d044889b)
  )
  (wire (pts (xy 105.41 102.87) (xy 111.76 102.87))
    (stroke (width 0) (type default))
    (uuid 3bcea087-94ba-4cd6-9f43-b5f3d805cd5d)
  )
  (wire (pts (xy 73.66 87.63) (xy 77.47 87.63))
    (stroke (width 0) (type default))
    (uuid 3e02062d-0e99-43df-a6ad-792a40ab1dd3)
  )
  (wire (pts (xy 90.17 46.99) (xy 92.71 46.99))
    (stroke (width 0) (type default))
    (uuid 403abf1c-198c-416b-8c1b-3a6bc9352598)
  )
  (wire (pts (xy 254 143.51) (xy 254 144.78))
    (stroke (width 0) (type default))
    (uuid 428d284d-3d90-4f42-8a21-27b7a68f595b)
  )
  (polyline (pts (xy 176.53 163.83) (xy 176.53 13.97))
    (stroke (width 0.5) (type default))
    (uuid 45785f3f-9712-4347-ab3d-c91cefda0e97)
  )

  (wire (pts (xy 50.8 46.99) (xy 58.42 46.99))
    (stroke (width 0) (type default))
    (uuid 4821f44c-c735-4b38-965b-0190e75b775f)
  )
  (wire (pts (xy 73.66 105.41) (xy 77.47 105.41))
    (stroke (width 0) (type default))
    (uuid 4939ab81-2346-4ac9-97b3-b15e7a35993d)
  )
  (wire (pts (xy 105.41 74.93) (xy 118.11 74.93))
    (stroke (width 0) (type default))
    (uuid 4ec91840-2612-45ab-b9cc-bd8d74bd2221)
  )
  (wire (pts (xy 246.38 39.37) (xy 252.73 39.37))
    (stroke (width 0) (type default))
    (uuid 53d26761-3f01-4d8f-9259-a7d33d47af87)
  )
  (wire (pts (xy 58.42 72.39) (xy 58.42 77.47))
    (stroke (width 0) (type default))
    (uuid 54bf6f6b-dff0-4e89-bd8c-9a94da6de421)
  )
  (wire (pts (xy 52.07 67.31) (xy 58.42 67.31))
    (stroke (width 0) (type default))
    (uuid 55539843-6279-4139-a728-fa53d2daeaf0)
  )
  (wire (pts (xy 255.27 71.12) (xy 255.27 72.39))
    (stroke (width 0) (type default))
    (uuid 563946b2-f035-4ec8-a58e-06fec2c52099)
  )
  (wire (pts (xy 105.41 82.55) (xy 118.11 82.55))
    (stroke (width 0) (type default))
    (uuid 570ee7db-9d3a-49fb-bcf5-aeb20970491c)
  )
  (wire (pts (xy 213.36 69.85) (xy 213.36 72.39))
    (stroke (width 0) (type default))
    (uuid 57fdbd9a-5652-45d5-9b4f-3be08a332b0f)
  )
  (wire (pts (xy 105.41 72.39) (xy 118.11 72.39))
    (stroke (width 0) (type default))
    (uuid 5c6d6505-5753-4254-bcaa-ac7ba402b03e)
  )
  (wire (pts (xy 36.83 67.31) (xy 39.37 67.31))
    (stroke (width 0) (type default))
    (uuid 5d716d5a-efd6-4350-ab33-8fc588c829f6)
  )
  (wire (pts (xy 69.85 46.99) (xy 81.28 46.99))
    (stroke (width 0) (type default))
    (uuid 5eaebc3b-5240-4afa-97f7-0c75716757f6)
  )
  (wire (pts (xy 105.41 92.71) (xy 111.76 92.71))
    (stroke (width 0) (type default))
    (uuid 63e634de-30cf-42ac-9a3d-93b04b5992d7)
  )
  (wire (pts (xy 58.42 87.63) (xy 58.42 85.09))
    (stroke (width 0) (type default))
    (uuid 70892d0d-570c-4bfd-b929-5911df3ddc96)
  )
  (wire (pts (xy 50.8 74.93) (xy 52.07 74.93))
    (stroke (width 0) (type default))
    (uuid 7111bcd0-2d6d-4624-8371-41e191dbed6d)
  )
  (wire (pts (xy 73.66 92.71) (xy 77.47 92.71))
    (stroke (width 0) (type default))
    (uuid 72dd209c-ff8d-4f87-ad9e-6c178a0df775)
  )
  (wire (pts (xy 246.38 34.29) (xy 252.73 34.29))
    (stroke (width 0) (type default))
    (uuid 789d1372-20cc-489a-86f8-a2444ad9a117)
  )
  (wire (pts (xy 105.41 97.79) (xy 111.76 97.79))
    (stroke (width 0) (type default))
    (uuid 7d8e7430-005d-4f4c-a0cd-16a6666324e7)
  )
  (wire (pts (xy 50.8 64.77) (xy 52.07 64.77))
    (stroke (width 0) (type default))
    (uuid 7d92c0fb-4b5c-4f71-b931-b4c47a9851eb)
  )
  (wire (pts (xy 39.37 72.39) (xy 39.37 74.93))
    (stroke (width 0) (type default))
    (uuid 7dcd1032-9993-4805-8941-c3b53499fe01)
  )
  (wire (pts (xy 105.41 69.85) (xy 118.11 69.85))
    (stroke (width 0) (type default))
    (uuid 7f172bfd-2170-4521-9f45-85e9a2021e1e)
  )
  (wire (pts (xy 39.37 64.77) (xy 39.37 67.31))
    (stroke (width 0) (type default))
    (uuid 80079b2a-62d2-438e-b1a1-b4280b0de34a)
  )
  (wire (pts (xy 255.27 60.96) (xy 255.27 63.5))
    (stroke (width 0) (type default))
    (uuid 800bb38c-bb1c-4de4-9779-24e787f98876)
  )
  (polyline (pts (xy 13.97 13.97) (xy 173.99 13.97))
    (stroke (width 0.5) (type default))
    (uuid 8090d13b-5dde-44ff-b3a2-b0e9f13ce34d)
  )

  (wire (pts (xy 58.42 46.99) (xy 58.42 55.88))
    (stroke (width 0) (type default))
    (uuid 8392b2cf-7904-4a33-a090-c6a4105aad67)
  )
  (wire (pts (xy 105.41 87.63) (xy 111.76 87.63))
    (stroke (width 0) (type default))
    (uuid 83e851fc-495e-4a28-821d-e36a728f4b4b)
  )
  (wire (pts (xy 236.22 77.47) (xy 247.65 77.47))
    (stroke (width 0) (type default))
    (uuid 862f81c3-96bf-4a94-b3d5-08ec505625c0)
  )
  (wire (pts (xy 214.63 97.79) (xy 214.63 100.33))
    (stroke (width 0) (type default))
    (uuid 88962a16-af60-4190-a94b-8dd4739c8ceb)
  )
  (wire (pts (xy 73.66 97.79) (xy 77.47 97.79))
    (stroke (width 0) (type default))
    (uuid 8c7c7deb-a6b8-48ca-bb01-528e7ab11976)
  )
  (wire (pts (xy 105.41 105.41) (xy 111.76 105.41))
    (stroke (width 0) (type default))
    (uuid 8ece3236-8872-495b-ac8e-625ac187340a)
  )
  (wire (pts (xy 226.06 39.37) (xy 232.41 39.37))
    (stroke (width 0) (type default))
    (uuid 8f064759-3ccc-41f6-a37a-f6e26b0079d5)
  )
  (wire (pts (xy 105.41 100.33) (xy 111.76 100.33))
    (stroke (width 0) (type default))
    (uuid 93c3dd6d-6f73-4042-a984-68063a5e9876)
  )
  (polyline (pts (xy 283.21 163.83) (xy 176.53 163.83))
    (stroke (width 0.5) (type default))
    (uuid 940e9797-100e-4257-86be-47d5351e01e3)
  )

  (wire (pts (xy 58.42 67.31) (xy 77.47 67.31))
    (stroke (width 0) (type default))
    (uuid 9bd39e1f-b43c-4968-a991-3fa1c562de1c)
  )
  (wire (pts (xy 50.8 72.39) (xy 52.07 72.39))
    (stroke (width 0) (type default))
    (uuid 9c6a45ce-21ac-4ad5-a527-f4f90c2e7dc4)
  )
  (wire (pts (xy 255.27 97.79) (xy 255.27 100.33))
    (stroke (width 0) (type default))
    (uuid 9cf628df-a577-4fd0-b976-f917329d98cc)
  )
  (wire (pts (xy 73.66 90.17) (xy 77.47 90.17))
    (stroke (width 0) (type default))
    (uuid 9e4eb1d9-8e2d-461c-902c-6811f8b95c15)
  )
  (wire (pts (xy 69.85 46.99) (xy 69.85 49.53))
    (stroke (width 0) (type default))
    (uuid a048997f-4063-41bb-96e7-ba5cc1fb0bd8)
  )
  (polyline (pts (xy 173.99 13.97) (xy 173.99 194.31))
    (stroke (width 0.5) (type default))
    (uuid a5048a6f-e39b-4a19-9d78-c6617a517b5d)
  )

  (wire (pts (xy 36.83 72.39) (xy 39.37 72.39))
    (stroke (width 0) (type default))
    (uuid a84734df-b7a5-4464-b565-85f1a30316e8)
  )
  (wire (pts (xy 105.41 90.17) (xy 111.76 90.17))
    (stroke (width 0) (type default))
    (uuid a9770027-1027-440e-bcb5-c8ebf84dd990)
  )
  (wire (pts (xy 255.27 107.95) (xy 255.27 109.22))
    (stroke (width 0) (type default))
    (uuid ac8369b7-59c2-43e7-a60c-eb707c2b41f0)
  )
  (wire (pts (xy 40.64 74.93) (xy 39.37 74.93))
    (stroke (width 0) (type default))
    (uuid b5e23bb3-440f-49bb-a4cd-896d06fea044)
  )
  (wire (pts (xy 92.71 46.99) (xy 92.71 62.23))
    (stroke (width 0) (type default))
    (uuid ba02a271-af75-433d-a098-b0c370d9870a)
  )
  (wire (pts (xy 73.66 77.47) (xy 77.47 77.47))
    (stroke (width 0) (type default))
    (uuid bbce372c-d100-43ec-b7f1-b00f76b88d05)
  )
  (wire (pts (xy 52.07 72.39) (xy 58.42 72.39))
    (stroke (width 0) (type default))
    (uuid c26fcf70-0f05-433b-b373-5d196bd2281b)
  )
  (wire (pts (xy 73.66 100.33) (xy 77.47 100.33))
    (stroke (width 0) (type default))
    (uuid c48cce77-698d-411c-9531-b5a083ce1b4b)
  )
  (wire (pts (xy 194.31 77.47) (xy 205.74 77.47))
    (stroke (width 0) (type default))
    (uuid c82a5a19-0e7c-4753-8a2a-eefa2fc23640)
  )
  (wire (pts (xy 52.07 72.39) (xy 52.07 74.93))
    (stroke (width 0) (type default))
    (uuid d0489a15-0f0b-4761-8c83-5cff30a7ddac)
  )
  (wire (pts (xy 246.38 44.45) (xy 252.73 44.45))
    (stroke (width 0) (type default))
    (uuid d3f94930-867b-4046-9fa8-140690390964)
  )
  (wire (pts (xy 58.42 67.31) (xy 58.42 63.5))
    (stroke (width 0) (type default))
    (uuid d463e31f-b4c8-4683-88c5-a17a99583339)
  )
  (wire (pts (xy 73.66 102.87) (xy 77.47 102.87))
    (stroke (width 0) (type default))
    (uuid dcc24034-857d-4f52-9ac4-e61e54eeb0ea)
  )
  (wire (pts (xy 39.37 72.39) (xy 40.64 72.39))
    (stroke (width 0) (type default))
    (uuid de0dfac2-a7cb-4e7e-bebc-435b7a8f5d0a)
  )
  (wire (pts (xy 58.42 72.39) (xy 77.47 72.39))
    (stroke (width 0) (type default))
    (uuid e18f4143-ba0d-40ba-a203-444f84989bdb)
  )
  (wire (pts (xy 52.07 64.77) (xy 52.07 67.31))
    (stroke (width 0) (type default))
    (uuid e24f0893-3fcc-45d3-b69b-d58f9cc96200)
  )
  (wire (pts (xy 254 133.35) (xy 254 135.89))
    (stroke (width 0) (type default))
    (uuid e2685368-846d-4f8f-aaa8-48ffbb90e3dc)
  )
  (wire (pts (xy 90.17 62.23) (xy 90.17 46.99))
    (stroke (width 0) (type default))
    (uuid e40a1bdf-7237-4c3e-be77-19a4133c523f)
  )
  (wire (pts (xy 39.37 67.31) (xy 40.64 67.31))
    (stroke (width 0) (type default))
    (uuid e469982c-3823-4665-9e6d-e90b00c2da09)
  )
  (wire (pts (xy 236.22 149.86) (xy 246.38 149.86))
    (stroke (width 0) (type default))
    (uuid f3ca4269-5b4d-4dc1-8543-24af372da5b7)
  )
  (wire (pts (xy 73.66 95.25) (xy 77.47 95.25))
    (stroke (width 0) (type default))
    (uuid f3e09ba3-953c-4255-bc9b-4f71ce3d8419)
  )
  (wire (pts (xy 40.64 64.77) (xy 39.37 64.77))
    (stroke (width 0) (type default))
    (uuid fa9cc8c7-3e93-4311-b649-f6178acedf0c)
  )
  (wire (pts (xy 214.63 107.95) (xy 214.63 109.22))
    (stroke (width 0) (type default))
    (uuid faa671dc-5976-4eb3-b7bc-47cfb149a1c5)
  )

  (text "LED Control" (at 179.07 20.32 0)
    (effects (font (size 2.5 2.5) (thickness 0.5) bold) (justify left bottom))
    (uuid 0832931f-47e8-4407-85fb-4e1f029de758)
  )
  (text "Red:2.4V\nGreen:3.2V\nBlue:3.2V" (at 180.34 31.75 0)
    (effects (font (size 1.27 1.27)) (justify left bottom))
    (uuid 3e366725-54d2-4fe6-be86-e76e4c97caa8)
  )
  (text "Forward Voltage (Vf)" (at 180.34 25.4 0)
    (effects (font (size 1.27 1.27) (thickness 0.254) bold) (justify left bottom))
    (uuid 4af359b5-c95e-4ff8-a8d4-58cdae08c792)
  )
  (text "Enter Bootloader\npull BOOT0 high" (at 38.1 91.44 0)
    (effects (font (size 1.27 1.27) bold) (justify left bottom))
    (uuid d1911616-0b8d-45d2-aa49-b83287a49741)
  )
  (text "STM32" (at 16.51 20.32 0)
    (effects (font (size 2.5 2.5) (thickness 0.5) bold) (justify left bottom))
    (uuid fdef1ad3-22f1-4256-ad5b-45074e55643e)
  )

  (label "GRN1" (at 209.55 39.37 0) (fields_autoplaced)
    (effects (font (size 1.27 1.27)) (justify left bottom))
    (uuid 021d1f31-56da-4d72-93a7-7db8c75eff93)
  )
  (label "RED2_GPIO" (at 236.22 77.47 0) (fields_autoplaced)
    (effects (font (size 1.27 1.27)) (justify left bottom))
    (uuid 06676a84-7bc8-4e07-987d-eb11b20e5d79)
  )
  (label "RED1_GPIO" (at 118.11 69.85 0) (fields_autoplaced)
    (effects (font (size 1.27 1.27)) (justify left bottom))
    (uuid 15374f59-3549-4507-907b-c3f08cf86a73)
  )
  (label "RED2_GPIO" (at 118.11 82.55 0) (fields_autoplaced)
    (effects (font (size 1.27 1.27)) (justify left bottom))
    (uuid 1a66033c-03ec-4b53-bb32-db9f556e91c3)
  )
  (label "BLU1" (at 213.36 59.69 0) (fields_autoplaced)
    (effects (font (size 1.27 1.27)) (justify left bottom))
    (uuid 2608500a-32ee-495f-bac7-ded07471dc11)
  )
  (label "GRN1" (at 214.63 97.79 0) (fields_autoplaced)
    (effects (font (size 1.27 1.27)) (justify left bottom))
    (uuid 3025f3aa-b765-4960-af4f-071f1b7ce735)
  )
  (label "BLU1_GPIO" (at 118.11 74.93 0) (fields_autoplaced)
    (effects (font (size 1.27 1.27)) (justify left bottom))
    (uuid 3719db1d-f926-4cea-9aa5-36eeba9307d4)
  )
  (label "RED2" (at 246.38 34.29 0) (fields_autoplaced)
    (effects (font (size 1.27 1.27)) (justify left bottom))
    (uuid 4a5c6ed4-e757-4d91-8e2f-4a86d9c27b07)
  )
  (label "BLU2" (at 246.38 44.45 0) (fields_autoplaced)
    (effects (font (size 1.27 1.27)) (justify left bottom))
    (uuid 4db21626-a410-4d4c-9790-318866bb140a)
  )
  (label "GRN1_GPIO" (at 195.58 114.3 0) (fields_autoplaced)
    (effects (font (size 1.27 1.27)) (justify left bottom))
    (uuid 590c954d-2ed4-49b6-9dd9-0c0830b92322)
  )
  (label "GRN2" (at 246.38 39.37 0) (fields_autoplaced)
    (effects (font (size 1.27 1.27)) (justify left bottom))
    (uuid 643217fe-f6ce-4d88-a231-f91bf13fe3a3)
  )
  (label "BLU1_GPIO" (at 194.31 77.47 0) (fields_autoplaced)
    (effects (font (size 1.27 1.27)) (justify left bottom))
    (uuid 6774c334-aad5-497c-9de8-aec75ba14a9c)
  )
  (label "VLED" (at 269.24 39.37 0) (fields_autoplaced)
    (effects (font (size 1.27 1.27)) (justify left bottom))
    (uuid 8bbf1573-7b01-4402-a16a-6377b6f91604)
  )
  (label "RED1" (at 213.36 133.35 0) (fields_autoplaced)
    (effects (font (size 1.27 1.27)) (justify left bottom))
    (uuid 9191e3da-0c4f-493c-8836-8dbd83bf2d2b)
  )
  (label "GRN1_GPIO" (at 118.11 67.31 0) (fields_autoplaced)
    (effects (font (size 1.27 1.27)) (justify left bottom))
    (uuid 96d001b8-6374-4f54-864e-f3708ac39208)
  )
  (label "RED2" (at 255.27 60.96 0) (fields_autoplaced)
    (effects (font (size 1.27 1.27)) (justify left bottom))
    (uuid 976654a6-ec4f-4ff3-8a90-e8ce4dd9d664)
  )
  (label "BLU1" (at 209.55 44.45 0) (fields_autoplaced)
    (effects (font (size 1.27 1.27)) (justify left bottom))
    (uuid 9993fbf3-54c8-4119-bf87-3f9e750993f6)
  )
  (label "RED1" (at 209.55 34.29 0) (fields_autoplaced)
    (effects (font (size 1.27 1.27)) (justify left bottom))
    (uuid 9abcc418-52da-48f6-a639-77f06e453f12)
  )
  (label "RED1_GPIO" (at 195.58 148.59 0) (fields_autoplaced)
    (effects (font (size 1.27 1.27)) (justify left bottom))
    (uuid 9d63a803-96fe-4fb1-8bb9-bdecc2ac11af)
  )
  (label "GRN2_GPIO" (at 236.22 114.3 0) (fields_autoplaced)
    (effects (font (size 1.27 1.27)) (justify left bottom))
    (uuid a3eb128c-4b37-44f9-8958-b19afb830993)
  )
  (label "VLED" (at 226.06 39.37 0) (fields_autoplaced)
    (effects (font (size 1.27 1.27)) (justify left bottom))
    (uuid b9c73f6d-5466-45c8-b28b-a8212a9bfc22)
  )
  (label "GRN2" (at 255.27 97.79 0) (fields_autoplaced)
    (effects (font (size 1.27 1.27)) (justify left bottom))
    (uuid bb8f4bf4-05ff-40ec-b223-309150817ae7)
  )
  (label "BLU2_GPIO" (at 118.11 80.01 0) (fields_autoplaced)
    (effects (font (size 1.27 1.27)) (justify left bottom))
    (uuid cc56e181-1f9f-496c-856c-a4acb77c4e63)
  )
  (label "GRN2_GPIO" (at 118.11 72.39 0) (fields_autoplaced)
    (effects (font (size 1.27 1.27)) (justify left bottom))
    (uuid cf29a2c4-8816-4664-b035-ed2cc438179c)
  )
  (label "VIN_1V8" (at 36.83 72.39 180) (fields_autoplaced)
    (effects (font (size 1.27 1.27) bold) (justify right bottom))
    (uuid db499f90-e26f-4913-b483-75edd0e4fa60)
  )
  (label "BLU2" (at 254 133.35 0) (fields_autoplaced)
    (effects (font (size 1.27 1.27)) (justify left bottom))
    (uuid f63ed422-4d67-4d79-a72e-d61b816eeacc)
  )
  (label "BLU2_GPIO" (at 236.22 149.86 0) (fields_autoplaced)
    (effects (font (size 1.27 1.27)) (justify left bottom))
    (uuid fd0bb21c-82bd-43f2-b964-83bf26aa3d78)
  )

  (hierarchical_label "PB7" (shape bidirectional) (at 73.66 102.87 180) (fields_autoplaced)
    (effects (font (size 1.27 1.27)) (justify right))
    (uuid 006a1f14-af3f-4246-b8d0-045ff1b0617a)
  )
  (hierarchical_label "PB1" (shape bidirectional) (at 73.66 87.63 180) (fields_autoplaced)
    (effects (font (size 1.27 1.27)) (justify right))
    (uuid 03b96f70-570d-4975-a780-004e3a62ff5f)
  )
  (hierarchical_label "PB6" (shape bidirectional) (at 73.66 100.33 180) (fields_autoplaced)
    (effects (font (size 1.27 1.27)) (justify right))
    (uuid 05d6584e-2963-4312-87cf-c613097db6f6)
  )
  (hierarchical_label "PB0" (shape bidirectional) (at 73.66 85.09 180) (fields_autoplaced)
    (effects (font (size 1.27 1.27)) (justify right))
    (uuid 0835f823-00db-4166-a6d6-91b7ebf54efa)
  )
  (hierarchical_label "PA14" (shape bidirectional) (at 111.76 102.87 0) (fields_autoplaced)
    (effects (font (size 1.27 1.27)) (justify left))
    (uuid 106dd523-fd41-4141-a904-ffe5f3b78fcc)
  )
  (hierarchical_label "PB5" (shape bidirectional) (at 73.66 97.79 180) (fields_autoplaced)
    (effects (font (size 1.27 1.27)) (justify right))
    (uuid 1894e018-6746-4466-b9b7-a8a6c001058f)
  )
  (hierarchical_label "PA13" (shape bidirectional) (at 111.76 100.33 0) (fields_autoplaced)
    (effects (font (size 1.27 1.27)) (justify left))
    (uuid 2bd288ff-f30c-4353-8863-ba974c3542c3)
  )
  (hierarchical_label "UART2_TX" (shape output) (at 111.76 90.17 0) (fields_autoplaced)
    (effects (font (size 1.27 1.27)) (justify left))
    (uuid 33d03c1f-971f-4900-a600-e80a7e46f29f)
  )
  (hierarchical_label "PA15" (shape bidirectional) (at 111.76 105.41 0) (fields_autoplaced)
    (effects (font (size 1.27 1.27)) (justify left))
    (uuid 4c170333-f1e5-4c19-be13-250f9e4c3287)
  )
  (hierarchical_label "PA12" (shape bidirectional) (at 111.76 97.79 0) (fields_autoplaced)
    (effects (font (size 1.27 1.27)) (justify left))
    (uuid 5efb097f-564c-452f-a6c7-ece4fbea28c1)
  )
  (hierarchical_label "VIN_1V8" (shape input) (at 50.8 46.99 180) (fields_autoplaced)
    (effects (font (size 1.27 1.27)) (justify right))
    (uuid 6259fcf3-efff-435c-a1f1-a4f98e41cafb)
  )
  (hierarchical_label "PA8" (shape bidirectional) (at 111.76 87.63 0) (fields_autoplaced)
    (effects (font (size 1.27 1.27)) (justify left))
    (uuid 65cdf931-76c5-4403-b157-91922adda227)
  )
  (hierarchical_label "PB3" (shape input) (at 73.66 92.71 180) (fields_autoplaced)
    (effects (font (size 1.27 1.27)) (justify right))
    (uuid 721127b1-58bd-4af3-8b41-e167bb0a09fc)
  )
  (hierarchical_label "PC15" (shape bidirectional) (at 73.66 80.01 180) (fields_autoplaced)
    (effects (font (size 1.27 1.27)) (justify right))
    (uuid 760b300f-a638-4df8-9ea0-4392b8434725)
  )
  (hierarchical_label "PA11" (shape bidirectional) (at 111.76 95.25 0) (fields_autoplaced)
    (effects (font (size 1.27 1.27)) (justify left))
    (uuid 7def9c9f-5baa-4b69-9212-8d16f1521c89)
  )
  (hierarchical_label "PA7" (shape bidirectional) (at 111.76 85.09 0) (fields_autoplaced)
    (effects (font (size 1.27 1.27)) (justify left))
    (uuid a93f9758-8c0c-49a3-b322-570e39d2b58e)
  )
  (hierarchical_label "PA4" (shape bidirectional) (at 111.76 77.47 0) (fields_autoplaced)
    (effects (font (size 1.27 1.27)) (justify left))
    (uuid af6d5c8a-2716-4053-9b75-7013dbe5b5ce)
  )
  (hierarchical_label "PB2" (shape bidirectional) (at 73.66 90.17 180) (fields_autoplaced)
    (effects (font (size 1.27 1.27)) (justify right))
    (uuid c55e6d15-d290-4e61-a0c0-9af7844d7e6d)
  )
  (hierarchical_label "VLED" (shape input) (at 232.41 39.37 0) (fields_autoplaced)
    (effects (font (size 1.27 1.27)) (justify left))
    (uuid cb96de0c-3f72-416a-8fb3-0538d8d245ed)
  )
  (hierarchical_label "PB8" (shape bidirectional) (at 73.66 105.41 180) (fields_autoplaced)
    (effects (font (size 1.27 1.27)) (justify right))
    (uuid cc83b5ce-c6b8-49dd-b437-fb590eee61c0)
  )
  (hierarchical_label "UART2_RX" (shape input) (at 111.76 92.71 0) (fields_autoplaced)
    (effects (font (size 1.27 1.27)) (justify left))
    (uuid d7e8171d-a0b7-4955-8d56-b599903c0fdd)
  )
  (hierarchical_label "PB4" (shape bidirectional) (at 73.66 95.25 180) (fields_autoplaced)
    (effects (font (size 1.27 1.27)) (justify right))
    (uuid ea7eeddb-7a0f-4ef7-96fd-344e3fefda73)
  )
  (hierarchical_label "PC14" (shape bidirectional) (at 73.66 77.47 180) (fields_autoplaced)
    (effects (font (size 1.27 1.27)) (justify right))
    (uuid f5ab13c8-c083-4ea7-85ec-50350169f2f0)
  )

  (symbol (lib_id "Device:LED_RGBA") (at 257.81 39.37 0) (unit 1)
    (in_bom yes) (on_board yes) (dnp no) (fields_autoplaced)
    (uuid 04285b27-8920-4405-9b83-e049135c35f2)
    (property "Reference" "D2" (at 257.81 27.0215 0)
      (effects (font (size 1.27 1.27)))
    )
    (property "Value" "B3213GBR-05C0002Q3U1930" (at 257.81 29.7966 0)
      (effects (font (size 1.27 1.27)))
    )
    (property "Footprint" "fw_stm32_converter:Side View RGB Chip LED" (at 257.81 40.64 0)
      (effects (font (size 1.27 1.27)) hide)
    )
    (property "Datasheet" "~" (at 257.81 40.64 0)
      (effects (font (size 1.27 1.27)) hide)
    )
    (property "Part Number" "B3213GBR-05C0002Q3U1930" (at 257.81 39.37 0)
      (effects (font (size 1.27 1.27)) hide)
    )
    (pin "1" (uuid fff738db-a966-4fab-a716-2fb5e380f5db))
    (pin "2" (uuid 0235a4ca-d39c-4dce-892e-2876130ca6bd))
    (pin "3" (uuid 537f270a-64fc-4ab2-8abc-838ea28624b3))
    (pin "4" (uuid 2f171b33-0d2e-4fa3-b9ed-7e0f41681abe))
    (instances
      (project "fw_stm32_converter"
        (path "/181abe7a-f941-42b6-bd46-aaa3131f90fb/250d10a4-c605-4c73-9142-5e762996e6f5"
          (reference "D2") (unit 1)
        )
      )
    )
  )

  (symbol (lib_id "power:GND") (at 214.63 119.38 0) (unit 1)
    (in_bom yes) (on_board yes) (dnp no) (fields_autoplaced)
    (uuid 0437c291-3e2e-4395-8f63-90227360ebf5)
    (property "Reference" "#PWR031" (at 214.63 125.73 0)
      (effects (font (size 1.27 1.27)) hide)
    )
    (property "Value" "GND" (at 214.63 123.9425 0)
      (effects (font (size 1.27 1.27)))
    )
    (property "Footprint" "" (at 214.63 119.38 0)
      (effects (font (size 1.27 1.27)) hide)
    )
    (property "Datasheet" "" (at 214.63 119.38 0)
      (effects (font (size 1.27 1.27)) hide)
    )
    (pin "1" (uuid 13a6e756-c7b4-4595-8dd8-6ba00ca57101))
    (instances
      (project "fw_stm32_converter"
        (path "/181abe7a-f941-42b6-bd46-aaa3131f90fb/250d10a4-c605-4c73-9142-5e762996e6f5"
          (reference "#PWR031") (unit 1)
        )
      )
    )
  )

  (symbol (lib_id "power:GND") (at 213.36 153.67 0) (unit 1)
    (in_bom yes) (on_board yes) (dnp no) (fields_autoplaced)
    (uuid 09aeca31-a489-4de0-9d6d-63071a2d8b8c)
    (property "Reference" "#PWR034" (at 213.36 160.02 0)
      (effects (font (size 1.27 1.27)) hide)
    )
    (property "Value" "GND" (at 213.36 158.2325 0)
      (effects (font (size 1.27 1.27)))
    )
    (property "Footprint" "" (at 213.36 153.67 0)
      (effects (font (size 1.27 1.27)) hide)
    )
    (property "Datasheet" "" (at 213.36 153.67 0)
      (effects (font (size 1.27 1.27)) hide)
    )
    (pin "1" (uuid 6b0307a3-1dc0-4d58-8daf-711fbec40b0d))
    (instances
      (project "fw_stm32_converter"
        (path "/181abe7a-f941-42b6-bd46-aaa3131f90fb/250d10a4-c605-4c73-9142-5e762996e6f5"
          (reference "#PWR034") (unit 1)
        )
      )
    )
  )

  (symbol (lib_id "power:GND") (at 254 154.94 0) (unit 1)
    (in_bom yes) (on_board yes) (dnp no) (fields_autoplaced)
    (uuid 12a62459-bcc1-4204-a682-2c2484b060d2)
    (property "Reference" "#PWR035" (at 254 161.29 0)
      (effects (font (size 1.27 1.27)) hide)
    )
    (property "Value" "GND" (at 254 159.5025 0)
      (effects (font (size 1.27 1.27)))
    )
    (property "Footprint" "" (at 254 154.94 0)
      (effects (font (size 1.27 1.27)) hide)
    )
    (property "Datasheet" "" (at 254 154.94 0)
      (effects (font (size 1.27 1.27)) hide)
    )
    (pin "1" (uuid bf5882b4-1c6e-4f6f-b1bd-8f5b72521f8b))
    (instances
      (project "fw_stm32_converter"
        (path "/181abe7a-f941-42b6-bd46-aaa3131f90fb/250d10a4-c605-4c73-9142-5e762996e6f5"
          (reference "#PWR035") (unit 1)
        )
      )
    )
  )

  (symbol (lib_id "Device:Q_Dual_NMOS_S1G1D2S2G2D1") (at 212.09 114.3 0) (unit 2)
    (in_bom yes) (on_board yes) (dnp no) (fields_autoplaced)
    (uuid 13dc5d22-ffc4-4fd9-afe1-adf7a448bd01)
    (property "Reference" "Q1" (at 217.297 113.3915 0)
      (effects (font (size 1.27 1.27)) (justify left))
    )
    (property "Value" "DMN62D0UDW" (at 217.297 116.1666 0)
      (effects (font (size 1.27 1.27)) (justify left))
    )
    (property "Footprint" "Package_TO_SOT_SMD:SOT-363_SC-70-6" (at 217.17 114.3 0)
      (effects (font (size 1.27 1.27)) hide)
    )
    (property "Datasheet" "~" (at 217.17 114.3 0)
      (effects (font (size 1.27 1.27)) hide)
    )
    (property "Part Number" "DMN62D0UDW" (at 212.09 114.3 0)
      (effects (font (size 1.27 1.27)) hide)
    )
    (pin "1" (uuid 3017a235-166b-4dda-82e9-f5cc3d201902))
    (pin "2" (uuid 348a9e80-e16a-4177-a15a-60e4bd58ebdc))
    (pin "6" (uuid edc77a82-2475-47ca-ac92-1b75ebe57934))
    (pin "3" (uuid 2a0acab3-4470-4b79-bede-4d3b843b6c31))
    (pin "4" (uuid 9f4b7eaa-90af-4f4e-9450-ffd3f9612e72))
    (pin "5" (uuid d47555ed-e002-437d-ba2d-fc7b458be812))
    (instances
      (project "fw_stm32_converter"
        (path "/181abe7a-f941-42b6-bd46-aaa3131f90fb/250d10a4-c605-4c73-9142-5e762996e6f5"
          (reference "Q1") (unit 2)
        )
      )
    )
  )

  (symbol (lib_id "power:GND") (at 81.28 57.15 0) (unit 1)
    (in_bom yes) (on_board yes) (dnp no) (fields_autoplaced)
    (uuid 1dd79dea-e217-42fa-890b-af8ae656e627)
    (property "Reference" "#PWR0103" (at 81.28 63.5 0)
      (effects (font (size 1.27 1.27)) hide)
    )
    (property "Value" "GND" (at 81.28 61.7125 0)
      (effects (font (size 1.27 1.27)))
    )
    (property "Footprint" "" (at 81.28 57.15 0)
      (effects (font (size 1.27 1.27)) hide)
    )
    (property "Datasheet" "" (at 81.28 57.15 0)
      (effects (font (size 1.27 1.27)) hide)
    )
    (pin "1" (uuid e8a31efb-bced-4637-8b5a-1d2296ce291e))
    (instances
      (project "fw_stm32_converter"
        (path "/181abe7a-f941-42b6-bd46-aaa3131f90fb/250d10a4-c605-4c73-9142-5e762996e6f5"
          (reference "#PWR0103") (unit 1)
        )
      )
    )
  )

  (symbol (lib_id "power:GND") (at 36.83 67.31 270) (unit 1)
    (in_bom yes) (on_board yes) (dnp no)
    (uuid 26ee0310-fab4-4ced-b769-703cc809194b)
    (property "Reference" "#PWR0108" (at 30.48 67.31 0)
      (effects (font (size 1.27 1.27)) hide)
    )
    (property "Value" "GND" (at 29.21 67.31 90)
      (effects (font (size 1.27 1.27)) (justify left))
    )
    (property "Footprint" "" (at 36.83 67.31 0)
      (effects (font (size 1.27 1.27)) hide)
    )
    (property "Datasheet" "" (at 36.83 67.31 0)
      (effects (font (size 1.27 1.27)) hide)
    )
    (pin "1" (uuid 3fdf731d-de92-4994-a983-756a1a108838))
    (instances
      (project "fw_stm32_converter"
        (path "/181abe7a-f941-42b6-bd46-aaa3131f90fb/250d10a4-c605-4c73-9142-5e762996e6f5"
          (reference "#PWR0108") (unit 1)
        )
      )
    )
  )

  (symbol (lib_id "Switch:SW_MEC_5E") (at 45.72 72.39 0) (mirror x) (unit 1)
    (in_bom yes) (on_board yes) (dnp no)
    (uuid 2e933e55-bc28-4018-8964-d8b356b2a429)
    (property "Reference" "SW2" (at 45.72 80.01 0)
      (effects (font (size 1.27 1.27)))
    )
    (property "Value" "KMT022NGJLHS" (at 44.45 80.01 0)
      (effects (font (size 1.27 1.27)) hide)
    )
    (property "Footprint" "fw_stm32_converter:KMT0 - 3.0x2.6" (at 45.72 80.01 0)
      (effects (font (size 1.27 1.27)) hide)
    )
    (property "Datasheet" "http://www.apem.com/int/index.php?controller=attachment&id_attachment=1371" (at 45.72 80.01 0)
      (effects (font (size 1.27 1.27)) hide)
    )
    (property "Part Number" "KMT022NGJLHS" (at 45.72 72.39 0)
      (effects (font (size 1.27 1.27)) hide)
    )
    (pin "1" (uuid eb9837cb-bf6f-43da-bde8-757d59e9f57f))
    (pin "2" (uuid 7d9221cc-bef3-465f-b042-5fec8f114db9))
    (pin "3" (uuid 37151358-5d26-4223-aab7-bbe564f73269))
    (pin "4" (uuid b558f8c4-f5fe-4299-83c3-ba7b6d493a68))
    (instances
      (project "fw_stm32_converter"
        (path "/181abe7a-f941-42b6-bd46-aaa3131f90fb/250d10a4-c605-4c73-9142-5e762996e6f5"
          (reference "SW2") (unit 1)
        )
      )
    )
  )

  (symbol (lib_id "Device:R") (at 255.27 67.31 0) (unit 1)
    (in_bom yes) (on_board yes) (dnp no) (fields_autoplaced)
    (uuid 37522bc9-94d9-44ff-ac37-180ebd972e3d)
    (property "Reference" "R7" (at 257.048 66.4015 0)
      (effects (font (size 1.27 1.27)) (justify left))
    )
    (property "Value" "330R" (at 257.048 69.1766 0)
      (effects (font (size 1.27 1.27)) (justify left))
    )
    (property "Footprint" "Resistor_SMD:R_0603_1608Metric" (at 253.492 67.31 90)
      (effects (font (size 1.27 1.27)) hide)
    )
    (property "Datasheet" "~" (at 255.27 67.31 0)
      (effects (font (size 1.27 1.27)) hide)
    )
    (property "Part Number" "WR06X3300FTL" (at 255.27 67.31 0)
      (effects (font (size 1.27 1.27)) hide)
    )
    (pin "1" (uuid 8bb2704b-d268-4280-b83c-e5e79c7f94bc))
    (pin "2" (uuid 40ffaf49-9626-47b1-8f9c-77c6b7d07386))
    (instances
      (project "fw_stm32_converter"
        (path "/181abe7a-f941-42b6-bd46-aaa3131f90fb/250d10a4-c605-4c73-9142-5e762996e6f5"
          (reference "R7") (unit 1)
        )
      )
    )
  )

  (symbol (lib_id "Device:R") (at 213.36 139.7 0) (unit 1)
    (in_bom yes) (on_board yes) (dnp no) (fields_autoplaced)
    (uuid 426122d9-db42-4f9d-8bda-a7361e5c7f0e)
    (property "Reference" "R4" (at 215.138 138.7915 0)
      (effects (font (size 1.27 1.27)) (justify left))
    )
    (property "Value" "330R" (at 215.138 141.5666 0)
      (effects (font (size 1.27 1.27)) (justify left))
    )
    (property "Footprint" "Resistor_SMD:R_0603_1608Metric" (at 211.582 139.7 90)
      (effects (font (size 1.27 1.27)) hide)
    )
    (property "Datasheet" "~" (at 213.36 139.7 0)
      (effects (font (size 1.27 1.27)) hide)
    )
    (property "Part Number" "WR06X3300FTL" (at 213.36 139.7 0)
      (effects (font (size 1.27 1.27)) hide)
    )
    (pin "1" (uuid 4b8bd5e8-9ceb-49ce-87cb-26efa9816be3))
    (pin "2" (uuid 86578439-9cd6-4b98-9f2c-5dec329dc6fd))
    (instances
      (project "fw_stm32_converter"
        (path "/181abe7a-f941-42b6-bd46-aaa3131f90fb/250d10a4-c605-4c73-9142-5e762996e6f5"
          (reference "R4") (unit 1)
        )
      )
    )
  )

  (symbol (lib_id "power:GND") (at 213.36 82.55 0) (unit 1)
    (in_bom yes) (on_board yes) (dnp no) (fields_autoplaced)
    (uuid 43ce52c3-a2b9-4b23-a249-935429a5381c)
    (property "Reference" "#PWR030" (at 213.36 88.9 0)
      (effects (font (size 1.27 1.27)) hide)
    )
    (property "Value" "GND" (at 213.36 87.1125 0)
      (effects (font (size 1.27 1.27)))
    )
    (property "Footprint" "" (at 213.36 82.55 0)
      (effects (font (size 1.27 1.27)) hide)
    )
    (property "Datasheet" "" (at 213.36 82.55 0)
      (effects (font (size 1.27 1.27)) hide)
    )
    (pin "1" (uuid 3ff1f61f-827b-4145-843c-b9fa854e276c))
    (instances
      (project "fw_stm32_converter"
        (path "/181abe7a-f941-42b6-bd46-aaa3131f90fb/250d10a4-c605-4c73-9142-5e762996e6f5"
          (reference "#PWR030") (unit 1)
        )
      )
    )
  )

  (symbol (lib_id "Device:R") (at 214.63 104.14 0) (unit 1)
    (in_bom yes) (on_board yes) (dnp no) (fields_autoplaced)
    (uuid 46d00620-c4a4-436a-ade2-8c6766b94227)
    (property "Reference" "R5" (at 216.408 103.2315 0)
      (effects (font (size 1.27 1.27)) (justify left))
    )
    (property "Value" "330R" (at 216.408 106.0066 0)
      (effects (font (size 1.27 1.27)) (justify left))
    )
    (property "Footprint" "Resistor_SMD:R_0603_1608Metric" (at 212.852 104.14 90)
      (effects (font (size 1.27 1.27)) hide)
    )
    (property "Datasheet" "~" (at 214.63 104.14 0)
      (effects (font (size 1.27 1.27)) hide)
    )
    (property "Part Number" "WR06X3300FTL" (at 214.63 104.14 0)
      (effects (font (size 1.27 1.27)) hide)
    )
    (pin "1" (uuid 3174ec26-a68e-4b10-b139-f16435978fe6))
    (pin "2" (uuid 934702c6-5ed6-4642-8cac-638a82b7e472))
    (instances
      (project "fw_stm32_converter"
        (path "/181abe7a-f941-42b6-bd46-aaa3131f90fb/250d10a4-c605-4c73-9142-5e762996e6f5"
          (reference "R5") (unit 1)
        )
      )
    )
  )

  (symbol (lib_id "Device:Q_Dual_NMOS_S1G1D2S2G2D1") (at 252.73 114.3 0) (unit 2)
    (in_bom yes) (on_board yes) (dnp no) (fields_autoplaced)
    (uuid 48705e76-181b-4678-8fd6-eac2872ff8a8)
    (property "Reference" "Q2" (at 257.937 113.3915 0)
      (effects (font (size 1.27 1.27)) (justify left))
    )
    (property "Value" "DMN62D0UDW" (at 257.937 116.1666 0)
      (effects (font (size 1.27 1.27)) (justify left))
    )
    (property "Footprint" "Package_TO_SOT_SMD:SOT-363_SC-70-6" (at 257.81 114.3 0)
      (effects (font (size 1.27 1.27)) hide)
    )
    (property "Datasheet" "~" (at 257.81 114.3 0)
      (effects (font (size 1.27 1.27)) hide)
    )
    (property "Part Number" "DMN62D0UDW" (at 252.73 114.3 0)
      (effects (font (size 1.27 1.27)) hide)
    )
    (pin "1" (uuid 8e71fb30-01be-4502-abeb-396aa0a8bf37))
    (pin "2" (uuid 401cec71-ea43-407d-aea3-18d8002a6d23))
    (pin "6" (uuid e98c32f7-2761-471b-85d0-c97d488951fc))
    (pin "3" (uuid 4ebb77db-c921-4fd9-83ff-09adbfb754ee))
    (pin "4" (uuid f0180925-a088-4277-baf4-14d6bbdf35e5))
    (pin "5" (uuid f2b9271f-8a30-4c04-90e3-3a82eff7b6f2))
    (instances
      (project "fw_stm32_converter"
        (path "/181abe7a-f941-42b6-bd46-aaa3131f90fb/250d10a4-c605-4c73-9142-5e762996e6f5"
          (reference "Q2") (unit 2)
        )
      )
    )
  )

  (symbol (lib_id "Device:C") (at 69.85 53.34 0) (unit 1)
    (in_bom yes) (on_board yes) (dnp no) (fields_autoplaced)
    (uuid 51576ea9-9b23-4114-aa53-0a33734fd56e)
    (property "Reference" "C14" (at 72.771 52.4315 0)
      (effects (font (size 1.27 1.27)) (justify left))
    )
    (property "Value" "0.1uF" (at 72.771 55.2066 0)
      (effects (font (size 1.27 1.27)) (justify left))
    )
    (property "Footprint" "Capacitor_SMD:C_0603_1608Metric" (at 70.8152 57.15 0)
      (effects (font (size 1.27 1.27)) hide)
    )
    (property "Datasheet" "~" (at 69.85 53.34 0)
      (effects (font (size 1.27 1.27)) hide)
    )
    (property "Part Number" "06035C104J4Z2A" (at 69.85 53.34 0)
      (effects (font (size 1.27 1.27)) hide)
    )
    (pin "1" (uuid 0c1d6339-10f6-4eb7-a8d4-33523d1bacc5))
    (pin "2" (uuid 94ba49b3-b468-4209-b3a8-8a44d9994cbc))
    (instances
      (project "fw_stm32_converter"
        (path "/181abe7a-f941-42b6-bd46-aaa3131f90fb/250d10a4-c605-4c73-9142-5e762996e6f5"
          (reference "C14") (unit 1)
        )
      )
    )
  )

  (symbol (lib_id "Device:R") (at 255.27 104.14 0) (unit 1)
    (in_bom yes) (on_board yes) (dnp no) (fields_autoplaced)
    (uuid 5de5105f-80b9-4a75-883d-bf18f4583ee4)
    (property "Reference" "R6" (at 257.048 103.2315 0)
      (effects (font (size 1.27 1.27)) (justify left))
    )
    (property "Value" "330R" (at 257.048 106.0066 0)
      (effects (font (size 1.27 1.27)) (justify left))
    )
    (property "Footprint" "Resistor_SMD:R_0603_1608Metric" (at 253.492 104.14 90)
      (effects (font (size 1.27 1.27)) hide)
    )
    (property "Datasheet" "~" (at 255.27 104.14 0)
      (effects (font (size 1.27 1.27)) hide)
    )
    (property "Part Number" "WR06X3300FTL" (at 255.27 104.14 0)
      (effects (font (size 1.27 1.27)) hide)
    )
    (pin "1" (uuid 99945907-bcae-4a03-bab2-9c2aaec41244))
    (pin "2" (uuid 800b7db3-d7b9-4575-a5c3-d9d6fc323c8c))
    (instances
      (project "fw_stm32_converter"
        (path "/181abe7a-f941-42b6-bd46-aaa3131f90fb/250d10a4-c605-4c73-9142-5e762996e6f5"
          (reference "R6") (unit 1)
        )
      )
    )
  )

  (symbol (lib_id "Device:R") (at 254 139.7 0) (unit 1)
    (in_bom yes) (on_board yes) (dnp no) (fields_autoplaced)
    (uuid 71488b05-e9ab-473e-a5f4-a6714498e567)
    (property "Reference" "R9" (at 255.778 138.7915 0)
      (effects (font (size 1.27 1.27)) (justify left))
    )
    (property "Value" "330R" (at 255.778 141.5666 0)
      (effects (font (size 1.27 1.27)) (justify left))
    )
    (property "Footprint" "Resistor_SMD:R_0603_1608Metric" (at 252.222 139.7 90)
      (effects (font (size 1.27 1.27)) hide)
    )
    (property "Datasheet" "~" (at 254 139.7 0)
      (effects (font (size 1.27 1.27)) hide)
    )
    (property "Part Number" "WR06X3300FTL" (at 254 139.7 0)
      (effects (font (size 1.27 1.27)) hide)
    )
    (pin "1" (uuid fb8186ae-bd86-4268-be15-825f48b32e95))
    (pin "2" (uuid db1f377d-284d-475a-99e4-b978ca2aaa6e))
    (instances
      (project "fw_stm32_converter"
        (path "/181abe7a-f941-42b6-bd46-aaa3131f90fb/250d10a4-c605-4c73-9142-5e762996e6f5"
          (reference "R9") (unit 1)
        )
      )
    )
  )

  (symbol (lib_id "Device:Q_Dual_NMOS_S1G1D2S2G2D1") (at 210.82 148.59 0) (unit 1)
    (in_bom yes) (on_board yes) (dnp no) (fields_autoplaced)
    (uuid 7ec01f9d-028d-4367-9dd6-38cd09635216)
    (property "Reference" "Q1" (at 216.027 147.6815 0)
      (effects (font (size 1.27 1.27)) (justify left))
    )
    (property "Value" "DMN62D0UDW" (at 216.027 150.4566 0)
      (effects (font (size 1.27 1.27)) (justify left))
    )
    (property "Footprint" "Package_TO_SOT_SMD:SOT-363_SC-70-6" (at 215.9 148.59 0)
      (effects (font (size 1.27 1.27)) hide)
    )
    (property "Datasheet" "~" (at 215.9 148.59 0)
      (effects (font (size 1.27 1.27)) hide)
    )
    (property "Part Number" "DMN62D0UDW" (at 210.82 148.59 0)
      (effects (font (size 1.27 1.27)) hide)
    )
    (pin "1" (uuid 26e081b2-415a-42b8-adc2-e98018dba51c))
    (pin "2" (uuid 04e7a81a-b0c9-4f0a-998a-52e3ab3247d9))
    (pin "6" (uuid 0cc1d194-9cc5-458e-bb05-6216a13649d5))
    (pin "3" (uuid a8300bca-661e-44c3-ae80-cb2e9dda8cde))
    (pin "4" (uuid 2c3fadd5-9dd0-4f4e-ae70-b0cf62e4606a))
    (pin "5" (uuid 53bf428e-9306-4de1-9ad9-4703fac70aae))
    (instances
      (project "fw_stm32_converter"
        (path "/181abe7a-f941-42b6-bd46-aaa3131f90fb/250d10a4-c605-4c73-9142-5e762996e6f5"
          (reference "Q1") (unit 1)
        )
      )
    )
  )

  (symbol (lib_id "power:GND") (at 92.71 110.49 0) (unit 1)
    (in_bom yes) (on_board yes) (dnp no) (fields_autoplaced)
    (uuid 9b4a0c3b-d0be-436b-bbb2-a36fa6ea82c2)
    (property "Reference" "#PWR029" (at 92.71 116.84 0)
      (effects (font (size 1.27 1.27)) hide)
    )
    (property "Value" "GND" (at 92.71 115.0525 0)
      (effects (font (size 1.27 1.27)))
    )
    (property "Footprint" "" (at 92.71 110.49 0)
      (effects (font (size 1.27 1.27)) hide)
    )
    (property "Datasheet" "" (at 92.71 110.49 0)
      (effects (font (size 1.27 1.27)) hide)
    )
    (pin "1" (uuid 32eb7c87-7a6e-4960-a6fc-2127470b9a86))
    (instances
      (project "fw_stm32_converter"
        (path "/181abe7a-f941-42b6-bd46-aaa3131f90fb/250d10a4-c605-4c73-9142-5e762996e6f5"
          (reference "#PWR029") (unit 1)
        )
      )
    )
  )

  (symbol (lib_id "Device:R") (at 213.36 66.04 0) (unit 1)
    (in_bom yes) (on_board yes) (dnp no) (fields_autoplaced)
    (uuid 9f0bdc5e-1604-4093-b9f2-035b4b0df4bc)
    (property "Reference" "R8" (at 215.138 65.1315 0)
      (effects (font (size 1.27 1.27)) (justify left))
    )
    (property "Value" "330R" (at 215.138 67.9066 0)
      (effects (font (size 1.27 1.27)) (justify left))
    )
    (property "Footprint" "Resistor_SMD:R_0603_1608Metric" (at 211.582 66.04 90)
      (effects (font (size 1.27 1.27)) hide)
    )
    (property "Datasheet" "~" (at 213.36 66.04 0)
      (effects (font (size 1.27 1.27)) hide)
    )
    (property "Part Number" "WR06X3300FTL" (at 213.36 66.04 0)
      (effects (font (size 1.27 1.27)) hide)
    )
    (pin "1" (uuid 44e8ad34-5919-4f1e-9cd0-e2eefd380e2a))
    (pin "2" (uuid 0f6473db-5e61-49bd-b0b3-ebb78ae13a5a))
    (instances
      (project "fw_stm32_converter"
        (path "/181abe7a-f941-42b6-bd46-aaa3131f90fb/250d10a4-c605-4c73-9142-5e762996e6f5"
          (reference "R8") (unit 1)
        )
      )
    )
  )

  (symbol (lib_id "Device:C") (at 81.28 53.34 0) (unit 1)
    (in_bom yes) (on_board yes) (dnp no) (fields_autoplaced)
    (uuid 9f45b895-8800-4080-851b-ac34c5bddd56)
    (property "Reference" "C15" (at 84.201 52.4315 0)
      (effects (font (size 1.27 1.27)) (justify left))
    )
    (property "Value" "0.1uF" (at 84.201 55.2066 0)
      (effects (font (size 1.27 1.27)) (justify left))
    )
    (property "Footprint" "Capacitor_SMD:C_0603_1608Metric" (at 82.2452 57.15 0)
      (effects (font (size 1.27 1.27)) hide)
    )
    (property "Datasheet" "~" (at 81.28 53.34 0)
      (effects (font (size 1.27 1.27)) hide)
    )
    (property "Part Number" "06035C104J4Z2A" (at 81.28 53.34 0)
      (effects (font (size 1.27 1.27)) hide)
    )
    (pin "1" (uuid 88c31f82-8aa7-4e30-949c-86e074541be5))
    (pin "2" (uuid 529a3d93-c0c1-4bb8-9c6d-1d75cdc8098f))
    (instances
      (project "fw_stm32_converter"
        (path "/181abe7a-f941-42b6-bd46-aaa3131f90fb/250d10a4-c605-4c73-9142-5e762996e6f5"
          (reference "C15") (unit 1)
        )
      )
    )
  )

  (symbol (lib_id "Device:Q_Dual_NMOS_S1G1D2S2G2D1") (at 252.73 77.47 0) (unit 1)
    (in_bom yes) (on_board yes) (dnp no) (fields_autoplaced)
    (uuid a1602f56-da74-4280-8456-8b2ec0bdc83c)
    (property "Reference" "Q3" (at 257.937 76.5615 0)
      (effects (font (size 1.27 1.27)) (justify left))
    )
    (property "Value" "DMN62D0UDW" (at 257.937 79.3366 0)
      (effects (font (size 1.27 1.27)) (justify left))
    )
    (property "Footprint" "Package_TO_SOT_SMD:SOT-363_SC-70-6" (at 257.81 77.47 0)
      (effects (font (size 1.27 1.27)) hide)
    )
    (property "Datasheet" "~" (at 257.81 77.47 0)
      (effects (font (size 1.27 1.27)) hide)
    )
    (property "Part Number" "DMN62D0UDW" (at 252.73 77.47 0)
      (effects (font (size 1.27 1.27)) hide)
    )
    (pin "1" (uuid ca38d5a0-b088-43e1-acdd-b24964268d34))
    (pin "2" (uuid 3c5727f9-8f9a-406e-8dc0-1d315f59fdb0))
    (pin "6" (uuid 29b74961-d926-49c3-aad2-500ef1a1a712))
    (pin "3" (uuid cb423061-484c-4143-8f71-a761bc6bab7b))
    (pin "4" (uuid 574db467-2ef6-4298-ac86-ddbd2f229bec))
    (pin "5" (uuid 22a53551-aaa2-4b38-b9bb-2001b63e92d7))
    (instances
      (project "fw_stm32_converter"
        (path "/181abe7a-f941-42b6-bd46-aaa3131f90fb/250d10a4-c605-4c73-9142-5e762996e6f5"
          (reference "Q3") (unit 1)
        )
      )
    )
  )

  (symbol (lib_id "Device:R") (at 58.42 59.69 0) (unit 1)
    (in_bom yes) (on_board yes) (dnp no) (fields_autoplaced)
    (uuid a2dac6e1-89ee-46e0-a36b-cb0d8bd57518)
    (property "Reference" "R11" (at 60.198 58.7815 0)
      (effects (font (size 1.27 1.27)) (justify left))
    )
    (property "Value" "10K" (at 60.198 61.5566 0)
      (effects (font (size 1.27 1.27)) (justify left))
    )
    (property "Footprint" "Resistor_SMD:R_0603_1608Metric" (at 56.642 59.69 90)
      (effects (font (size 1.27 1.27)) hide)
    )
    (property "Datasheet" "~" (at 58.42 59.69 0)
      (effects (font (size 1.27 1.27)) hide)
    )
    (property "Part Number" "RNCP0603FTD10K0" (at 58.42 59.69 0)
      (effects (font (size 1.27 1.27)) hide)
    )
    (pin "1" (uuid 45ca3646-a373-4634-ad87-4fc4b30c58c3))
    (pin "2" (uuid 6a52e846-469b-4297-a3e4-a035370c9df1))
    (instances
      (project "fw_stm32_converter"
        (path "/181abe7a-f941-42b6-bd46-aaa3131f90fb/250d10a4-c605-4c73-9142-5e762996e6f5"
          (reference "R11") (unit 1)
        )
      )
    )
  )

  (symbol (lib_id "Device:Q_Dual_NMOS_S1G1D2S2G2D1") (at 210.82 77.47 0) (unit 1)
    (in_bom yes) (on_board yes) (dnp no) (fields_autoplaced)
    (uuid b02c2cf2-b048-494d-9f4d-3c76b30824a3)
    (property "Reference" "Q2" (at 216.027 76.5615 0)
      (effects (font (size 1.27 1.27)) (justify left))
    )
    (property "Value" "DMN62D0UDW" (at 216.027 79.3366 0)
      (effects (font (size 1.27 1.27)) (justify left))
    )
    (property "Footprint" "Package_TO_SOT_SMD:SOT-363_SC-70-6" (at 215.9 77.47 0)
      (effects (font (size 1.27 1.27)) hide)
    )
    (property "Datasheet" "~" (at 215.9 77.47 0)
      (effects (font (size 1.27 1.27)) hide)
    )
    (property "Part Number" "DMN62D0UDW" (at 210.82 77.47 0)
      (effects (font (size 1.27 1.27)) hide)
    )
    (pin "1" (uuid faccb06e-8b8b-40c0-828e-495955518a4b))
    (pin "2" (uuid 8e6f8dda-5a7f-4d91-a3c1-323a45e4d5d5))
    (pin "6" (uuid 29234af0-19ed-4faa-acab-c18f8ae646e5))
    (pin "3" (uuid eef6d7f3-facf-4de7-8909-6dbbab4d20d9))
    (pin "4" (uuid a93f1df6-e235-4d58-ad11-e8d5fe58a25d))
    (pin "5" (uuid a8ab93a5-f9a1-4ff8-9c86-95475f850832))
    (instances
      (project "fw_stm32_converter"
        (path "/181abe7a-f941-42b6-bd46-aaa3131f90fb/250d10a4-c605-4c73-9142-5e762996e6f5"
          (reference "Q2") (unit 1)
        )
      )
    )
  )

  (symbol (lib_id "Device:Q_Dual_NMOS_S1G1D2S2G2D1") (at 251.46 149.86 0) (unit 2)
    (in_bom yes) (on_board yes) (dnp no) (fields_autoplaced)
    (uuid bd78f741-5ca5-4d89-a79e-16e0302a3ed4)
    (property "Reference" "Q3" (at 256.667 148.9515 0)
      (effects (font (size 1.27 1.27)) (justify left))
    )
    (property "Value" "DMN62D0UDW" (at 256.667 151.7266 0)
      (effects (font (size 1.27 1.27)) (justify left))
    )
    (property "Footprint" "Package_TO_SOT_SMD:SOT-363_SC-70-6" (at 256.54 149.86 0)
      (effects (font (size 1.27 1.27)) hide)
    )
    (property "Datasheet" "~" (at 256.54 149.86 0)
      (effects (font (size 1.27 1.27)) hide)
    )
    (property "Part Number" "DMN62D0UDW" (at 251.46 149.86 0)
      (effects (font (size 1.27 1.27)) hide)
    )
    (pin "1" (uuid 12dc4f0f-3c8a-43a8-b8c5-01f1d4f9f00f))
    (pin "2" (uuid 416b032a-8cac-471b-8a65-2e2bd9e875e1))
    (pin "6" (uuid 528e53db-6c18-4ac3-a4cd-49383c05471f))
    (pin "3" (uuid ace38071-4859-4aae-866d-c02eea4a773a))
    (pin "4" (uuid f426024b-0ae3-4d4a-9d7c-39e3daad5be2))
    (pin "5" (uuid d7c74110-1fdc-467d-b453-22206d1abcdf))
    (instances
      (project "fw_stm32_converter"
        (path "/181abe7a-f941-42b6-bd46-aaa3131f90fb/250d10a4-c605-4c73-9142-5e762996e6f5"
          (reference "Q3") (unit 2)
        )
      )
    )
  )

  (symbol (lib_id "power:GND") (at 255.27 82.55 0) (unit 1)
    (in_bom yes) (on_board yes) (dnp no) (fields_autoplaced)
    (uuid c3737b00-808c-42e0-b6fd-927774211bfc)
    (property "Reference" "#PWR033" (at 255.27 88.9 0)
      (effects (font (size 1.27 1.27)) hide)
    )
    (property "Value" "GND" (at 255.27 87.1125 0)
      (effects (font (size 1.27 1.27)))
    )
    (property "Footprint" "" (at 255.27 82.55 0)
      (effects (font (size 1.27 1.27)) hide)
    )
    (property "Datasheet" "" (at 255.27 82.55 0)
      (effects (font (size 1.27 1.27)) hide)
    )
    (pin "1" (uuid 1e316357-21dc-4798-b8ba-c40e6f736528))
    (instances
      (project "fw_stm32_converter"
        (path "/181abe7a-f941-42b6-bd46-aaa3131f90fb/250d10a4-c605-4c73-9142-5e762996e6f5"
          (reference "#PWR033") (unit 1)
        )
      )
    )
  )

  (symbol (lib_id "MCU_ST_STM32L0:STM32L051K8Ux") (at 92.71 85.09 0) (unit 1)
    (in_bom yes) (on_board yes) (dnp no) (fields_autoplaced)
    (uuid c97040c3-0377-499f-b221-ae4c2a87c329)
    (property "Reference" "U4" (at 94.7294 110.0995 0)
      (effects (font (size 1.27 1.27)) (justify left))
    )
    (property "Value" "STM32L051K8Ux" (at 94.7294 112.8746 0)
      (effects (font (size 1.27 1.27)) (justify left))
    )
    (property "Footprint" "Package_DFN_QFN:QFN-32-1EP_5x5mm_P0.5mm_EP3.45x3.45mm" (at 80.01 107.95 0)
      (effects (font (size 1.27 1.27)) (justify right) hide)
    )
    (property "Datasheet" "http://www.st.com/st-web-ui/static/active/en/resource/technical/document/datasheet/DM00108219.pdf" (at 92.71 85.09 0)
      (effects (font (size 1.27 1.27)) hide)
    )
    (property "Part Number" "STM32L051K8Ux" (at 92.71 85.09 0)
      (effects (font (size 1.27 1.27)) hide)
    )
    (pin "1" (uuid a83dceec-c20c-48b1-8d57-bce8ba54591d))
    (pin "10" (uuid 68c66629-904e-42e1-936d-e2fe86c74979))
    (pin "11" (uuid 06773e8c-29f9-45e9-823c-28cef19ae6b5))
    (pin "12" (uuid 9a0998f8-551c-403b-98d2-397d66b2958d))
    (pin "13" (uuid c4f34353-7288-4505-b01e-2cd19ef080d0))
    (pin "14" (uuid 197ab3ae-90c1-4ef1-b4ba-6b6de43fdc32))
    (pin "15" (uuid 1e9d4ce1-5622-484e-ae5d-46ecf5117446))
    (pin "16" (uuid 2f09ded6-0d77-4674-a53d-4618f73e01be))
    (pin "17" (uuid 6849ef31-3653-4b7d-a278-c42baa0ea858))
    (pin "18" (uuid 5cc17334-ad82-4029-b645-c0dfb04b1fc2))
    (pin "19" (uuid 9fe025e1-d93b-432e-8c53-0efc34994fd0))
    (pin "2" (uuid 84dd0295-3030-476f-a9fa-921d2606e726))
    (pin "20" (uuid 9273dc13-480d-49d8-a536-07092cb1e8b1))
    (pin "21" (uuid a99a0f89-2446-45c8-8a22-b13e92d86492))
    (pin "22" (uuid be2c63b8-653f-4d78-9280-61bc6ca4a206))
    (pin "23" (uuid 62d10140-7ad4-4fc5-83a1-86638757f8a9))
    (pin "24" (uuid b509d80e-d9bd-4133-8fd0-da319e518b80))
    (pin "25" (uuid 39421734-266b-4aaa-a01d-a47a7be3b2ef))
    (pin "26" (uuid f1f46113-ad6d-41f4-884d-1a82ac0cb34c))
    (pin "27" (uuid 3b18fda7-8ea6-4bb1-9480-865d2c049511))
    (pin "28" (uuid 6ebc6c0f-606e-445f-bff6-8397b69fd6e3))
    (pin "29" (uuid 38932301-c1a2-40c3-8f86-d2f52fc33c2d))
    (pin "3" (uuid 9fade9d8-b120-4355-8450-9d1d5b1a0b23))
    (pin "30" (uuid 96df216b-6406-4389-8619-6e505f5e7199))
    (pin "31" (uuid 3efa5303-6c36-4130-ac64-6f14cc6e06b4))
    (pin "32" (uuid 04d8ade7-5860-430c-8e14-825d57a463f4))
    (pin "33" (uuid 51c61e2f-1d8d-48d6-89e3-79db5954795f))
    (pin "4" (uuid b0f236f6-a3c8-4077-ac15-cbde925c7712))
    (pin "5" (uuid be9c4a78-f518-4575-a858-aa742df04a4e))
    (pin "6" (uuid 9da178b5-734d-434b-b5f6-87a2adac35f5))
    (pin "7" (uuid 796c1df9-7a6d-4e27-a1d4-8bbd383b7e9c))
    (pin "8" (uuid c6d125a9-35cd-45fe-b658-4b7268b01f18))
    (pin "9" (uuid e52199a9-76db-41ca-9cb2-cff523aefcbc))
    (instances
      (project "fw_stm32_converter"
        (path "/181abe7a-f941-42b6-bd46-aaa3131f90fb/250d10a4-c605-4c73-9142-5e762996e6f5"
          (reference "U4") (unit 1)
        )
      )
    )
  )

  (symbol (lib_id "Switch:SW_MEC_5E") (at 45.72 67.31 0) (unit 1)
    (in_bom yes) (on_board yes) (dnp no)
    (uuid ddda1dca-ce37-4d7c-9e45-bce24c2810e2)
    (property "Reference" "SW1" (at 45.72 59.69 0)
      (effects (font (size 1.27 1.27)))
    )
    (property "Value" "KMT022NGJLHS" (at 45.72 60.6576 0)
      (effects (font (size 1.27 1.27)) hide)
    )
    (property "Footprint" "fw_stm32_converter:KMT0 - 3.0x2.6" (at 45.72 59.69 0)
      (effects (font (size 1.27 1.27)) hide)
    )
    (property "Datasheet" "http://www.apem.com/int/index.php?controller=attachment&id_attachment=1371" (at 45.72 59.69 0)
      (effects (font (size 1.27 1.27)) hide)
    )
    (property "Part Number" "KMT022NGJLHS" (at 45.72 67.31 0)
      (effects (font (size 1.27 1.27)) hide)
    )
    (pin "1" (uuid fb63cb42-a20b-43be-b9bd-c84f6b613764))
    (pin "2" (uuid 1090f6eb-b3a1-4ace-a576-8046eb29eeda))
    (pin "3" (uuid f77776c0-93a9-4cf1-a05c-cca9cf6088c4))
    (pin "4" (uuid 7b9d337a-e989-470b-9d9f-9d56f346e8b1))
    (instances
      (project "fw_stm32_converter"
        (path "/181abe7a-f941-42b6-bd46-aaa3131f90fb/250d10a4-c605-4c73-9142-5e762996e6f5"
          (reference "SW1") (unit 1)
        )
      )
    )
  )

  (symbol (lib_id "Device:LED_RGBA") (at 220.98 39.37 0) (unit 1)
    (in_bom yes) (on_board yes) (dnp no) (fields_autoplaced)
    (uuid de5138da-7d2f-445b-9dd9-8989f1ea8b27)
    (property "Reference" "D1" (at 220.98 27.0215 0)
      (effects (font (size 1.27 1.27)))
    )
    (property "Value" "B3213GBR-05C0002Q3U1930" (at 220.98 29.7966 0)
      (effects (font (size 1.27 1.27)))
    )
    (property "Footprint" "fw_stm32_converter:Side View RGB Chip LED" (at 220.98 40.64 0)
      (effects (font (size 1.27 1.27)) hide)
    )
    (property "Datasheet" "~" (at 220.98 40.64 0)
      (effects (font (size 1.27 1.27)) hide)
    )
    (property "Part Number" "B3213GBR-05C0002Q3U1930" (at 220.98 39.37 0)
      (effects (font (size 1.27 1.27)) hide)
    )
    (pin "1" (uuid 2ab62b51-f12b-4a7c-8a53-2cf0848a9bc9))
    (pin "2" (uuid 5e90b2a9-5875-4c59-972d-e1b247c80115))
    (pin "3" (uuid cf7a814a-b9b0-4c85-86ea-d12ede59df0a))
    (pin "4" (uuid 7dd7082d-fff5-4784-8340-c4cb4bb6d7db))
    (instances
      (project "fw_stm32_converter"
        (path "/181abe7a-f941-42b6-bd46-aaa3131f90fb/250d10a4-c605-4c73-9142-5e762996e6f5"
          (reference "D1") (unit 1)
        )
      )
    )
  )

  (symbol (lib_id "Device:R") (at 58.42 81.28 0) (unit 1)
    (in_bom yes) (on_board yes) (dnp no) (fields_autoplaced)
    (uuid f618953d-528b-4fd9-8fce-34d96b4f0fc8)
    (property "Reference" "R12" (at 60.198 80.3715 0)
      (effects (font (size 1.27 1.27)) (justify left))
    )
    (property "Value" "10K" (at 60.198 83.1466 0)
      (effects (font (size 1.27 1.27)) (justify left))
    )
    (property "Footprint" "Resistor_SMD:R_0603_1608Metric" (at 56.642 81.28 90)
      (effects (font (size 1.27 1.27)) hide)
    )
    (property "Datasheet" "~" (at 58.42 81.28 0)
      (effects (font (size 1.27 1.27)) hide)
    )
    (property "Part Number" "RNCP0603FTD10K0" (at 58.42 81.28 0)
      (effects (font (size 1.27 1.27)) hide)
    )
    (pin "1" (uuid e976f983-84ea-4dba-bf00-ed2c7471d708))
    (pin "2" (uuid dd7717f5-2ae9-4556-a677-b5ee99705e20))
    (instances
      (project "fw_stm32_converter"
        (path "/181abe7a-f941-42b6-bd46-aaa3131f90fb/250d10a4-c605-4c73-9142-5e762996e6f5"
          (reference "R12") (unit 1)
        )
      )
    )
  )

  (symbol (lib_id "power:GND") (at 69.85 57.15 0) (unit 1)
    (in_bom yes) (on_board yes) (dnp no) (fields_autoplaced)
    (uuid f8eb872d-6338-4e6d-b3ca-d17e57e3df54)
    (property "Reference" "#PWR0102" (at 69.85 63.5 0)
      (effects (font (size 1.27 1.27)) hide)
    )
    (property "Value" "GND" (at 69.85 61.7125 0)
      (effects (font (size 1.27 1.27)))
    )
    (property "Footprint" "" (at 69.85 57.15 0)
      (effects (font (size 1.27 1.27)) hide)
    )
    (property "Datasheet" "" (at 69.85 57.15 0)
      (effects (font (size 1.27 1.27)) hide)
    )
    (pin "1" (uuid a1b38ff7-b110-4b3f-8439-de47f3981a18))
    (instances
      (project "fw_stm32_converter"
        (path "/181abe7a-f941-42b6-bd46-aaa3131f90fb/250d10a4-c605-4c73-9142-5e762996e6f5"
          (reference "#PWR0102") (unit 1)
        )
      )
    )
  )

  (symbol (lib_id "power:GND") (at 58.42 87.63 0) (unit 1)
    (in_bom yes) (on_board yes) (dnp no) (fields_autoplaced)
    (uuid f9c23b92-bc55-4269-ae08-471254b18798)
    (property "Reference" "#PWR036" (at 58.42 93.98 0)
      (effects (font (size 1.27 1.27)) hide)
    )
    (property "Value" "GND" (at 58.42 92.1925 0)
      (effects (font (size 1.27 1.27)))
    )
    (property "Footprint" "" (at 58.42 87.63 0)
      (effects (font (size 1.27 1.27)) hide)
    )
    (property "Datasheet" "" (at 58.42 87.63 0)
      (effects (font (size 1.27 1.27)) hide)
    )
    (pin "1" (uuid 351f462d-86f8-42ad-baa8-4a48a3c71ba8))
    (instances
      (project "fw_stm32_converter"
        (path "/181abe7a-f941-42b6-bd46-aaa3131f90fb/250d10a4-c605-4c73-9142-5e762996e6f5"
          (reference "#PWR036") (unit 1)
        )
      )
    )
  )

  (symbol (lib_id "power:GND") (at 255.27 119.38 0) (unit 1)
    (in_bom yes) (on_board yes) (dnp no) (fields_autoplaced)
    (uuid fb2aa54f-1886-48b6-965f-fab5f7c18b6e)
    (property "Reference" "#PWR032" (at 255.27 125.73 0)
      (effects (font (size 1.27 1.27)) hide)
    )
    (property "Value" "GND" (at 255.27 123.9425 0)
      (effects (font (size 1.27 1.27)))
    )
    (property "Footprint" "" (at 255.27 119.38 0)
      (effects (font (size 1.27 1.27)) hide)
    )
    (property "Datasheet" "" (at 255.27 119.38 0)
      (effects (font (size 1.27 1.27)) hide)
    )
    (pin "1" (uuid 157b4f93-b74f-4f90-80ac-9e7916971a87))
    (instances
      (project "fw_stm32_converter"
        (path "/181abe7a-f941-42b6-bd46-aaa3131f90fb/250d10a4-c605-4c73-9142-5e762996e6f5"
          (reference "#PWR032") (unit 1)
        )
      )
    )
  )
)
