<svg width="1184" height="329" viewBox="0 0 1184 329" fill="none" xmlns="http://www.w3.org/2000/svg">
<circle cx="163.99" cy="164.794" r="158.737" stroke="#D6CBFF" stroke-width="10.5047"/>
<path fill-rule="evenodd" clip-rule="evenodd" d="M169.242 283.149C167.501 283.225 165.75 283.264 163.99 283.264C98.5612 283.264 45.5207 230.223 45.5207 164.794C45.5207 99.3655 98.5612 46.325 163.99 46.325C229.419 46.325 282.459 99.3655 282.459 164.794C282.459 221.198 243.042 268.395 190.251 280.343V291.093C248.889 278.963 292.964 227.026 292.964 164.794C292.964 93.564 235.22 35.8203 163.99 35.8203C92.7596 35.8203 35.016 93.564 35.016 164.794C35.016 236.025 92.7596 293.768 163.99 293.768C165.749 293.768 167.5 293.733 169.242 293.663V283.149Z" fill="#7B58E5"/>
<line x1="163.99" y1="293.769" x2="163.99" y2="214.351" stroke="#7B58E5" stroke-width="10.5047"/>
<path d="M163.698 100.016L163.698 136.218" stroke="#72777C" stroke-width="7.58671"/>
<circle cx="163.943" cy="91.215" r="11.0883" transform="rotate(126 163.943 91.215)" stroke="#72777C" stroke-width="7.00311"/>
<line x1="189.138" y1="126.246" x2="172.231" y2="143.149" stroke="#72777C" stroke-width="7.58671"/>
<line x1="163.698" y1="160.709" x2="163.698" y2="196.892" stroke="#72777C" stroke-width="7.58671"/>
<circle cx="163.99" cy="147.973" r="11.0883" transform="rotate(126 163.99 147.973)" stroke="#72777C" stroke-width="7.00311"/>
<circle cx="195.364" cy="120.395" r="11.0883" transform="rotate(126 195.364 120.395)" stroke="#7B58E5" stroke-width="7.00311"/>
<line y1="-3.79335" x2="23.9072" y2="-3.79335" transform="matrix(0.70719 0.707023 0.707023 -0.70719 141.524 123.562)" stroke="#72777C" stroke-width="7.58671"/>
<circle r="11.0883" transform="matrix(0.587786 0.809017 0.809017 -0.587786 132.617 120.394)" stroke="#72777C" stroke-width="7.00311"/>
<line x1="188.672" y1="183.346" x2="171.765" y2="200.249" stroke="#787878" stroke-width="7.58671"/>
<line y1="-3.79335" x2="23.9072" y2="-3.79335" transform="matrix(0.70719 0.707023 0.707023 -0.70719 203.806 180.663)" stroke="#72777C" stroke-width="7.58671"/>
<circle r="11.0883" transform="matrix(0.587786 0.809017 0.809017 -0.587786 225.807 205.413)" stroke="#7B58E5" stroke-width="7.00311"/>
<line x1="219.581" y1="155.427" x2="202.674" y2="172.33" stroke="#72777C" stroke-width="7.58671"/>
<circle cx="194.898" cy="177.494" r="11.0883" transform="rotate(126 194.898 177.494)" stroke="#72777C" stroke-width="7.00311"/>
<circle cx="225.807" cy="149.575" r="11.0883" transform="rotate(126 225.807 149.575)" stroke="#72777C" stroke-width="7.00311"/>
<line y1="-3.79335" x2="23.9072" y2="-3.79335" transform="matrix(0.70719 0.707023 0.707023 -0.70719 141.989 180.663)" stroke="#787878" stroke-width="7.58671"/>
<line x1="126.856" y1="183.346" x2="109.949" y2="200.249" stroke="#787878" stroke-width="7.58671"/>
<circle cx="102.173" cy="205.413" r="11.0883" transform="rotate(126 102.173 205.413)" stroke="#787878" stroke-width="7.00311"/>
<line y1="-3.79335" x2="23.9072" y2="-3.79335" transform="matrix(0.70719 0.707023 0.707023 -0.70719 111.08 152.744)" stroke="#787878" stroke-width="7.58671"/>
<circle r="11.0883" transform="matrix(0.587786 0.809017 0.809017 -0.587786 133.081 177.494)" stroke="#7B58E5" stroke-width="7.00311"/>
<circle r="11.0883" transform="matrix(0.587786 0.809017 0.809017 -0.587786 102.173 149.575)" stroke="#72777C" stroke-width="7.00311"/>
<circle cx="163.99" cy="204.731" r="11.0883" transform="rotate(126 163.99 204.731)" stroke="#72777C" stroke-width="7.00311"/>
<path d="M413.961 196.933C409.273 196.933 405.073 196.172 401.359 194.65C397.645 193.128 394.662 190.876 392.41 187.893C390.218 184.91 389.061 181.318 388.94 177.117H405.56C405.803 179.491 406.625 181.318 408.025 182.596C409.425 183.814 411.252 184.423 413.504 184.423C415.818 184.423 417.644 183.905 418.983 182.87C420.323 181.774 420.992 180.283 420.992 178.395C420.992 176.813 420.445 175.504 419.349 174.469C418.314 173.434 417.005 172.582 415.422 171.912C413.9 171.242 411.708 170.481 408.847 169.629C404.707 168.35 401.329 167.072 398.711 165.794C396.093 164.515 393.84 162.628 391.953 160.132C390.066 157.636 389.122 154.379 389.122 150.361C389.122 144.395 391.283 139.737 395.606 136.389C399.928 132.98 405.56 131.275 412.5 131.275C419.562 131.275 425.254 132.98 429.576 136.389C433.899 139.737 436.212 144.425 436.517 150.452H419.623C419.501 148.382 418.74 146.769 417.34 145.612C415.939 144.395 414.144 143.786 411.952 143.786C410.065 143.786 408.543 144.303 407.386 145.338C406.229 146.312 405.651 147.743 405.651 149.63C405.651 151.7 406.625 153.313 408.573 154.47C410.521 155.627 413.565 156.875 417.705 158.214C421.845 159.614 425.193 160.954 427.75 162.232C430.368 163.511 432.62 165.367 434.508 167.803C436.395 170.238 437.338 173.373 437.338 177.208C437.338 180.861 436.395 184.179 434.508 187.162C432.681 190.145 430.003 192.519 426.472 194.285C422.941 196.05 418.77 196.933 413.961 196.933ZM478.088 196.294L462.564 174.925V196.294H446.948V128.718H462.564V166.067L477.997 145.338H497.265L476.079 170.907L497.448 196.294H478.088ZM511.252 140.042C508.512 140.042 506.26 139.25 504.494 137.667C502.789 136.024 501.937 134.015 501.937 131.64C501.937 129.205 502.789 127.196 504.494 125.613C506.26 123.97 508.512 123.148 511.252 123.148C513.93 123.148 516.122 123.97 517.827 125.613C519.592 127.196 520.475 129.205 520.475 131.64C520.475 134.015 519.592 136.024 517.827 137.667C516.122 139.25 513.93 140.042 511.252 140.042ZM519.014 145.338V196.294H503.398V145.338H519.014ZM545.946 128.718V196.294H530.33V128.718H545.946ZM572.877 128.718V196.294H557.262V128.718H572.877ZM604.923 197.024C600.479 197.024 596.522 196.264 593.052 194.742C589.582 193.22 586.842 191.15 584.833 188.532C582.824 185.853 581.698 182.87 581.454 179.583H596.887C597.07 181.348 597.892 182.779 599.353 183.875C600.814 184.97 602.61 185.518 604.74 185.518C606.689 185.518 608.18 185.153 609.215 184.423C610.311 183.631 610.859 182.627 610.859 181.409C610.859 179.948 610.098 178.883 608.576 178.213C607.054 177.482 604.588 176.691 601.179 175.839C597.526 174.986 594.482 174.104 592.047 173.19C589.612 172.216 587.512 170.725 585.746 168.716C583.981 166.646 583.098 163.876 583.098 160.406C583.098 157.484 583.889 154.835 585.472 152.461C587.116 150.026 589.49 148.108 592.595 146.708C595.761 145.308 599.505 144.608 603.827 144.608C610.22 144.608 615.242 146.19 618.895 149.356C622.608 152.522 624.739 156.723 625.287 161.958H610.859C610.615 160.193 609.824 158.792 608.485 157.757C607.206 156.723 605.501 156.205 603.371 156.205C601.544 156.205 600.144 156.57 599.17 157.301C598.196 157.971 597.709 158.914 597.709 160.132C597.709 161.593 598.47 162.689 599.992 163.419C601.575 164.15 604.01 164.88 607.297 165.611C611.072 166.585 614.146 167.559 616.521 168.533C618.895 169.446 620.965 170.968 622.73 173.099C624.557 175.169 625.5 177.969 625.561 181.5C625.561 184.483 624.709 187.162 623.004 189.536C621.36 191.85 618.956 193.676 615.79 195.015C612.685 196.355 609.063 197.024 604.923 197.024Z" fill="#6C4DEA"/>
<path d="M712.817 196.294H702.407L671.085 148.9V196.294H660.675V132.736H671.085L702.407 180.039V132.736H712.817V196.294ZM772.604 169.903C772.604 171.79 772.482 173.495 772.239 175.017H733.794C734.098 179.035 735.59 182.261 738.268 184.696C740.947 187.132 744.234 188.349 748.131 188.349C753.732 188.349 757.689 186.005 760.002 181.318H771.234C769.712 185.945 766.942 189.749 762.924 192.733C758.967 195.655 754.036 197.116 748.131 197.116C743.321 197.116 738.999 196.05 735.163 193.92C731.389 191.728 728.406 188.684 726.214 184.788C724.083 180.831 723.018 176.265 723.018 171.09C723.018 165.915 724.053 161.38 726.123 157.484C728.254 153.526 731.206 150.482 734.981 148.352C738.816 146.221 743.199 145.156 748.131 145.156C752.879 145.156 757.11 146.19 760.824 148.26C764.538 150.33 767.429 153.252 769.499 157.027C771.569 160.741 772.604 165.033 772.604 169.903ZM761.737 166.615C761.676 162.78 760.306 159.706 757.628 157.392C754.949 155.079 751.631 153.922 747.674 153.922C744.082 153.922 741.008 155.079 738.451 157.392C735.894 159.645 734.372 162.719 733.885 166.615H761.737ZM794.994 154.47V182.322C794.994 184.209 795.42 185.579 796.273 186.432C797.186 187.223 798.708 187.619 800.839 187.619H807.231V196.294H799.012C794.325 196.294 790.733 195.198 788.237 193.006C785.741 190.815 784.493 187.253 784.493 182.322V154.47H778.557V145.977H784.493V133.467H794.994V145.977H807.231V154.47H794.994ZM884.402 145.977L868.786 196.294H857.828L847.691 159.127L837.555 196.294H826.597L810.89 145.977H821.483L831.985 186.432L842.669 145.977H853.536L863.764 186.249L874.174 145.977H884.402ZM914.007 197.116C909.258 197.116 904.966 196.05 901.131 193.92C897.295 191.728 894.282 188.684 892.09 184.788C889.899 180.831 888.803 176.265 888.803 171.09C888.803 165.976 889.929 161.441 892.181 157.484C894.434 153.526 897.508 150.482 901.405 148.352C905.301 146.221 909.654 145.156 914.463 145.156C919.273 145.156 923.626 146.221 927.522 148.352C931.418 150.482 934.492 153.526 936.745 157.484C938.997 161.441 940.124 165.976 940.124 171.09C940.124 176.204 938.967 180.739 936.654 184.696C934.34 188.654 931.175 191.728 927.157 193.92C923.199 196.05 918.816 197.116 914.007 197.116ZM914.007 188.075C916.685 188.075 919.181 187.436 921.495 186.158C923.869 184.879 925.787 182.961 927.248 180.405C928.709 177.848 929.439 174.743 929.439 171.09C929.439 167.437 928.739 164.363 927.339 161.867C925.939 159.31 924.082 157.392 921.769 156.114C919.455 154.835 916.959 154.196 914.281 154.196C911.602 154.196 909.106 154.835 906.792 156.114C904.54 157.392 902.744 159.31 901.405 161.867C900.065 164.363 899.396 167.437 899.396 171.09C899.396 176.508 900.765 180.709 903.505 183.692C906.305 186.614 909.806 188.075 914.007 188.075ZM960.825 153.283C962.347 150.726 964.356 148.747 966.852 147.347C969.409 145.886 972.423 145.156 975.893 145.156V155.931H973.245C969.166 155.931 966.061 156.966 963.93 159.036C961.86 161.106 960.825 164.698 960.825 169.812V196.294H950.415V145.977H960.825V153.283ZM1005.37 171.181L1028.56 196.294H1014.5L995.872 174.651V196.294H985.462V128.718H995.872V167.985L1014.14 145.977H1028.56L1005.37 171.181Z" fill="#72777C"/>
</svg>
