{
	"version": "2.0.0",
	"tasks": [
		{
			"type": "xslt-js",
			"label": "films",
			"xsltFile": "${workspaceFolder}/exercicis/activitat1/films.xsl",
			"xmlSource": "${workspaceFolder}/exercicis/activitat1/films.xml",
			"resultPath": "${workspaceFolder}/exercicis/activitat1/films.html",
			"group": {
				"kind": "build",
				"isDefault": true
			},
			"problemMatcher": [
				"$saxon-xslt-js"
			]
		}
	]
}