<svg width="24" height="24" viewBox="0 0 24 24" fill="none" xmlns="http://www.w3.org/2000/svg">
<g id="Check">
<path id="Vector (Stroke)" fill-rule="evenodd" clip-rule="evenodd" d="M20.2015 6.28735C20.5951 6.67479 20.6001 7.30793 20.2127 7.70152L10.3689 17.7015C9.99646 18.0799 9.39325 18.1012 8.99498 17.7501L3.83873 13.2047C3.42444 12.8395 3.38466 12.2076 3.74987 11.7933C4.11509 11.379 4.747 11.3392 5.16129 11.7044L9.60757 15.624L18.7874 6.29848C19.1748 5.9049 19.8079 5.89991 20.2015 6.28735Z" fill="#222222"/>
</g>
</svg>
