<svg width="67" height="44" viewBox="0 0 67 44" fill="none" xmlns="http://www.w3.org/2000/svg">
<path d="M6.97596 14.4001H0.959961V10.5601H6.97596V14.4001ZM6.97596 32.0001H0.959961V15.8721H6.97596V32.0001Z" fill="#104551"/>
<path d="M14.5295 32.0001H8.89746V10.5601H14.9135V20.0321H15.2335C15.7135 17.3441 17.5055 15.5521 21.3135 15.5521C26.0495 15.5521 28.7055 18.6881 28.7055 23.9361C28.7055 29.1521 25.9855 32.3201 21.0575 32.3201C17.2815 32.3201 15.3615 30.8481 14.8495 27.6481H14.5295V32.0001ZM14.9135 23.9681C14.9135 26.3041 16.1935 26.8161 18.8815 26.8161C21.6655 26.8161 22.6255 26.0801 22.6255 23.9361C22.6255 21.7921 21.6655 21.0241 18.8815 21.0241C16.1935 21.0241 14.9135 21.4721 14.9135 23.7441V23.9681Z" fill="#104551"/>
<path d="M39.2957 32.3201C33.8237 32.3201 29.9837 29.9841 29.9837 23.9361C29.9837 18.6881 33.7917 15.5521 39.1677 15.5521C44.7357 15.5521 48.2877 18.3361 48.2877 23.5201C48.2877 24.0641 48.2557 24.4801 48.1917 25.0561H35.5517C35.6477 27.0081 36.5117 27.5521 39.0717 27.5521C41.5037 27.5521 42.1437 27.1361 42.1437 26.1761V25.8241H48.1597V26.2081C48.1597 29.7921 44.7357 32.3201 39.2957 32.3201ZM39.0397 20.1601C36.8317 20.1601 35.9037 20.6401 35.6477 22.0161H42.4637C42.2397 20.6401 41.2797 20.1601 39.0397 20.1601Z" fill="#104551"/>
<path d="M55.9135 32.0001H49.8975V15.8721H55.5295V20.0961H55.8495C56.2975 17.4401 57.9615 15.5521 61.1615 15.5521C64.7135 15.5521 66.1215 17.8881 66.1215 21.1201V24.3201H60.1055V22.4321C60.1055 21.0881 59.5935 20.6081 58.0255 20.6081C56.3935 20.6081 55.9135 21.0881 55.9135 22.3681V32.0001Z" fill="#104551"/>
</svg>
