{
	"ID": "House14Space2252015-03-04T21:30:00Z",
	"IDhash": "8137e1",
	"Household": "House14",
	"Space": "Space225",
	"Room_Type": "Bathroom",
	"timestamp": "2015-03-04T21:30:00Z",
	"Air_humidity": "42",
	"Nominal_temperature": "None",
	"Actual_temperature": "20",
	"Air_temperature": "18.628",
	"Rel_humidity": "45.714",
	"Intensity": "11.8",
	"Brightness": "None",
	"Climate_Air_temperature": "4.559",
	"Climate_Rel_humidity": "78.62",
	"Climate_Wind_speed": "1.238"
}