{
	"ID": "House17Space2732015-03-16T11:00:00Z",
	"IDhash": "fb0cb0",
	"Household": "House17",
	"Space": "Space273",
	"Room_Type": "Kitchen",
	"timestamp": "2015-03-16T11:00:00Z",
	"Air_humidity": "None",
	"Nominal_temperature": "None",
	"Actual_temperature": "42",
	"Air_temperature": "21.39",
	"Rel_humidity": "46.659",
	"Intensity": "19.7",
	"Brightness": "65",
	"Climate_Air_temperature": "8.27",
	"Climate_Rel_humidity": "80",
	"Climate_Wind_speed": "2.157"
}