{
	"ID": "House12Space1842015-02-16T07:30:00Z",
	"IDhash": "8e9dea",
	"Household": "House12",
	"Space": "Space184",
	"Room_Type": "Kitchen",
	"timestamp": "2015-02-16T07:30:00Z",
	"Air_humidity": "50",
	"Nominal_temperature": "6",
	"Actual_temperature": "None",
	"Air_temperature": "19.008",
	"Rel_humidity": "41.32",
	"Intensity": "11.8",
	"Brightness": "None",
	"Climate_Air_temperature": "5.353",
	"Climate_Rel_humidity": "90.2",
	"Climate_Wind_speed": "1.654"
}