{
	"ID": "House13Space2092015-02-03T08:00:00Z",
	"IDhash": "129611",
	"Household": "House13",
	"Space": "Space209",
	"Room_Type": "Ensuite",
	"timestamp": "2015-02-03T08:00:00Z",
	"Air_humidity": "36",
	"Nominal_temperature": "6",
	"Actual_temperature": "None",
	"Air_temperature": "22.321",
	"Rel_humidity": "41.008",
	"Intensity": "3.9",
	"Brightness": "None",
	"Climate_Air_temperature": "-0.372",
	"Climate_Rel_humidity": "87.6",
	"Climate_Wind_speed": "1.079"
}