{
	"ID": "House15Space2292015-02-19T19:30:00Z",
	"IDhash": "b3ff4c",
	"Household": "House15",
	"Space": "Space229",
	"Room_Type": "Living room",
	"timestamp": "2015-02-19T19:30:00Z",
	"Air_humidity": "63",
	"Nominal_temperature": "None",
	"Actual_temperature": "18.5",
	"Air_temperature": "27.063",
	"Rel_humidity": "43.464",
	"Intensity": "11.8",
	"Brightness": "None",
	"Climate_Air_temperature": "7.227",
	"Climate_Rel_humidity": "93.3",
	"Climate_Wind_speed": "1.387"
}