{
	"ID": "House13Space2002015-02-01T17:30:00Z",
	"IDhash": "a8c70c",
	"Household": "House13",
	"Space": "Space200",
	"Room_Type": "Kitchen",
	"timestamp": "2015-02-01T17:30:00Z",
	"Air_humidity": "None",
	"Nominal_temperature": "None",
	"Actual_temperature": "21",
	"Air_temperature": "20.627",
	"Rel_humidity": "40.304",
	"Intensity": "27.6",
	"Brightness": "45",
	"Climate_Air_temperature": "1.681",
	"Climate_Rel_humidity": "74.33",
	"Climate_Wind_speed": "1.357"
}