{
	"ID": "House9Space1452014-12-14T14:30:00Z",
	"IDhash": "0633f7",
	"Household": "House9",
	"Space": "Space145",
	"Room_Type": "Living room",
	"timestamp": "2014-12-14T14:30:00Z",
	"Air_humidity": "55",
	"Nominal_temperature": "None",
	"Actual_temperature": "None",
	"Air_temperature": "21.175",
	"Rel_humidity": "49.737",
	"Intensity": "90.7",
	"Brightness": "50",
	"Climate_Air_temperature": "8.74",
	"Climate_Rel_humidity": "83.4",
	"Climate_Wind_speed": "2.16"
}