{
	"ID": "House7Space1142015-02-24T08:00:00Z",
	"IDhash": "dc9325",
	"Household": "House7",
	"Space": "Space114",
	"Room_Type": "Kitchen",
	"timestamp": "2015-02-24T08:00:00Z",
	"Air_humidity": "41",
	"Nominal_temperature": "None",
	"Actual_temperature": "19",
	"Air_temperature": "17.677",
	"Rel_humidity": "44.171",
	"Intensity": "11.8",
	"Brightness": "None",
	"Climate_Air_temperature": "5.008",
	"Climate_Rel_humidity": "79.09",
	"Climate_Wind_speed": "4.25"
}