{
	"ID": "House18Space2842014-11-25T16:00:00Z",
	"IDhash": "457867",
	"Household": "House18",
	"Space": "Space284",
	"Room_Type": "Living room",
	"timestamp": "2014-11-25T16:00:00Z",
	"Air_humidity": "None",
	"Nominal_temperature": "19",
	"Actual_temperature": "None",
	"Air_temperature": "22.417",
	"Rel_humidity": "44.479",
	"Intensity": "11.8",
	"Brightness": "22",
	"Climate_Air_temperature": "3.773",
	"Climate_Rel_humidity": "95.2",
	"Climate_Wind_speed": "0.495"
}