{
	"ID": "House9Space1452014-12-04T07:00:00Z",
	"IDhash": "ce3a01",
	"Household": "House9",
	"Space": "Space145",
	"Room_Type": "Living room",
	"timestamp": "2014-12-04T07:00:00Z",
	"Air_humidity": "None",
	"Nominal_temperature": "None",
	"Actual_temperature": "16.5",
	"Air_temperature": "15.891",
	"Rel_humidity": "64.368",
	"Intensity": "11.8",
	"Brightness": "51",
	"Climate_Air_temperature": "3.484",
	"Climate_Rel_humidity": "94.9",
	"Climate_Wind_speed": "0.491"
}