{
	"ID": "House13Space2092015-01-06T19:30:00Z",
	"IDhash": "27e0ee",
	"Household": "House13",
	"Space": "Space209",
	"Room_Type": "Ensuite",
	"timestamp": "2015-01-06T19:30:00Z",
	"Air_humidity": "42",
	"Nominal_temperature": "None",
	"Actual_temperature": "24",
	"Air_temperature": "22.417",
	"Rel_humidity": "47.169",
	"Intensity": "3.9",
	"Brightness": "None",
	"Climate_Air_temperature": "4.943",
	"Climate_Rel_humidity": "82.3",
	"Climate_Wind_speed": "1.374"
}