{
	"ID": "House13Space2092014-12-02T08:00:00Z",
	"IDhash": "8ec17c",
	"Household": "House13",
	"Space": "Space209",
	"Room_Type": "Ensuite",
	"timestamp": "2014-12-02T08:00:00Z",
	"Air_humidity": "None",
	"Nominal_temperature": "6",
	"Actual_temperature": "23",
	"Air_temperature": "22.657",
	"Rel_humidity": "56.786",
	"Intensity": "3.9",
	"Brightness": "None",
	"Climate_Air_temperature": "7.079",
	"Climate_Rel_humidity": "83",
	"Climate_Wind_speed": "2.889"
}