{
	"ID": "House19Space3072015-04-24T16:30:00Z",
	"IDhash": "4c0df8",
	"Household": "House19",
	"Space": "Space307",
	"Room_Type": "Bathroom",
	"timestamp": "2015-04-24T16:30:00Z",
	"Air_humidity": "70",
	"Nominal_temperature": "None",
	"Actual_temperature": "21",
	"Air_temperature": "22.13",
	"Rel_humidity": "55.251",
	"Intensity": "130.1",
	"Brightness": "None",
	"Climate_Air_temperature": "16.08",
	"Climate_Rel_humidity": "60.84",
	"Climate_Wind_speed": "1.9"
}