{
	"ID": "House13Space1982015-02-10T09:00:00Z",
	"IDhash": "35f6e5",
	"Household": "House13",
	"Space": "Space198",
	"Room_Type": "Living room",
	"timestamp": "2015-02-10T09:00:00Z",
	"Air_humidity": "None",
	"Nominal_temperature": "None",
	"Actual_temperature": "18",
	"Air_temperature": "19.389",
	"Rel_humidity": "36.595",
	"Intensity": "19.7",
	"Brightness": "45",
	"Climate_Air_temperature": "3.765",
	"Climate_Rel_humidity": "91.9",
	"Climate_Wind_speed": "1.443"
}