{
	"ID": "House16Space2532015-02-17T19:00:00Z",
	"IDhash": "3d0b5e",
	"Household": "House16",
	"Space": "Space253",
	"Room_Type": "Living room",
	"timestamp": "2015-02-17T19:00:00Z",
	"Air_humidity": "59",
	"Nominal_temperature": "None",
	"Actual_temperature": "20.5",
	"Air_temperature": "20.222",
	"Rel_humidity": "58.291",
	"Intensity": "11.8",
	"Brightness": "None",
	"Climate_Air_temperature": "5.401",
	"Climate_Rel_humidity": "67.68",
	"Climate_Wind_speed": "1.033"
}