{
	"ID": "House6Space962015-03-05T21:00:00Z",
	"IDhash": "6c7faa",
	"Household": "House6",
	"Space": "Space96",
	"Room_Type": "Kitchen",
	"timestamp": "2015-03-05T21:00:00Z",
	"Air_humidity": "44",
	"Nominal_temperature": "None",
	"Actual_temperature": "17.5",
	"Air_temperature": "21.939",
	"Rel_humidity": "41.193",
	"Intensity": "11.8",
	"Brightness": "None",
	"Climate_Air_temperature": "8.46",
	"Climate_Rel_humidity": "67.52",
	"Climate_Wind_speed": "1.637"
}