{
	"ID": "House4Space452015-04-10T18:00:00Z",
	"IDhash": "7591b1",
	"Household": "House4",
	"Space": "Space45",
	"Room_Type": "Living room",
	"timestamp": "2015-04-10T18:00:00Z",
	"Air_humidity": "56",
	"Nominal_temperature": "None",
	"Actual_temperature": "None",
	"Air_temperature": "19.793",
	"Rel_humidity": "49.209",
	"Intensity": "11.8",
	"Brightness": "37",
	"Climate_Air_temperature": "19.08",
	"Climate_Rel_humidity": "46.49",
	"Climate_Wind_speed": "1.291"
}