{
	"ID": "House18Space2842015-04-23T08:00:00Z",
	"IDhash": "41d043",
	"Household": "House18",
	"Space": "Space284",
	"Room_Type": "Living room",
	"timestamp": "2015-04-23T08:00:00Z",
	"Air_humidity": "49",
	"Nominal_temperature": "None",
	"Actual_temperature": "19.5",
	"Air_temperature": "20.674",
	"Rel_humidity": "45.614",
	"Intensity": "27.6",
	"Brightness": "None",
	"Climate_Air_temperature": "7.951",
	"Climate_Rel_humidity": "88.2",
	"Climate_Wind_speed": "0.777"
}