{
	"ID": "House8Space1242014-11-06T07:00:00Z",
	"IDhash": "06c5f2",
	"Household": "House8",
	"Space": "Space124",
	"Room_Type": "Bathroom",
	"timestamp": "2014-11-06T07:00:00Z",
	"Air_humidity": "76",
	"Nominal_temperature": "None",
	"Actual_temperature": "20.5",
	"Air_temperature": "20.174",
	"Rel_humidity": "86.883",
	"Intensity": "745",
	"Brightness": "None",
	"Climate_Air_temperature": "4.144",
	"Climate_Rel_humidity": "86.8",
	"Climate_Wind_speed": "160.3"
}