{
	"ID": "House15Space2312014-12-16T17:30:00Z",
	"IDhash": "a4250b",
	"Household": "House15",
	"Space": "Space231",
	"Room_Type": "Kitchen",
	"timestamp": "2014-12-16T17:30:00Z",
	"Air_humidity": "54",
	"Nominal_temperature": "None",
	"Actual_temperature": "19",
	"Air_temperature": "20.531",
	"Rel_humidity": "45.087",
	"Intensity": "27.6",
	"Brightness": "None",
	"Climate_Air_temperature": "5.957",
	"Climate_Rel_humidity": "85.6",
	"Climate_Wind_speed": "0.901"
}