{
	"ID": "House12Space1842014-10-07T19:30:00Z",
	"IDhash": "a0e8ed",
	"Household": "House12",
	"Space": "Space184",
	"Room_Type": "Kitchen",
	"timestamp": "2014-10-07T19:30:00Z",
	"Air_humidity": "None",
	"Nominal_temperature": "20",
	"Actual_temperature": "None",
	"Air_temperature": "20.722",
	"Rel_humidity": "51.404",
	"Intensity": "11.8",
	"Brightness": "15",
	"Climate_Air_temperature": "8.66",
	"Climate_Rel_humidity": "83",
	"Climate_Wind_speed": "0.594"
}