{
	"ID": "House10Space1612015-02-06T06:30:00Z",
	"IDhash": "ace4c9",
	"Household": "House10",
	"Space": "Space161",
	"Room_Type": "Bathroom",
	"timestamp": "2015-02-06T06:30:00Z",
	"Air_humidity": "None",
	"Nominal_temperature": "20",
	"Actual_temperature": "15.5",
	"Air_temperature": "17.772",
	"Rel_humidity": "33.787",
	"Intensity": "19.7",
	"Brightness": "None",
	"Climate_Air_temperature": "-1.105",
	"Climate_Rel_humidity": "90.3",
	"Climate_Wind_speed": "0.436"
}