{
	"ID": "House18Space2842014-11-12T23:00:00Z",
	"IDhash": "3c0a55",
	"Household": "House18",
	"Space": "Space284",
	"Room_Type": "Living room",
	"timestamp": "2014-11-12T23:00:00Z",
	"Air_humidity": "56",
	"Nominal_temperature": "12",
	"Actual_temperature": "None",
	"Air_temperature": "22.513",
	"Rel_humidity": "54.56",
	"Intensity": "11.8",
	"Brightness": "None",
	"Climate_Air_temperature": "8.38",
	"Climate_Rel_humidity": "92.3",
	"Climate_Wind_speed": "1.112"
}