{
	"ID": "House13Space2002014-10-28T13:30:00Z",
	"IDhash": "b20fb3",
	"Household": "House13",
	"Space": "Space200",
	"Room_Type": "Kitchen",
	"timestamp": "2014-10-28T13:30:00Z",
	"Air_humidity": "None",
	"Nominal_temperature": "None",
	"Actual_temperature": "21.5",
	"Air_temperature": "20.96",
	"Rel_humidity": "65.482",
	"Intensity": "11.8",
	"Brightness": "50",
	"Climate_Air_temperature": "18.98",
	"Climate_Rel_humidity": "67",
	"Climate_Wind_speed": "1.218"
}