{
	"ID": "House7Space1142014-10-11T18:00:00Z",
	"IDhash": "a2a554",
	"Household": "House7",
	"Space": "Space114",
	"Room_Type": "Kitchen",
	"timestamp": "2014-10-11T18:00:00Z",
	"Air_humidity": "59",
	"Nominal_temperature": "None",
	"Actual_temperature": "17.5",
	"Air_temperature": "19.27",
	"Rel_humidity": "67.144",
	"Intensity": "27.6",
	"Brightness": "None",
	"Climate_Air_temperature": "10.49",
	"Climate_Rel_humidity": "87.5",
	"Climate_Wind_speed": "0.329"
}