{
	"ID": "House12Space1842014-11-01T12:30:00Z",
	"IDhash": "410d3c",
	"Household": "House12",
	"Space": "Space184",
	"Room_Type": "Kitchen",
	"timestamp": "2014-11-01T12:30:00Z",
	"Air_humidity": "63",
	"Nominal_temperature": "15.5",
	"Actual_temperature": "None",
	"Air_temperature": "19.032",
	"Rel_humidity": "60.957",
	"Intensity": "11.8",
	"Brightness": "60",
	"Climate_Air_temperature": "15.54",
	"Climate_Rel_humidity": "68.51",
	"Climate_Wind_speed": "1.879"
}