{
	"ID": "House19Space3072014-11-28T12:30:00Z",
	"IDhash": "1f5e2b",
	"Household": "House19",
	"Space": "Space307",
	"Room_Type": "Bathroom",
	"timestamp": "2014-11-28T12:30:00Z",
	"Air_humidity": "62",
	"Nominal_temperature": "None",
	"Actual_temperature": "19.5",
	"Air_temperature": "20.198",
	"Rel_humidity": "59.842",
	"Intensity": "35.5",
	"Brightness": "None",
	"Climate_Air_temperature": "10.93",
	"Climate_Rel_humidity": "95.1",
	"Climate_Wind_speed": "2.075"
}