{
	"ID": "House15Space2462014-09-04T19:30:00Z",
	"IDhash": "2a49ff",
	"Household": "House15",
	"Space": "Space246",
	"Room_Type": "Bedroom",
	"timestamp": "2014-09-04T19:30:00Z",
	"Air_humidity": "63",
	"Nominal_temperature": "None",
	"Actual_temperature": "23.5",
	"Air_temperature": "23.689",
	"Rel_humidity": "61.069",
	"Intensity": "3.9",
	"Brightness": "None",
	"Climate_Air_temperature": "18.59",
	"Climate_Rel_humidity": "76.48",
	"Climate_Wind_speed": "0.705"
}