{
	"ID": "House18Space2862015-01-26T20:30:00Z",
	"IDhash": "c0a7b4",
	"Household": "House18",
	"Space": "Space286",
	"Room_Type": "Kitchen",
	"timestamp": "2015-01-26T20:30:00Z",
	"Air_humidity": "50",
	"Nominal_temperature": "None",
	"Actual_temperature": "19.5",
	"Air_temperature": "21.27",
	"Rel_humidity": "51.667",
	"Intensity": "35.5",
	"Brightness": "None",
	"Climate_Air_temperature": "5.274",
	"Climate_Rel_humidity": "84.1",
	"Climate_Wind_speed": "2.901"
}