{
	"ID": "House18Space2862015-03-28T21:30:00Z",
	"IDhash": "aaa79e",
	"Household": "House18",
	"Space": "Space286",
	"Room_Type": "Kitchen",
	"timestamp": "2015-03-28T21:30:00Z",
	"Air_humidity": "None",
	"Nominal_temperature": "21",
	"Actual_temperature": "23.5",
	"Air_temperature": "21.342",
	"Rel_humidity": "47.575",
	"Intensity": "11.8",
	"Brightness": "None",
	"Climate_Air_temperature": "10.21",
	"Climate_Rel_humidity": "81.8",
	"Climate_Wind_speed": "3.017"
}