{
	"ID": "House13Space2002015-01-25T08:00:00Z",
	"IDhash": "fddddc",
	"Household": "House13",
	"Space": "Space200",
	"Room_Type": "Kitchen",
	"timestamp": "2015-01-25T08:00:00Z",
	"Air_humidity": "None",
	"Nominal_temperature": "18",
	"Actual_temperature": "None",
	"Air_temperature": "18.509",
	"Rel_humidity": "41.393",
	"Intensity": "11.8",
	"Brightness": "24",
	"Climate_Air_temperature": "2.663",
	"Climate_Rel_humidity": "85.3",
	"Climate_Wind_speed": "0.776"
}