{
	"ID": "House18Space2842015-01-30T18:00:00Z",
	"IDhash": "1b550e",
	"Household": "House18",
	"Space": "Space284",
	"Room_Type": "Living room",
	"timestamp": "2015-01-30T18:00:00Z",
	"Air_humidity": "None",
	"Nominal_temperature": "20",
	"Actual_temperature": "None",
	"Air_temperature": "18.913",
	"Rel_humidity": "38.791",
	"Intensity": "11.8",
	"Brightness": "12",
	"Climate_Air_temperature": "2.683",
	"Climate_Rel_humidity": "86.1",
	"Climate_Wind_speed": "2.929"
}