{
	"ID": "House6Space1082014-12-16T07:30:00Z",
	"IDhash": "fd436b",
	"Household": "House6",
	"Space": "Space108",
	"Room_Type": "Bathroom",
	"timestamp": "2014-12-16T07:30:00Z",
	"Air_humidity": "65",
	"Nominal_temperature": "None",
	"Actual_temperature": "15",
	"Air_temperature": "16.534",
	"Rel_humidity": "63.295",
	"Intensity": "11.8",
	"Brightness": "None",
	"Climate_Air_temperature": "4.66",
	"Climate_Rel_humidity": "86.6",
	"Climate_Wind_speed": "1.799"
}