{
	"ID": "House4Space492015-03-16T21:00:00Z",
	"IDhash": "91ca0b",
	"Household": "House4",
	"Space": "Space49",
	"Room_Type": "Kitchen",
	"timestamp": "2015-03-16T21:00:00Z",
	"Air_humidity": "None",
	"Nominal_temperature": "None",
	"Actual_temperature": "19.5",
	"Air_temperature": "21.223",
	"Rel_humidity": "41.47",
	"Intensity": "11.8",
	"Brightness": "48",
	"Climate_Air_temperature": "5.171",
	"Climate_Rel_humidity": "88.3",
	"Climate_Wind_speed": "1.549"
}