{
	"ID": "House13Space2002014-09-11T08:30:00Z",
	"IDhash": "1ce46f",
	"Household": "House13",
	"Space": "Space200",
	"Room_Type": "Kitchen",
	"timestamp": "2014-09-11T08:30:00Z",
	"Air_humidity": "53",
	"Nominal_temperature": "None",
	"Actual_temperature": "21",
	"Air_temperature": "21.127",
	"Rel_humidity": "53.739",
	"Intensity": "19.7",
	"Brightness": "None",
	"Climate_Air_temperature": "14.37",
	"Climate_Rel_humidity": "79.68",
	"Climate_Wind_speed": "0.59"
}