{
	"ID": "House18Space2862015-01-13T13:30:00Z",
	"IDhash": "5846bd",
	"Household": "House18",
	"Space": "Space286",
	"Room_Type": "Kitchen",
	"timestamp": "2015-01-13T13:30:00Z",
	"Air_humidity": "None",
	"Nominal_temperature": "None",
	"Actual_temperature": "21",
	"Air_temperature": "19.27",
	"Rel_humidity": "49.799",
	"Intensity": "11.8",
	"Brightness": "48",
	"Climate_Air_temperature": "3.766",
	"Climate_Rel_humidity": "89.6",
	"Climate_Wind_speed": "3.197"
}