{
	"ID": "House18Space2842015-04-04T17:00:00Z",
	"IDhash": "e3a94b",
	"Household": "House18",
	"Space": "Space284",
	"Room_Type": "Living room",
	"timestamp": "2015-04-04T17:00:00Z",
	"Air_humidity": "55",
	"Nominal_temperature": "None",
	"Actual_temperature": "None",
	"Air_temperature": "21.819",
	"Rel_humidity": "51.145",
	"Intensity": "43.4",
	"Brightness": "52",
	"Climate_Air_temperature": "10.72",
	"Climate_Rel_humidity": "70.87",
	"Climate_Wind_speed": "0.603"
}