{
	"ID": "House3Space342014-08-29T23:30:00Z",
	"IDhash": "85b30a",
	"Household": "House3",
	"Space": "Space34",
	"Room_Type": "Living room",
	"timestamp": "2014-08-29T23:30:00Z",
	"Air_humidity": "None",
	"Nominal_temperature": "None",
	"Actual_temperature": "20",
	"Air_temperature": "20.603",
	"Rel_humidity": "63.504",
	"Intensity": "19.7",
	"Brightness": "3",
	"Climate_Air_temperature": "15.57",
	"Climate_Rel_humidity": "86",
	"Climate_Wind_speed": "1.051"
}