{
	"ID": "House18Space2862014-12-09T07:00:00Z",
	"IDhash": "5a6e84",
	"Household": "House18",
	"Space": "Space286",
	"Room_Type": "Kitchen",
	"timestamp": "2014-12-09T07:00:00Z",
	"Air_humidity": "55",
	"Nominal_temperature": "None",
	"Actual_temperature": "15.5",
	"Air_temperature": "16.701",
	"Rel_humidity": "50.793",
	"Intensity": "35.5",
	"Brightness": "None",
	"Climate_Air_temperature": "1.342",
	"Climate_Rel_humidity": "91.2",
	"Climate_Wind_speed": "0.592"
}