{
	"ID": "House18Space2862014-12-16T07:00:00Z",
	"IDhash": "a5ac61",
	"Household": "House18",
	"Space": "Space286",
	"Room_Type": "Kitchen",
	"timestamp": "2014-12-16T07:00:00Z",
	"Air_humidity": "54",
	"Nominal_temperature": "None",
	"Actual_temperature": "18.5",
	"Air_temperature": "16.82",
	"Rel_humidity": "49.691",
	"Intensity": "11.8",
	"Brightness": "None",
	"Climate_Air_temperature": "4.937",
	"Climate_Rel_humidity": "85.6",
	"Climate_Wind_speed": "2.737"
}