{
	"ID": "House7Space1142015-02-27T13:00:00Z",
	"IDhash": "7d18fc",
	"Household": "House7",
	"Space": "Space114",
	"Room_Type": "Kitchen",
	"timestamp": "2015-02-27T13:00:00Z",
	"Air_humidity": "38",
	"Nominal_temperature": "None",
	"Actual_temperature": "22.5",
	"Air_temperature": "19.722",
	"Rel_humidity": "42.686",
	"Intensity": "35.5",
	"Brightness": "None",
	"Climate_Air_temperature": "8.05",
	"Climate_Rel_humidity": "58.95",
	"Climate_Wind_speed": "2.939"
}