{
	"ID": "House6Space932015-03-13T04:15:00Z",
	"IDhash": "fbf79b",
	"Household": "House6",
	"Space": "Space93",
	"Room_Type": "Living room",
	"timestamp": "2015-03-13T04:15:00Z",
	"Air_humidity": "46",
	"Nominal_temperature": "None",
	"Actual_temperature": "19",
	"Air_temperature": "19.96",
	"Rel_humidity": "46.481",
	"Intensity": "11.8",
	"Brightness": "None",
	"Climate_Air_temperature": "5.684",
	"Climate_Rel_humidity": "94.2",
	"Climate_Wind_speed": "0.912"
}