{
	"ID": "House9Space1412014-08-03T12:30:00Z",
	"IDhash": "1189c0",
	"Household": "House9",
	"Space": "Space141",
	"Room_Type": "Kitchen",
	"timestamp": "2014-08-03T12:30:00Z",
	"Air_humidity": "56",
	"Nominal_temperature": "None",
	"Actual_temperature": "None",
	"Air_temperature": "22.537",
	"Rel_humidity": "49.283",
	"Intensity": "19.7",
	"Brightness": "74",
	"Climate_Air_temperature": "20.81",
	"Climate_Rel_humidity": "56.45",
	"Climate_Wind_speed": "1.138"
}