{
	"ID": "House6Space962015-03-04T22:00:00Z",
	"IDhash": "cd073e",
	"Household": "House6",
	"Space": "Space96",
	"Room_Type": "Kitchen",
	"timestamp": "2015-03-04T22:00:00Z",
	"Air_humidity": "41",
	"Nominal_temperature": "11",
	"Actual_temperature": "None",
	"Air_temperature": "23.497",
	"Rel_humidity": "40.713",
	"Intensity": "11.8",
	"Brightness": "None",
	"Climate_Air_temperature": "4.017",
	"Climate_Rel_humidity": "80.1",
	"Climate_Wind_speed": "1.215"
}