{
	"ID": "House18Space2842015-03-11T18:00:00Z",
	"IDhash": "92a585",
	"Household": "House18",
	"Space": "Space284",
	"Room_Type": "Living room",
	"timestamp": "2015-03-11T18:00:00Z",
	"Air_humidity": "None",
	"Nominal_temperature": "21",
	"Actual_temperature": "None",
	"Air_temperature": "19.674",
	"Rel_humidity": "47.522",
	"Intensity": "11.8",
	"Brightness": "40",
	"Climate_Air_temperature": "11.76",
	"Climate_Rel_humidity": "76.4",
	"Climate_Wind_speed": "1.488"
}