{
	"ID": "House19Space3072015-02-24T06:30:00Z",
	"IDhash": "38afb7",
	"Household": "House19",
	"Space": "Space307",
	"Room_Type": "Bathroom",
	"timestamp": "2015-02-24T06:30:00Z",
	"Air_humidity": "64",
	"Nominal_temperature": "None",
	"Actual_temperature": "18.5",
	"Air_temperature": "20.388",
	"Rel_humidity": "79.584",
	"Intensity": "122.2",
	"Brightness": "None",
	"Climate_Air_temperature": "4.745",
	"Climate_Rel_humidity": "83.2",
	"Climate_Wind_speed": "4.628"
}