{
	"ID": "House4Space622015-01-30T08:30:00Z",
	"IDhash": "1ea06d",
	"Household": "House4",
	"Space": "Space62",
	"Room_Type": "Bedroom",
	"timestamp": "2015-01-30T08:30:00Z",
	"Air_humidity": "41",
	"Nominal_temperature": "None",
	"Actual_temperature": "18.5",
	"Air_temperature": "16.582",
	"Rel_humidity": "43.882",
	"Intensity": "11.8",
	"Brightness": "None",
	"Climate_Air_temperature": "0.335",
	"Climate_Rel_humidity": "95",
	"Climate_Wind_speed": "1.612"
}