{
	"ID": "House7Space1142014-12-08T20:00:00Z",
	"IDhash": "830035",
	"Household": "House7",
	"Space": "Space114",
	"Room_Type": "Kitchen",
	"timestamp": "2014-12-08T20:00:00Z",
	"Air_humidity": "42",
	"Nominal_temperature": "None",
	"Actual_temperature": "19.5",
	"Air_temperature": "19.222",
	"Rel_humidity": "45.501",
	"Intensity": "11.8",
	"Brightness": "None",
	"Climate_Air_temperature": "3.231",
	"Climate_Rel_humidity": "88.8",
	"Climate_Wind_speed": "1.513"
}