{
	"ID": "House6Space962014-10-08T08:30:00Z",
	"IDhash": "e69702",
	"Household": "House6",
	"Space": "Space96",
	"Room_Type": "Kitchen",
	"timestamp": "2014-10-08T08:30:00Z",
	"Air_humidity": "60",
	"Nominal_temperature": "16.5",
	"Actual_temperature": "16",
	"Air_temperature": "19.555",
	"Rel_humidity": "55.83",
	"Intensity": "19.7",
	"Brightness": "None",
	"Climate_Air_temperature": "9.64",
	"Climate_Rel_humidity": "91.8",
	"Climate_Wind_speed": "1.132"
}