{
	"ID": "House10Space1612014-12-06T09:30:00Z",
	"IDhash": "a47d1f",
	"Household": "House10",
	"Space": "Space161",
	"Room_Type": "Bathroom",
	"timestamp": "2014-12-06T09:30:00Z",
	"Air_humidity": "52",
	"Nominal_temperature": "None",
	"Actual_temperature": "19",
	"Air_temperature": "20.412",
	"Rel_humidity": "45.678",
	"Intensity": "19.7",
	"Brightness": "None",
	"Climate_Air_temperature": "2.308",
	"Climate_Rel_humidity": "85.8",
	"Climate_Wind_speed": "1.127"
}