{
	"ID": "House18Space2862015-01-08T08:30:00Z",
	"IDhash": "3476f7",
	"Household": "House18",
	"Space": "Space286",
	"Room_Type": "Kitchen",
	"timestamp": "2015-01-08T08:30:00Z",
	"Air_humidity": "47",
	"Nominal_temperature": "None",
	"Actual_temperature": "23",
	"Air_temperature": "20.65",
	"Rel_humidity": "48.848",
	"Intensity": "43.4",
	"Brightness": "None",
	"Climate_Air_temperature": "8.64",
	"Climate_Rel_humidity": "79.98",
	"Climate_Wind_speed": "1.515"
}