{
	"ID": "House7Space1142014-09-26T07:30:00Z",
	"IDhash": "8b4042",
	"Household": "House7",
	"Space": "Space114",
	"Room_Type": "Kitchen",
	"timestamp": "2014-09-26T07:30:00Z",
	"Air_humidity": "67",
	"Nominal_temperature": "None",
	"Actual_temperature": "None",
	"Air_temperature": "17.701",
	"Rel_humidity": "70.861",
	"Intensity": "19.7",
	"Brightness": "51",
	"Climate_Air_temperature": "16.25",
	"Climate_Rel_humidity": "75.98",
	"Climate_Wind_speed": "1.931"
}