{
	"ID": "House12Space1842015-03-20T20:00:00Z",
	"IDhash": "7d9454",
	"Household": "House12",
	"Space": "Space184",
	"Room_Type": "Kitchen",
	"timestamp": "2015-03-20T20:00:00Z",
	"Air_humidity": "51",
	"Nominal_temperature": "None",
	"Actual_temperature": "21",
	"Air_temperature": "20.412",
	"Rel_humidity": "40.895",
	"Intensity": "11.8",
	"Brightness": "None",
	"Climate_Air_temperature": "8.3",
	"Climate_Rel_humidity": "82.5",
	"Climate_Wind_speed": "2.341"
}