{
	"ID": "House13Space2002015-01-19T07:30:00Z",
	"IDhash": "50b28d",
	"Household": "House13",
	"Space": "Space200",
	"Room_Type": "Kitchen",
	"timestamp": "2015-01-19T07:30:00Z",
	"Air_humidity": "35",
	"Nominal_temperature": "None",
	"Actual_temperature": "None",
	"Air_temperature": "18.628",
	"Rel_humidity": "41.824",
	"Intensity": "11.8",
	"Brightness": "44",
	"Climate_Air_temperature": "-0.913",
	"Climate_Rel_humidity": "83.6",
	"Climate_Wind_speed": "1.922"
}