{
	"ID": "House18Space2862015-04-10T07:00:00Z",
	"IDhash": "9d73bc",
	"Household": "House18",
	"Space": "Space286",
	"Room_Type": "Kitchen",
	"timestamp": "2015-04-10T07:00:00Z",
	"Air_humidity": "58",
	"Nominal_temperature": "None",
	"Actual_temperature": "18.5",
	"Air_temperature": "20.65",
	"Rel_humidity": "49.51",
	"Intensity": "27.6",
	"Brightness": "None",
	"Climate_Air_temperature": "8.69",
	"Climate_Rel_humidity": "82.8",
	"Climate_Wind_speed": "0.647"
}