{
	"ID": "House16Space2532015-02-19T18:30:00Z",
	"IDhash": "04d1fa",
	"Household": "House16",
	"Space": "Space253",
	"Room_Type": "Living room",
	"timestamp": "2015-02-19T18:30:00Z",
	"Air_humidity": "58",
	"Nominal_temperature": "None",
	"Actual_temperature": "18.5",
	"Air_temperature": "18.414",
	"Rel_humidity": "57.951",
	"Intensity": "11.8",
	"Brightness": "None",
	"Climate_Air_temperature": "7.505",
	"Climate_Rel_humidity": "91.9",
	"Climate_Wind_speed": "1.098"
}