{
	"ID": "House13Space2122015-04-20T09:30:00Z",
	"IDhash": "34ac14",
	"Household": "House13",
	"Space": "Space212",
	"Room_Type": "Bathroom",
	"timestamp": "2015-04-20T09:30:00Z",
	"Air_humidity": "40",
	"Nominal_temperature": "None",
	"Actual_temperature": "20",
	"Air_temperature": "19.603",
	"Rel_humidity": "41.773",
	"Intensity": "264.1",
	"Brightness": "None",
	"Climate_Air_temperature": "6.367",
	"Climate_Rel_humidity": "90",
	"Climate_Wind_speed": "1.223"
}