{
	"ID": "House14Space2252015-02-12T07:30:00Z",
	"IDhash": "262d27",
	"Household": "House14",
	"Space": "Space225",
	"Room_Type": "Bathroom",
	"timestamp": "2015-02-12T07:30:00Z",
	"Air_humidity": "40",
	"Nominal_temperature": "None",
	"Actual_temperature": "20",
	"Air_temperature": "19.627",
	"Rel_humidity": "38.412",
	"Intensity": "11.8",
	"Brightness": "None",
	"Climate_Air_temperature": "3.834",
	"Climate_Rel_humidity": "75.11",
	"Climate_Wind_speed": "0.567"
}