{
	"ID": "House8Space1272014-12-06T10:30:00Z",
	"IDhash": "3eadc3",
	"Household": "House8",
	"Space": "Space127",
	"Room_Type": "Living room",
	"timestamp": "2014-12-06T10:30:00Z",
	"Air_humidity": "64",
	"Nominal_temperature": "None",
	"Actual_temperature": "16",
	"Air_temperature": "14.553",
	"Rel_humidity": "72.807",
	"Intensity": "3.9",
	"Brightness": "None",
	"Climate_Air_temperature": "4.251",
	"Climate_Rel_humidity": "79.08",
	"Climate_Wind_speed": "1.583"
}