{
	"ID": "House19Space3072014-12-16T06:30:00Z",
	"IDhash": "4779e7",
	"Household": "House19",
	"Space": "Space307",
	"Room_Type": "Bathroom",
	"timestamp": "2014-12-16T06:30:00Z",
	"Air_humidity": "67",
	"Nominal_temperature": "None",
	"Actual_temperature": "19",
	"Air_temperature": "20.913",
	"Rel_humidity": "80.43",
	"Intensity": "130.1",
	"Brightness": "None",
	"Climate_Air_temperature": "5.063",
	"Climate_Rel_humidity": "84.4",
	"Climate_Wind_speed": "3.148"
}