{
	"ID": "House7Space1212015-03-13T07:30:00Z",
	"IDhash": "c3bf60",
	"Household": "House7",
	"Space": "Space121",
	"Room_Type": "Bathroom",
	"timestamp": "2015-03-13T07:30:00Z",
	"Air_humidity": "59",
	"Nominal_temperature": "None",
	"Actual_temperature": "18",
	"Air_temperature": "17.272",
	"Rel_humidity": "63.003",
	"Intensity": "19.7",
	"Brightness": "None",
	"Climate_Air_temperature": "5.622",
	"Climate_Rel_humidity": "95",
	"Climate_Wind_speed": "0.928"
}