{
	"ID": "House6Space1082014-10-11T08:30:00Z",
	"IDhash": "269f9a",
	"Household": "House6",
	"Space": "Space108",
	"Room_Type": "Bathroom",
	"timestamp": "2014-10-11T08:30:00Z",
	"Air_humidity": "73",
	"Nominal_temperature": "None",
	"Actual_temperature": "18",
	"Air_temperature": "19.246",
	"Rel_humidity": "73.24",
	"Intensity": "19.7",
	"Brightness": "None",
	"Climate_Air_temperature": "8.77",
	"Climate_Rel_humidity": "95.7",
	"Climate_Wind_speed": "0.729"
}