{
	"ID": "House13Space2092015-03-29T12:30:00Z",
	"IDhash": "2184c1",
	"Household": "House13",
	"Space": "Space209",
	"Room_Type": "Ensuite",
	"timestamp": "2015-03-29T12:30:00Z",
	"Air_humidity": "46",
	"Nominal_temperature": "None",
	"Actual_temperature": "24",
	"Air_temperature": "22.537",
	"Rel_humidity": "48.744",
	"Intensity": "3.9",
	"Brightness": "None",
	"Climate_Air_temperature": "12.95",
	"Climate_Rel_humidity": "83.2",
	"Climate_Wind_speed": "6.619"
}