{
	"ID": "House13Space2122015-03-06T06:00:00Z",
	"IDhash": "a1361f",
	"Household": "House13",
	"Space": "Space212",
	"Room_Type": "Bathroom",
	"timestamp": "2015-03-06T06:00:00Z",
	"Air_humidity": "39",
	"Nominal_temperature": "None",
	"Actual_temperature": "22",
	"Air_temperature": "23.617",
	"Rel_humidity": "39.549",
	"Intensity": "19.7",
	"Brightness": "None",
	"Climate_Air_temperature": "6.792",
	"Climate_Rel_humidity": "76.56",
	"Climate_Wind_speed": "0.878"
}