{
	"ID": "House18Space2862015-03-25T13:00:00Z",
	"IDhash": "3a7854",
	"Household": "House18",
	"Space": "Space286",
	"Room_Type": "Kitchen",
	"timestamp": "2015-03-25T13:00:00Z",
	"Air_humidity": "45",
	"Nominal_temperature": "None",
	"Actual_temperature": "19.5",
	"Air_temperature": "20.555",
	"Rel_humidity": "45.281",
	"Intensity": "27.6",
	"Brightness": "None",
	"Climate_Air_temperature": "7.883",
	"Climate_Rel_humidity": "58.35",
	"Climate_Wind_speed": "0.954"
}