{
	"ID": "House16Space2532014-10-11T19:00:00Z",
	"IDhash": "69d188",
	"Household": "House16",
	"Space": "Space253",
	"Room_Type": "Living room",
	"timestamp": "2014-10-11T19:00:00Z",
	"Air_humidity": "72",
	"Nominal_temperature": "None",
	"Actual_temperature": "18",
	"Air_temperature": "18.271",
	"Rel_humidity": "74.484",
	"Intensity": "11.8",
	"Brightness": "None",
	"Climate_Air_temperature": "9.88",
	"Climate_Rel_humidity": "90.6",
	"Climate_Wind_speed": "0.225"
}