{
	"ID": "House13Space2002015-04-23T08:00:00Z",
	"IDhash": "1bf21b",
	"Household": "House13",
	"Space": "Space200",
	"Room_Type": "Kitchen",
	"timestamp": "2015-04-23T08:00:00Z",
	"Air_humidity": "41",
	"Nominal_temperature": "None",
	"Actual_temperature": "21",
	"Air_temperature": "21.079",
	"Rel_humidity": "45.025",
	"Intensity": "11.8",
	"Brightness": "None",
	"Climate_Air_temperature": "7.951",
	"Climate_Rel_humidity": "88.2",
	"Climate_Wind_speed": "0.777"
}