{
	"ID": "House12Space1842015-01-16T08:00:00Z",
	"IDhash": "2be00a",
	"Household": "House12",
	"Space": "Space184",
	"Room_Type": "Kitchen",
	"timestamp": "2015-01-16T08:00:00Z",
	"Air_humidity": "None",
	"Nominal_temperature": "None",
	"Actual_temperature": "19",
	"Air_temperature": "18.176",
	"Rel_humidity": "40.198",
	"Intensity": "11.8",
	"Brightness": "21",
	"Climate_Air_temperature": "3.793",
	"Climate_Rel_humidity": "86.1",
	"Climate_Wind_speed": "2.455"
}