{
	"ID": "House18Space2862014-11-28T07:30:00Z",
	"IDhash": "8d220d",
	"Household": "House18",
	"Space": "Space286",
	"Room_Type": "Kitchen",
	"timestamp": "2014-11-28T07:30:00Z",
	"Air_humidity": "None",
	"Nominal_temperature": "None",
	"Actual_temperature": "22.5",
	"Air_temperature": "19.436",
	"Rel_humidity": "58.383",
	"Intensity": "35.5",
	"Brightness": "5",
	"Climate_Air_temperature": "9.91",
	"Climate_Rel_humidity": "96.1",
	"Climate_Wind_speed": "1.573"
}