{
	"ID": "House18Space2862015-02-22T23:00:00Z",
	"IDhash": "9544d8",
	"Household": "House18",
	"Space": "Space286",
	"Room_Type": "Kitchen",
	"timestamp": "2015-02-22T23:00:00Z",
	"Air_humidity": "45",
	"Nominal_temperature": "None",
	"Actual_temperature": "23",
	"Air_temperature": "20.793",
	"Rel_humidity": "50.127",
	"Intensity": "11.8",
	"Brightness": "None",
	"Climate_Air_temperature": "7.963",
	"Climate_Rel_humidity": "85.6",
	"Climate_Wind_speed": "3.391"
}