{
	"ID": "House7Space1142015-03-20T10:00:00Z",
	"IDhash": "efb591",
	"Household": "House7",
	"Space": "Space114",
	"Room_Type": "Kitchen",
	"timestamp": "2015-03-20T10:00:00Z",
	"Air_humidity": "42",
	"Nominal_temperature": "None",
	"Actual_temperature": "19",
	"Air_temperature": "18.01",
	"Rel_humidity": "45.828",
	"Intensity": "122.2",
	"Brightness": "None",
	"Climate_Air_temperature": "7.061",
	"Climate_Rel_humidity": "81.1",
	"Climate_Wind_speed": "0.396"
}