{
	"ID": "House18Space2862015-01-24T21:30:00Z",
	"IDhash": "ab88ba",
	"Household": "House18",
	"Space": "Space286",
	"Room_Type": "Kitchen",
	"timestamp": "2015-01-24T21:30:00Z",
	"Air_humidity": "46",
	"Nominal_temperature": "None",
	"Actual_temperature": "None",
	"Air_temperature": "21.533",
	"Rel_humidity": "48.709",
	"Intensity": "11.8",
	"Brightness": "9",
	"Climate_Air_temperature": "3.995",
	"Climate_Rel_humidity": "78.66",
	"Climate_Wind_speed": "1.323"
}