{
	"ID": "House19Space3072014-11-07T20:00:00Z",
	"IDhash": "b07533",
	"Household": "House19",
	"Space": "Space307",
	"Room_Type": "Bathroom",
	"timestamp": "2014-11-07T20:00:00Z",
	"Air_humidity": "56",
	"Nominal_temperature": "None",
	"Actual_temperature": "20",
	"Air_temperature": "20.126",
	"Rel_humidity": "55.576",
	"Intensity": "11.8",
	"Brightness": "None",
	"Climate_Air_temperature": "7.285",
	"Climate_Rel_humidity": "92.2",
	"Climate_Wind_speed": "1.496"
}