{
	"ID": "House13Space2092015-03-16T10:00:00Z",
	"IDhash": "b0d3f3",
	"Household": "House13",
	"Space": "Space209",
	"Room_Type": "Ensuite",
	"timestamp": "2015-03-16T10:00:00Z",
	"Air_humidity": "40",
	"Nominal_temperature": "None",
	"Actual_temperature": "24.5",
	"Air_temperature": "22.298",
	"Rel_humidity": "46.676",
	"Intensity": "3.9",
	"Brightness": "None",
	"Climate_Air_temperature": "6.489",
	"Climate_Rel_humidity": "85",
	"Climate_Wind_speed": "1.878"
}