{
	"ID": "House18Space2842014-12-23T16:00:00Z",
	"IDhash": "310617",
	"Household": "House18",
	"Space": "Space284",
	"Room_Type": "Living room",
	"timestamp": "2014-12-23T16:00:00Z",
	"Air_humidity": "54",
	"Nominal_temperature": "18",
	"Actual_temperature": "None",
	"Air_temperature": "19.175",
	"Rel_humidity": "54.11",
	"Intensity": "11.8",
	"Brightness": "35",
	"Climate_Air_temperature": "11.18",
	"Climate_Rel_humidity": "88.3",
	"Climate_Wind_speed": "2.826"
}