{
	"ID": "House15Space2462014-12-09T06:30:00Z",
	"IDhash": "f1e58b",
	"Household": "House15",
	"Space": "Space246",
	"Room_Type": "Bedroom",
	"timestamp": "2014-12-09T06:30:00Z",
	"Air_humidity": "53",
	"Nominal_temperature": "None",
	"Actual_temperature": "23",
	"Air_temperature": "20.96",
	"Rel_humidity": "54.585",
	"Intensity": "11.8",
	"Brightness": "None",
	"Climate_Air_temperature": "2.102",
	"Climate_Rel_humidity": "89.9",
	"Climate_Wind_speed": "0.539"
}