{
	"ID": "House16Space2532015-04-12T10:00:00Z",
	"IDhash": "3bd22f",
	"Household": "House16",
	"Space": "Space253",
	"Room_Type": "Living room",
	"timestamp": "2015-04-12T10:00:00Z",
	"Air_humidity": "46",
	"Nominal_temperature": "None",
	"Actual_temperature": "None",
	"Air_temperature": "20.269",
	"Rel_humidity": "43.648",
	"Intensity": "43.4",
	"Brightness": "72",
	"Climate_Air_temperature": "11.57",
	"Climate_Rel_humidity": "62.38",
	"Climate_Wind_speed": "3.088"
}