{
	"ID": "House4Space622015-03-16T08:00:00Z",
	"IDhash": "69cdae",
	"Household": "House4",
	"Space": "Space62",
	"Room_Type": "Bedroom",
	"timestamp": "2015-03-16T08:00:00Z",
	"Air_humidity": "44",
	"Nominal_temperature": "None",
	"Actual_temperature": "17.5",
	"Air_temperature": "17.629",
	"Rel_humidity": "44.102",
	"Intensity": "59.1",
	"Brightness": "None",
	"Climate_Air_temperature": "5.228",
	"Climate_Rel_humidity": "92.2",
	"Climate_Wind_speed": "1.794"
}