{
	"ID": "House4Space452015-02-11T19:30:00Z",
	"IDhash": "823ec0",
	"Household": "House4",
	"Space": "Space45",
	"Room_Type": "Living room",
	"timestamp": "2015-02-11T19:30:00Z",
	"Air_humidity": "44",
	"Nominal_temperature": "None",
	"Actual_temperature": "22",
	"Air_temperature": "22.753",
	"Rel_humidity": "41.933",
	"Intensity": "11.8",
	"Brightness": "None",
	"Climate_Air_temperature": "3.912",
	"Climate_Rel_humidity": "85.9",
	"Climate_Wind_speed": "0.26"
}