{
	"ID": "House16Space2532015-04-08T08:00:00Z",
	"IDhash": "739b7d",
	"Household": "House16",
	"Space": "Space253",
	"Room_Type": "Living room",
	"timestamp": "2015-04-08T08:00:00Z",
	"Air_humidity": "50",
	"Nominal_temperature": "None",
	"Actual_temperature": "21.5",
	"Air_temperature": "22.058",
	"Rel_humidity": "45.014",
	"Intensity": "11.8",
	"Brightness": "None",
	"Climate_Air_temperature": "8.05",
	"Climate_Rel_humidity": "85",
	"Climate_Wind_speed": "1.733"
}