{
	"ID": "House16Space2602014-09-26T18:00:00Z",
	"IDhash": "e38ac2",
	"Household": "House16",
	"Space": "Space260",
	"Room_Type": "Bedroom",
	"timestamp": "2014-09-26T18:00:00Z",
	"Air_humidity": "64",
	"Nominal_temperature": "11",
	"Actual_temperature": "None",
	"Air_temperature": "23.064",
	"Rel_humidity": "72.523",
	"Intensity": "11.8",
	"Brightness": "None",
	"Climate_Air_temperature": "16.46",
	"Climate_Rel_humidity": "71.48",
	"Climate_Wind_speed": "0.894"
}