{
	"ID": "House13Space2122014-12-12T15:30:00Z",
	"IDhash": "0175c7",
	"Household": "House13",
	"Space": "Space212",
	"Room_Type": "Bathroom",
	"timestamp": "2014-12-12T15:30:00Z",
	"Air_humidity": "47",
	"Nominal_temperature": "None",
	"Actual_temperature": "18.5",
	"Air_temperature": "18.247",
	"Rel_humidity": "48.096",
	"Intensity": "19.7",
	"Brightness": "None",
	"Climate_Air_temperature": "3.716",
	"Climate_Rel_humidity": "81.9",
	"Climate_Wind_speed": "1.903"
}