{
	"ID": "House10Space1572014-12-25T22:00:00Z",
	"IDhash": "8caccc",
	"Household": "House10",
	"Space": "Space157",
	"Room_Type": "Living room",
	"timestamp": "2014-12-25T22:00:00Z",
	"Air_humidity": "48",
	"Nominal_temperature": "15",
	"Actual_temperature": "None",
	"Air_temperature": "18.129",
	"Rel_humidity": "50.677",
	"Intensity": "11.8",
	"Brightness": "None",
	"Climate_Air_temperature": "4.041",
	"Climate_Rel_humidity": "90.8",
	"Climate_Wind_speed": "1.279"
}