{
	"ID": "House13Space2092015-04-04T08:00:00Z",
	"IDhash": "029edc",
	"Household": "House13",
	"Space": "Space209",
	"Room_Type": "Ensuite",
	"timestamp": "2015-04-04T08:00:00Z",
	"Air_humidity": "45",
	"Nominal_temperature": "6",
	"Actual_temperature": "None",
	"Air_temperature": "22.417",
	"Rel_humidity": "53.266",
	"Intensity": "3.9",
	"Brightness": "None",
	"Climate_Air_temperature": "7.81",
	"Climate_Rel_humidity": "84.4",
	"Climate_Wind_speed": "1.329"
}