{
	"ID": "House18Space2862015-02-23T07:00:00Z",
	"IDhash": "652428",
	"Household": "House18",
	"Space": "Space286",
	"Room_Type": "Kitchen",
	"timestamp": "2015-02-23T07:00:00Z",
	"Air_humidity": "47",
	"Nominal_temperature": "None",
	"Actual_temperature": "18.5",
	"Air_temperature": "18.105",
	"Rel_humidity": "42.373",
	"Intensity": "11.8",
	"Brightness": "None",
	"Climate_Air_temperature": "2.921",
	"Climate_Rel_humidity": "82.5",
	"Climate_Wind_speed": "1.534"
}