{
	"ID": "House4Space492015-01-21T08:00:00Z",
	"IDhash": "492f32",
	"Household": "House4",
	"Space": "Space49",
	"Room_Type": "Kitchen",
	"timestamp": "2015-01-21T08:00:00Z",
	"Air_humidity": "49",
	"Nominal_temperature": "None",
	"Actual_temperature": "15.5",
	"Air_temperature": "18.604",
	"Rel_humidity": "41.564",
	"Intensity": "11.8",
	"Brightness": "None",
	"Climate_Air_temperature": "2.302",
	"Climate_Rel_humidity": "91.9",
	"Climate_Wind_speed": "1.772"
}