{
	"ID": "House6Space932015-01-05T17:00:00Z",
	"IDhash": "065544",
	"Household": "House6",
	"Space": "Space93",
	"Room_Type": "Living room",
	"timestamp": "2015-01-05T17:00:00Z",
	"Air_humidity": "None",
	"Nominal_temperature": "17",
	"Actual_temperature": "None",
	"Air_temperature": "17.153",
	"Rel_humidity": "49.143",
	"Intensity": "11.8",
	"Brightness": "24",
	"Climate_Air_temperature": "8.44",
	"Climate_Rel_humidity": "83.1",
	"Climate_Wind_speed": "0.559"
}