{
	"ID": "House18Space2862014-11-21T20:00:00Z",
	"IDhash": "a6fc59",
	"Household": "House18",
	"Space": "Space286",
	"Room_Type": "Kitchen",
	"timestamp": "2014-11-21T20:00:00Z",
	"Air_humidity": "None",
	"Nominal_temperature": "17",
	"Actual_temperature": "22.5",
	"Air_temperature": "21.413",
	"Rel_humidity": "56.846",
	"Intensity": "11.8",
	"Brightness": "None",
	"Climate_Air_temperature": "7.722",
	"Climate_Rel_humidity": "95.9",
	"Climate_Wind_speed": "1.409"
}