{
	"ID": "House14Space2182015-01-12T16:30:00Z",
	"IDhash": "f8b8b9",
	"Household": "House14",
	"Space": "Space218",
	"Room_Type": "Living room",
	"timestamp": "2015-01-12T16:30:00Z",
	"Air_humidity": "None",
	"Nominal_temperature": "None",
	"Actual_temperature": "16",
	"Air_temperature": "16.987",
	"Rel_humidity": "48.403",
	"Intensity": "11.8",
	"Brightness": "28",
	"Climate_Air_temperature": "7.535",
	"Climate_Rel_humidity": "87.9",
	"Climate_Wind_speed": "1.688"
}