{
	"ID": "House3Space342014-12-17T18:30:00Z",
	"IDhash": "facc92",
	"Household": "House3",
	"Space": "Space34",
	"Room_Type": "Living room",
	"timestamp": "2014-12-17T18:30:00Z",
	"Air_humidity": "61",
	"Nominal_temperature": "None",
	"Actual_temperature": "19.5",
	"Air_temperature": "19.912",
	"Rel_humidity": "62.246",
	"Intensity": "None",
	"Brightness": "25",
	"Climate_Air_temperature": "11.35",
	"Climate_Rel_humidity": "94.2",
	"Climate_Wind_speed": "1.785"
}