{
	"ID": "House10Space1612015-02-14T07:30:00Z",
	"IDhash": "04e4dc",
	"Household": "House10",
	"Space": "Space161",
	"Room_Type": "Bathroom",
	"timestamp": "2015-02-14T07:30:00Z",
	"Air_humidity": "None",
	"Nominal_temperature": "18",
	"Actual_temperature": "21",
	"Air_temperature": "19.77",
	"Rel_humidity": "38.166",
	"Intensity": "19.7",
	"Brightness": "None",
	"Climate_Air_temperature": "6.419",
	"Climate_Rel_humidity": "93.9",
	"Climate_Wind_speed": "1.671"
}