{
	"ID": "House12Space1842015-03-04T16:30:00Z",
	"IDhash": "4bac18",
	"Household": "House12",
	"Space": "Space184",
	"Room_Type": "Kitchen",
	"timestamp": "2015-03-04T16:30:00Z",
	"Air_humidity": "46",
	"Nominal_temperature": "None",
	"Actual_temperature": "16",
	"Air_temperature": "20.412",
	"Rel_humidity": "38.037",
	"Intensity": "11.8",
	"Brightness": "None",
	"Climate_Air_temperature": "7.981",
	"Climate_Rel_humidity": "66.65",
	"Climate_Wind_speed": "3.324"
}