{
	"ID": "House6Space962015-03-07T21:15:00Z",
	"IDhash": "d00efc",
	"Household": "House6",
	"Space": "Space96",
	"Room_Type": "Kitchen",
	"timestamp": "2015-03-07T21:15:00Z",
	"Air_humidity": "49",
	"Nominal_temperature": "None",
	"Actual_temperature": "18",
	"Air_temperature": "21.581",
	"Rel_humidity": "47.319",
	"Intensity": "11.8",
	"Brightness": "None",
	"Climate_Air_temperature": "9.54",
	"Climate_Rel_humidity": "83.8",
	"Climate_Wind_speed": "1.478"
}