{
	"ID": "House18Space2842014-12-06T16:00:00Z",
	"IDhash": "a57a4e",
	"Household": "House18",
	"Space": "Space284",
	"Room_Type": "Living room",
	"timestamp": "2014-12-06T16:00:00Z",
	"Air_humidity": "None",
	"Nominal_temperature": "19",
	"Actual_temperature": "20",
	"Air_temperature": "20.103",
	"Rel_humidity": "51.132",
	"Intensity": "11.8",
	"Brightness": "None",
	"Climate_Air_temperature": "6.172",
	"Climate_Rel_humidity": "82.2",
	"Climate_Wind_speed": "1.015"
}