{
	"ID": "House13Space2122015-03-04T23:00:00Z",
	"IDhash": "d7dfab",
	"Household": "House13",
	"Space": "Space212",
	"Room_Type": "Bathroom",
	"timestamp": "2015-03-04T23:00:00Z",
	"Air_humidity": "33",
	"Nominal_temperature": "None",
	"Actual_temperature": "24",
	"Air_temperature": "24.195",
	"Rel_humidity": "35.916",
	"Intensity": "19.7",
	"Brightness": "None",
	"Climate_Air_temperature": "4.224",
	"Climate_Rel_humidity": "77.05",
	"Climate_Wind_speed": "1.339"
}