{
	"ID": "House10Space1572015-02-05T12:30:00Z",
	"IDhash": "49749b",
	"Household": "House10",
	"Space": "Space157",
	"Room_Type": "Living room",
	"timestamp": "2015-02-05T12:30:00Z",
	"Air_humidity": "None",
	"Nominal_temperature": "None",
	"Actual_temperature": "16.5",
	"Air_temperature": "15.676",
	"Rel_humidity": "41.618",
	"Intensity": "11.8",
	"Brightness": "53",
	"Climate_Air_temperature": "3.155",
	"Climate_Rel_humidity": "91.6",
	"Climate_Wind_speed": "0.753"
}