{
	"ID": "House6Space1082014-11-02T08:30:00Z",
	"IDhash": "e76284",
	"Household": "House6",
	"Space": "Space108",
	"Room_Type": "Bathroom",
	"timestamp": "2014-11-02T08:30:00Z",
	"Air_humidity": "71",
	"Nominal_temperature": "None",
	"Actual_temperature": "22",
	"Air_temperature": "19.674",
	"Rel_humidity": "74.419",
	"Intensity": "11.8",
	"Brightness": "None",
	"Climate_Air_temperature": "12.92",
	"Climate_Rel_humidity": "93.9",
	"Climate_Wind_speed": "1.737"
}