{
	"ID": "House5Space922014-12-02T06:30:00Z",
	"IDhash": "573e54",
	"Household": "House5",
	"Space": "Space92",
	"Room_Type": "Bathroom",
	"timestamp": "2014-12-02T06:30:00Z",
	"Air_humidity": "56",
	"Nominal_temperature": "15",
	"Actual_temperature": "24",
	"Air_temperature": "21.963",
	"Rel_humidity": "84.196",
	"Intensity": "None",
	"Brightness": "None",
	"Climate_Air_temperature": "7.842",
	"Climate_Rel_humidity": "83.6",
	"Climate_Wind_speed": "2.75"
}