{
	"ID": "House18Space2862015-01-26T07:00:00Z",
	"IDhash": "26c68f",
	"Household": "House18",
	"Space": "Space286",
	"Room_Type": "Kitchen",
	"timestamp": "2015-01-26T07:00:00Z",
	"Air_humidity": "58",
	"Nominal_temperature": "None",
	"Actual_temperature": "20",
	"Air_temperature": "18.842",
	"Rel_humidity": "53.754",
	"Intensity": "35.5",
	"Brightness": "None",
	"Climate_Air_temperature": "8.73",
	"Climate_Rel_humidity": "93",
	"Climate_Wind_speed": "2.075"
}