{
	"ID": "House13Space2092015-01-18T13:00:00Z",
	"IDhash": "10d4f9",
	"Household": "House13",
	"Space": "Space209",
	"Room_Type": "Ensuite",
	"timestamp": "2015-01-18T13:00:00Z",
	"Air_humidity": "40",
	"Nominal_temperature": "None",
	"Actual_temperature": "22",
	"Air_temperature": "21.795",
	"Rel_humidity": "45.495",
	"Intensity": "3.9",
	"Brightness": "None",
	"Climate_Air_temperature": "3.985",
	"Climate_Rel_humidity": "75.29",
	"Climate_Wind_speed": "1.718"
}