{
	"ID": "House6Space932015-04-08T19:30:00Z",
	"IDhash": "f71f0d",
	"Household": "House6",
	"Space": "Space93",
	"Room_Type": "Living room",
	"timestamp": "2015-04-08T19:30:00Z",
	"Air_humidity": "None",
	"Nominal_temperature": "20.5",
	"Actual_temperature": "21",
	"Air_temperature": "21.604",
	"Rel_humidity": "51.681",
	"Intensity": "11.8",
	"Brightness": "None",
	"Climate_Air_temperature": "11.68",
	"Climate_Rel_humidity": "76.57",
	"Climate_Wind_speed": "1.234"
}