{
	"ID": "House13Space2092015-02-17T08:00:00Z",
	"IDhash": "da1b52",
	"Household": "House13",
	"Space": "Space209",
	"Room_Type": "Ensuite",
	"timestamp": "2015-02-17T08:00:00Z",
	"Air_humidity": "None",
	"Nominal_temperature": "6",
	"Actual_temperature": "22.5",
	"Air_temperature": "22.609",
	"Rel_humidity": "45.497",
	"Intensity": "3.9",
	"Brightness": "None",
	"Climate_Air_temperature": "1.86",
	"Climate_Rel_humidity": "90",
	"Climate_Wind_speed": "1.504"
}