{
	"ID": "House13Space2122014-11-26T19:30:00Z",
	"IDhash": "7a728f",
	"Household": "House13",
	"Space": "Space212",
	"Room_Type": "Bathroom",
	"timestamp": "2014-11-26T19:30:00Z",
	"Air_humidity": "45",
	"Nominal_temperature": "6",
	"Actual_temperature": "27.5",
	"Air_temperature": "26.451",
	"Rel_humidity": "51.486",
	"Intensity": "19.7",
	"Brightness": "None",
	"Climate_Air_temperature": "7.461",
	"Climate_Rel_humidity": "97.6",
	"Climate_Wind_speed": "0.611"
}