{
	"ID": "House13Space2092015-03-24T21:30:00Z",
	"IDhash": "c46ee8",
	"Household": "House13",
	"Space": "Space209",
	"Room_Type": "Ensuite",
	"timestamp": "2015-03-24T21:30:00Z",
	"Air_humidity": "38",
	"Nominal_temperature": "None",
	"Actual_temperature": "23.5",
	"Air_temperature": "21.867",
	"Rel_humidity": "43.803",
	"Intensity": "3.9",
	"Brightness": "None",
	"Climate_Air_temperature": "4.035",
	"Climate_Rel_humidity": "80.2",
	"Climate_Wind_speed": "1.225"
}