{
	"ID": "House13Space2092015-02-04T08:00:00Z",
	"IDhash": "134d86",
	"Household": "House13",
	"Space": "Space209",
	"Room_Type": "Ensuite",
	"timestamp": "2015-02-04T08:00:00Z",
	"Air_humidity": "36",
	"Nominal_temperature": "6",
	"Actual_temperature": "None",
	"Air_temperature": "22.298",
	"Rel_humidity": "40.355",
	"Intensity": "3.9",
	"Brightness": "None",
	"Climate_Air_temperature": "-0.028",
	"Climate_Rel_humidity": "88.4",
	"Climate_Wind_speed": "1.032"
}