{
	"ID": "House12Space1842014-11-02T16:00:00Z",
	"IDhash": "9fca8e",
	"Household": "House12",
	"Space": "Space184",
	"Room_Type": "Kitchen",
	"timestamp": "2014-11-02T16:00:00Z",
	"Air_humidity": "None",
	"Nominal_temperature": "15.5",
	"Actual_temperature": "16.5",
	"Air_temperature": "17.605",
	"Rel_humidity": "59.612",
	"Intensity": "11.8",
	"Brightness": "None",
	"Climate_Air_temperature": "12.65",
	"Climate_Rel_humidity": "83.7",
	"Climate_Wind_speed": "0.461"
}