{
	"ID": "House12Space1842014-12-23T13:30:00Z",
	"IDhash": "142a38",
	"Household": "House12",
	"Space": "Space184",
	"Room_Type": "Kitchen",
	"timestamp": "2014-12-23T13:30:00Z",
	"Air_humidity": "59",
	"Nominal_temperature": "None",
	"Actual_temperature": "None",
	"Air_temperature": "20.65",
	"Rel_humidity": "48.974",
	"Intensity": "11.8",
	"Brightness": "58",
	"Climate_Air_temperature": "11.96",
	"Climate_Rel_humidity": "80.4",
	"Climate_Wind_speed": "2.961"
}