{
	"ID": "House6Space962015-02-25T22:30:00Z",
	"IDhash": "2df901",
	"Household": "House6",
	"Space": "Space96",
	"Room_Type": "Kitchen",
	"timestamp": "2015-02-25T22:30:00Z",
	"Air_humidity": "47",
	"Nominal_temperature": "None",
	"Actual_temperature": "18",
	"Air_temperature": "18.794",
	"Rel_humidity": "48.261",
	"Intensity": "11.8",
	"Brightness": "None",
	"Climate_Air_temperature": "9.6",
	"Climate_Rel_humidity": "92.5",
	"Climate_Wind_speed": "0.916"
}