{
	"ID": "House18Space2842014-12-04T13:30:00Z",
	"IDhash": "9355fa",
	"Household": "House18",
	"Space": "Space284",
	"Room_Type": "Living room",
	"timestamp": "2014-12-04T13:30:00Z",
	"Air_humidity": "50",
	"Nominal_temperature": "None",
	"Actual_temperature": "19",
	"Air_temperature": "19.532",
	"Rel_humidity": "47.125",
	"Intensity": "11.8",
	"Brightness": "45",
	"Climate_Air_temperature": "5.131",
	"Climate_Rel_humidity": "83",
	"Climate_Wind_speed": "1.235"
}