{
	"ID": "House6Space1042015-02-28T14:00:00Z",
	"IDhash": "bded22",
	"Household": "House6",
	"Space": "Space104",
	"Room_Type": "Bathroom",
	"timestamp": "2015-02-28T14:00:00Z",
	"Air_humidity": "50",
	"Nominal_temperature": "None",
	"Actual_temperature": "18",
	"Air_temperature": "20.889",
	"Rel_humidity": "42.885",
	"Intensity": "201",
	"Brightness": "None",
	"Climate_Air_temperature": "11.62",
	"Climate_Rel_humidity": "73.18",
	"Climate_Wind_speed": "2.209"
}