{
	"ID": "House13Space2092015-03-08T17:00:00Z",
	"IDhash": "878977",
	"Household": "House13",
	"Space": "Space209",
	"Room_Type": "Ensuite",
	"timestamp": "2015-03-08T17:00:00Z",
	"Air_humidity": "44",
	"Nominal_temperature": "None",
	"Actual_temperature": "23.5",
	"Air_temperature": "22.274",
	"Rel_humidity": "47.789",
	"Intensity": "3.9",
	"Brightness": "None",
	"Climate_Air_temperature": "8.88",
	"Climate_Rel_humidity": "69.25",
	"Climate_Wind_speed": "2.874"
}