{
	"ID": "House18Space2862015-04-03T19:30:00Z",
	"IDhash": "4db50c",
	"Household": "House18",
	"Space": "Space286",
	"Room_Type": "Kitchen",
	"timestamp": "2015-04-03T19:30:00Z",
	"Air_humidity": "49",
	"Nominal_temperature": "None",
	"Actual_temperature": "24",
	"Air_temperature": "23.785",
	"Rel_humidity": "57.977",
	"Intensity": "11.8",
	"Brightness": "None",
	"Climate_Air_temperature": "10.46",
	"Climate_Rel_humidity": "96.1",
	"Climate_Wind_speed": "0.762"
}