{
	"ID": "House6Space1082015-01-02T10:30:00Z",
	"IDhash": "eec44e",
	"Household": "House6",
	"Space": "Space108",
	"Room_Type": "Bathroom",
	"timestamp": "2015-01-02T10:30:00Z",
	"Air_humidity": "66",
	"Nominal_temperature": "11",
	"Actual_temperature": "None",
	"Air_temperature": "19.936",
	"Rel_humidity": "74.701",
	"Intensity": "11.8",
	"Brightness": "None",
	"Climate_Air_temperature": "6.737",
	"Climate_Rel_humidity": "65.2",
	"Climate_Wind_speed": "3.944"
}