{
	"ID": "House19Space3042014-09-21T21:00:00Z",
	"IDhash": "072797",
	"Household": "House19",
	"Space": "Space304",
	"Room_Type": "Living room",
	"timestamp": "2014-09-21T21:00:00Z",
	"Air_humidity": "65",
	"Nominal_temperature": "None",
	"Actual_temperature": "21.5",
	"Air_temperature": "22.968",
	"Rel_humidity": "60.984",
	"Intensity": "19.7",
	"Brightness": "None",
	"Climate_Air_temperature": "9.43",
	"Climate_Rel_humidity": "89.4",
	"Climate_Wind_speed": "0.197"
}