{
	"ID": "House6Space932015-03-24T19:30:00Z",
	"IDhash": "3298d7",
	"Household": "House6",
	"Space": "Space93",
	"Room_Type": "Living room",
	"timestamp": "2015-03-24T19:30:00Z",
	"Air_humidity": "45",
	"Nominal_temperature": "None",
	"Actual_temperature": "19.5",
	"Air_temperature": "21.843",
	"Rel_humidity": "41.96",
	"Intensity": "11.8",
	"Brightness": "None",
	"Climate_Air_temperature": "5.331",
	"Climate_Rel_humidity": "75.13",
	"Climate_Wind_speed": "0.639"
}