{
	"ID": "House18Space2862015-03-16T23:30:00Z",
	"IDhash": "a884a9",
	"Household": "House18",
	"Space": "Space286",
	"Room_Type": "Kitchen",
	"timestamp": "2015-03-16T23:30:00Z",
	"Air_humidity": "None",
	"Nominal_temperature": "None",
	"Actual_temperature": "22",
	"Air_temperature": "21.056",
	"Rel_humidity": "46.49",
	"Intensity": "11.8",
	"Brightness": "3",
	"Climate_Air_temperature": "4.457",
	"Climate_Rel_humidity": "90",
	"Climate_Wind_speed": "0.645"
}