{
	"ID": "House17Space2732014-08-18T11:00:00Z",
	"IDhash": "ae30e2",
	"Household": "House17",
	"Space": "Space273",
	"Room_Type": "Kitchen",
	"timestamp": "2014-08-18T11:00:00Z",
	"Air_humidity": "None",
	"Nominal_temperature": "None",
	"Actual_temperature": "57",
	"Air_temperature": "19.984",
	"Rel_humidity": "55.123",
	"Intensity": "11.8",
	"Brightness": "65",
	"Climate_Air_temperature": "18.22",
	"Climate_Rel_humidity": "56.92",
	"Climate_Wind_speed": "1.948"
}