{
	"ID": "House3Space342014-12-29T16:00:00Z",
	"IDhash": "8a85e6",
	"Household": "House3",
	"Space": "Space34",
	"Room_Type": "Living room",
	"timestamp": "2014-12-29T16:00:00Z",
	"Air_humidity": "57",
	"Nominal_temperature": "19",
	"Actual_temperature": "16.5",
	"Air_temperature": "18.628",
	"Rel_humidity": "56.244",
	"Intensity": "None",
	"Brightness": "None",
	"Climate_Air_temperature": "2.984",
	"Climate_Rel_humidity": "88.9",
	"Climate_Wind_speed": "1.026"
}