{
	"ID": "House4Space452015-03-03T13:00:00Z",
	"IDhash": "c294cc",
	"Household": "House4",
	"Space": "Space45",
	"Room_Type": "Living room",
	"timestamp": "2015-03-03T13:00:00Z",
	"Air_humidity": "42",
	"Nominal_temperature": "None",
	"Actual_temperature": "18.5",
	"Air_temperature": "19.365",
	"Rel_humidity": "38.254",
	"Intensity": "35.5",
	"Brightness": "None",
	"Climate_Air_temperature": "7.844",
	"Climate_Rel_humidity": "50.61",
	"Climate_Wind_speed": "4.032"
}