{
	"ID": "House6Space1082014-10-21T21:30:00Z",
	"IDhash": "c9b976",
	"Household": "House6",
	"Space": "Space108",
	"Room_Type": "Bathroom",
	"timestamp": "2014-10-21T21:30:00Z",
	"Air_humidity": "68",
	"Nominal_temperature": "None",
	"Actual_temperature": "20.5",
	"Air_temperature": "18.343",
	"Rel_humidity": "69.849",
	"Intensity": "11.8",
	"Brightness": "None",
	"Climate_Air_temperature": "7.296",
	"Climate_Rel_humidity": "77.45",
	"Climate_Wind_speed": "3.51"
}