{
	"ID": "House14Space2232015-02-13T06:00:00Z",
	"IDhash": "170ebd",
	"Household": "House14",
	"Space": "Space223",
	"Room_Type": "Bedroom",
	"timestamp": "2015-02-13T06:00:00Z",
	"Air_humidity": "None",
	"Nominal_temperature": "21",
	"Actual_temperature": "14.5",
	"Air_temperature": "16.129",
	"Rel_humidity": "44.682",
	"Intensity": "11.8",
	"Brightness": "None",
	"Climate_Air_temperature": "3.718",
	"Climate_Rel_humidity": "90.9",
	"Climate_Wind_speed": "1.699"
}