{
	"ID": "House4Space492014-12-07T18:00:00Z",
	"IDhash": "f90540",
	"Household": "House4",
	"Space": "Space49",
	"Room_Type": "Kitchen",
	"timestamp": "2014-12-07T18:00:00Z",
	"Air_humidity": "45",
	"Nominal_temperature": "None",
	"Actual_temperature": "20.5",
	"Air_temperature": "21.557",
	"Rel_humidity": "44.473",
	"Intensity": "11.8",
	"Brightness": "None",
	"Climate_Air_temperature": "4.693",
	"Climate_Rel_humidity": "72.39",
	"Climate_Wind_speed": "2.802"
}