{
	"ID": "House12Space1842014-12-07T23:00:00Z",
	"IDhash": "a0bbc2",
	"Household": "House12",
	"Space": "Space184",
	"Room_Type": "Kitchen",
	"timestamp": "2014-12-07T23:00:00Z",
	"Air_humidity": "50",
	"Nominal_temperature": "None",
	"Actual_temperature": "15.5",
	"Air_temperature": "18.818",
	"Rel_humidity": "47.287",
	"Intensity": "11.8",
	"Brightness": "None",
	"Climate_Air_temperature": "3.256",
	"Climate_Rel_humidity": "82.1",
	"Climate_Wind_speed": "1.77"
}