{
	"ID": "House17Space2732014-10-21T08:30:00Z",
	"IDhash": "93aa99",
	"Household": "House17",
	"Space": "Space273",
	"Room_Type": "Kitchen",
	"timestamp": "2014-10-21T08:30:00Z",
	"Air_humidity": "None",
	"Nominal_temperature": "None",
	"Actual_temperature": "58",
	"Air_temperature": "23.569",
	"Rel_humidity": "51.445",
	"Intensity": "11.8",
	"Brightness": "61",
	"Climate_Air_temperature": "10.92",
	"Climate_Rel_humidity": "74",
	"Climate_Wind_speed": "3.903"
}