{
	"ID": "House6Space932014-12-15T13:00:00Z",
	"IDhash": "1dcd67",
	"Household": "House6",
	"Space": "Space93",
	"Room_Type": "Living room",
	"timestamp": "2014-12-15T13:00:00Z",
	"Air_humidity": "None",
	"Nominal_temperature": "14",
	"Actual_temperature": "None",
	"Air_temperature": "16.296",
	"Rel_humidity": "52.744",
	"Intensity": "19.7",
	"Brightness": "59",
	"Climate_Air_temperature": "7.59",
	"Climate_Rel_humidity": "79.78",
	"Climate_Wind_speed": "2.131"
}