{
	"ID": "House13Space2092015-03-21T14:30:00Z",
	"IDhash": "b3ec5d",
	"Household": "House13",
	"Space": "Space209",
	"Room_Type": "Ensuite",
	"timestamp": "2015-03-21T14:30:00Z",
	"Air_humidity": "43",
	"Nominal_temperature": "None",
	"Actual_temperature": "21.5",
	"Air_temperature": "21.891",
	"Rel_humidity": "44.77",
	"Intensity": "19.7",
	"Brightness": "None",
	"Climate_Air_temperature": "8.17",
	"Climate_Rel_humidity": "63.75",
	"Climate_Wind_speed": "2.377"
}