{
	"ID": "House10Space1572014-11-16T16:00:00Z",
	"IDhash": "6183ea",
	"Household": "House10",
	"Space": "Space157",
	"Room_Type": "Living room",
	"timestamp": "2014-11-16T16:00:00Z",
	"Air_humidity": "None",
	"Nominal_temperature": "19",
	"Actual_temperature": "None",
	"Air_temperature": "16.963",
	"Rel_humidity": "66.762",
	"Intensity": "11.8",
	"Brightness": "45",
	"Climate_Air_temperature": "9.74",
	"Climate_Rel_humidity": "92",
	"Climate_Wind_speed": "0.932"
}