{
	"ID": "House18Space2862015-03-06T09:00:00Z",
	"IDhash": "532746",
	"Household": "House18",
	"Space": "Space286",
	"Room_Type": "Kitchen",
	"timestamp": "2015-03-06T09:00:00Z",
	"Air_humidity": "None",
	"Nominal_temperature": "18",
	"Actual_temperature": "None",
	"Air_temperature": "20.698",
	"Rel_humidity": "43.505",
	"Intensity": "19.7",
	"Brightness": "61",
	"Climate_Air_temperature": "7.803",
	"Climate_Rel_humidity": "74.22",
	"Climate_Wind_speed": "1.036"
}