{
	"ID": "House10Space1612015-02-07T09:00:00Z",
	"IDhash": "79f982",
	"Household": "House10",
	"Space": "Space161",
	"Room_Type": "Bathroom",
	"timestamp": "2015-02-07T09:00:00Z",
	"Air_humidity": "45",
	"Nominal_temperature": "None",
	"Actual_temperature": "19.5",
	"Air_temperature": "19.912",
	"Rel_humidity": "36.941",
	"Intensity": "19.7",
	"Brightness": "None",
	"Climate_Air_temperature": "3.044",
	"Climate_Rel_humidity": "89.8",
	"Climate_Wind_speed": "1.097"
}