{
	"ID": "House12Space1842015-01-18T14:00:00Z",
	"IDhash": "34e51b",
	"Household": "House12",
	"Space": "Space184",
	"Room_Type": "Kitchen",
	"timestamp": "2015-01-18T14:00:00Z",
	"Air_humidity": "43",
	"Nominal_temperature": "6",
	"Actual_temperature": "None",
	"Air_temperature": "19.484",
	"Rel_humidity": "38.397",
	"Intensity": "11.8",
	"Brightness": "None",
	"Climate_Air_temperature": "4.633",
	"Climate_Rel_humidity": "74.84",
	"Climate_Wind_speed": "1.702"
}