{
	"ID": "House13Space2122014-11-28T06:00:00Z",
	"IDhash": "fdb92a",
	"Household": "House13",
	"Space": "Space212",
	"Room_Type": "Bathroom",
	"timestamp": "2014-11-28T06:00:00Z",
	"Air_humidity": "51",
	"Nominal_temperature": "None",
	"Actual_temperature": "23",
	"Air_temperature": "22.992",
	"Rel_humidity": "53.222",
	"Intensity": "19.7",
	"Brightness": "None",
	"Climate_Air_temperature": "9.82",
	"Climate_Rel_humidity": "96.7",
	"Climate_Wind_speed": "1.35"
}