{
	"ID": "House18Space2842015-01-05T13:00:00Z",
	"IDhash": "71b748",
	"Household": "House18",
	"Space": "Space284",
	"Room_Type": "Living room",
	"timestamp": "2015-01-05T13:00:00Z",
	"Air_humidity": "50",
	"Nominal_temperature": "None",
	"Actual_temperature": "None",
	"Air_temperature": "19.865",
	"Rel_humidity": "49.249",
	"Intensity": "11.8",
	"Brightness": "62",
	"Climate_Air_temperature": "8.74",
	"Climate_Rel_humidity": "83.7",
	"Climate_Wind_speed": "1.242"
}