{
	"ID": "House11Space1692014-12-12T10:00:00Z",
	"IDhash": "bb5111",
	"Household": "House11",
	"Space": "Space169",
	"Room_Type": "Living room",
	"timestamp": "2014-12-12T10:00:00Z",
	"Air_humidity": [],
	"Nominal_temperature": [],
	"Actual_temperature": [],
	"Air_temperature": [],
	"Rel_humidity": [],
	"Intensity": [],
	"Brightness": [],
	"Climate_Air_temperature": "6.689",
	"Climate_Rel_humidity": "82.4",
	"Climate_Wind_speed": "2.158"
}