{
	"ID": "House13Space2092014-12-15T06:00:00Z",
	"IDhash": "75a543",
	"Household": "House13",
	"Space": "Space209",
	"Room_Type": "Ensuite",
	"timestamp": "2014-12-15T06:00:00Z",
	"Air_humidity": "52",
	"Nominal_temperature": "None",
	"Actual_temperature": "21",
	"Air_temperature": "20.793",
	"Rel_humidity": "51.445",
	"Intensity": "3.9",
	"Brightness": "None",
	"Climate_Air_temperature": "5.564",
	"Climate_Rel_humidity": "86.3",
	"Climate_Wind_speed": "1.871"
}