{
	"ID": "House16Space2602014-09-26T14:30:00Z",
	"IDhash": "56569d",
	"Household": "House16",
	"Space": "Space260",
	"Room_Type": "Bedroom",
	"timestamp": "2014-09-26T14:30:00Z",
	"Air_humidity": "63",
	"Nominal_temperature": "8.5",
	"Actual_temperature": "None",
	"Air_temperature": "21.581",
	"Rel_humidity": "62.853",
	"Intensity": "11.8",
	"Brightness": "None",
	"Climate_Air_temperature": "19.11",
	"Climate_Rel_humidity": "66.24",
	"Climate_Wind_speed": "2.066"
}