{
	"ID": "House18Space2862015-02-05T22:30:00Z",
	"IDhash": "3df2ea",
	"Household": "House18",
	"Space": "Space286",
	"Room_Type": "Kitchen",
	"timestamp": "2015-02-05T22:30:00Z",
	"Air_humidity": "None",
	"Nominal_temperature": "12",
	"Actual_temperature": "18.5",
	"Air_temperature": "19.318",
	"Rel_humidity": "41.258",
	"Intensity": "11.8",
	"Brightness": "None",
	"Climate_Air_temperature": "-0.035",
	"Climate_Rel_humidity": "92.2",
	"Climate_Wind_speed": "1.237"
}