{
	"ID": "House6Space1082015-02-01T09:30:00Z",
	"IDhash": "8deefd",
	"Household": "House6",
	"Space": "Space108",
	"Room_Type": "Bathroom",
	"timestamp": "2015-02-01T09:30:00Z",
	"Air_humidity": "59",
	"Nominal_temperature": "None",
	"Actual_temperature": "15.5",
	"Air_temperature": "17.344",
	"Rel_humidity": "52.707",
	"Intensity": "11.8",
	"Brightness": "None",
	"Climate_Air_temperature": "3.41",
	"Climate_Rel_humidity": "69.01",
	"Climate_Wind_speed": "3.668"
}