{
	"ID": "House4Space492014-10-16T11:30:00Z",
	"IDhash": "03f201",
	"Household": "House4",
	"Space": "Space49",
	"Room_Type": "Kitchen",
	"timestamp": "2014-10-16T11:30:00Z",
	"Air_humidity": "68",
	"Nominal_temperature": "None",
	"Actual_temperature": "18.5",
	"Air_temperature": "20.103",
	"Rel_humidity": "65.005",
	"Intensity": "555.8",
	"Brightness": "None",
	"Climate_Air_temperature": "16.17",
	"Climate_Rel_humidity": "83",
	"Climate_Wind_speed": "0.691"
}