{
	"ID": "House8Space1272014-08-15T18:00:00Z",
	"IDhash": "18ea55",
	"Household": "House8",
	"Space": "Space127",
	"Room_Type": "Living room",
	"timestamp": "2014-08-15T18:00:00Z",
	"Air_humidity": "61",
	"Nominal_temperature": "None",
	"Actual_temperature": "22",
	"Air_temperature": "21.246",
	"Rel_humidity": "63.19",
	"Intensity": "3.9",
	"Brightness": "None",
	"Climate_Air_temperature": "15.41",
	"Climate_Rel_humidity": "86.7",
	"Climate_Wind_speed": "1.142"
}