{
	"ID": "House12Space1842015-01-15T16:30:00Z",
	"IDhash": "9aaa40",
	"Household": "House12",
	"Space": "Space184",
	"Room_Type": "Kitchen",
	"timestamp": "2015-01-15T16:30:00Z",
	"Air_humidity": "47",
	"Nominal_temperature": "None",
	"Actual_temperature": "18.5",
	"Air_temperature": "20.46",
	"Rel_humidity": "42.61",
	"Intensity": "11.8",
	"Brightness": "None",
	"Climate_Air_temperature": "5.352",
	"Climate_Rel_humidity": "73.51",
	"Climate_Wind_speed": "2.914"
}