{
	"ID": "House16Space2602014-09-26T01:30:00Z",
	"IDhash": "7dd5ab",
	"Household": "House16",
	"Space": "Space260",
	"Room_Type": "Bedroom",
	"timestamp": "2014-09-26T01:30:00Z",
	"Air_humidity": "68",
	"Nominal_temperature": "8.5",
	"Actual_temperature": "None",
	"Air_temperature": "19.888",
	"Rel_humidity": "69.434",
	"Intensity": "3.9",
	"Brightness": "None",
	"Climate_Air_temperature": "16.55",
	"Climate_Rel_humidity": "88.1",
	"Climate_Wind_speed": "1.079"
}