{
	"ID": "House10Space1572014-12-20T08:00:00Z",
	"IDhash": "4849cb",
	"Household": "House10",
	"Space": "Space157",
	"Room_Type": "Living room",
	"timestamp": "2014-12-20T08:00:00Z",
	"Air_humidity": "54",
	"Nominal_temperature": "19",
	"Actual_temperature": "None",
	"Air_temperature": "16.272",
	"Rel_humidity": "54.489",
	"Intensity": "11.8",
	"Brightness": "11",
	"Climate_Air_temperature": "7.304",
	"Climate_Rel_humidity": "77.79",
	"Climate_Wind_speed": "3.524"
}