{
	"ID": "House4Space452014-12-23T15:30:00Z",
	"IDhash": "c4a936",
	"Household": "House4",
	"Space": "Space45",
	"Room_Type": "Living room",
	"timestamp": "2014-12-23T15:30:00Z",
	"Air_humidity": "62",
	"Nominal_temperature": "None",
	"Actual_temperature": "17.5",
	"Air_temperature": "18.747",
	"Rel_humidity": "55.526",
	"Intensity": "11.8",
	"Brightness": "None",
	"Climate_Air_temperature": "11.74",
	"Climate_Rel_humidity": "82.7",
	"Climate_Wind_speed": "2.442"
}