{
	"ID": "House18Space2862015-03-07T20:00:00Z",
	"IDhash": "04ff74",
	"Household": "House18",
	"Space": "Space286",
	"Room_Type": "Kitchen",
	"timestamp": "2015-03-07T20:00:00Z",
	"Air_humidity": "50",
	"Nominal_temperature": "None",
	"Actual_temperature": "22.5",
	"Air_temperature": "22.705",
	"Rel_humidity": "45.862",
	"Intensity": "11.8",
	"Brightness": "None",
	"Climate_Air_temperature": "11.1",
	"Climate_Rel_humidity": "77.33",
	"Climate_Wind_speed": "0.837"
}