{
	"ID": "House13Space2092014-12-25T08:00:00Z",
	"IDhash": "2af8aa",
	"Household": "House13",
	"Space": "Space209",
	"Room_Type": "Ensuite",
	"timestamp": "2014-12-25T08:00:00Z",
	"Air_humidity": "49",
	"Nominal_temperature": "None",
	"Actual_temperature": "19",
	"Air_temperature": "19.912",
	"Rel_humidity": "51.106",
	"Intensity": "3.9",
	"Brightness": "None",
	"Climate_Air_temperature": "4.41",
	"Climate_Rel_humidity": "83.6",
	"Climate_Wind_speed": "2.268"
}