{
	"ID": "House6Space1082014-12-15T22:30:00Z",
	"IDhash": "3bca72",
	"Household": "House6",
	"Space": "Space108",
	"Room_Type": "Bathroom",
	"timestamp": "2014-12-15T22:30:00Z",
	"Air_humidity": "66",
	"Nominal_temperature": "None",
	"Actual_temperature": "19",
	"Air_temperature": "17.415",
	"Rel_humidity": "64.808",
	"Intensity": "11.8",
	"Brightness": "None",
	"Climate_Air_temperature": "4.043",
	"Climate_Rel_humidity": "86.2",
	"Climate_Wind_speed": "1.513"
}