{
	"ID": "House18Space2842014-10-26T08:30:00Z",
	"IDhash": "086aed",
	"Household": "House18",
	"Space": "Space284",
	"Room_Type": "Living room",
	"timestamp": "2014-10-26T08:30:00Z",
	"Air_humidity": "None",
	"Nominal_temperature": "15",
	"Actual_temperature": "None",
	"Air_temperature": "20.603",
	"Rel_humidity": "60.362",
	"Intensity": "11.8",
	"Brightness": "40",
	"Climate_Air_temperature": "12.71",
	"Climate_Rel_humidity": "80.3",
	"Climate_Wind_speed": "1.281"
}