{
	"ID": "House16Space2602014-11-27T09:00:00Z",
	"IDhash": "6d63ea",
	"Household": "House16",
	"Space": "Space260",
	"Room_Type": "Bedroom",
	"timestamp": "2014-11-27T09:00:00Z",
	"Air_humidity": "58",
	"Nominal_temperature": "None",
	"Actual_temperature": "23.5",
	"Air_temperature": "17.891",
	"Rel_humidity": "77.703",
	"Intensity": "11.8",
	"Brightness": "None",
	"Climate_Air_temperature": "7.531",
	"Climate_Rel_humidity": "97.8",
	"Climate_Wind_speed": "0.472"
}