{
	"ID": "House7Space1142015-02-12T15:30:00Z",
	"IDhash": "9d8d4b",
	"Household": "House7",
	"Space": "Space114",
	"Room_Type": "Kitchen",
	"timestamp": "2015-02-12T15:30:00Z",
	"Air_humidity": "44",
	"Nominal_temperature": "None",
	"Actual_temperature": "16.5",
	"Air_temperature": "17.034",
	"Rel_humidity": "40.619",
	"Intensity": "11.8",
	"Brightness": "None",
	"Climate_Air_temperature": "4.129",
	"Climate_Rel_humidity": "78.18",
	"Climate_Wind_speed": "1.134"
}