{
	"ID": "House10Space1612014-10-16T05:30:00Z",
	"IDhash": "b3403c",
	"Household": "House10",
	"Space": "Space161",
	"Room_Type": "Bathroom",
	"timestamp": "2014-10-16T05:30:00Z",
	"Air_humidity": "73",
	"Nominal_temperature": "20",
	"Actual_temperature": "18",
	"Air_temperature": "20.627",
	"Rel_humidity": "61.063",
	"Intensity": "19.7",
	"Brightness": "None",
	"Climate_Air_temperature": "11.99",
	"Climate_Rel_humidity": "96.7",
	"Climate_Wind_speed": "0.434"
}