{
	"ID": "House15Space2312015-03-07T16:00:00Z",
	"IDhash": "373ca9",
	"Household": "House15",
	"Space": "Space231",
	"Room_Type": "Kitchen",
	"timestamp": "2015-03-07T16:00:00Z",
	"Air_humidity": "61",
	"Nominal_temperature": "None",
	"Actual_temperature": "19.5",
	"Air_temperature": "22.058",
	"Rel_humidity": "52.245",
	"Intensity": "35.5",
	"Brightness": "None",
	"Climate_Air_temperature": "15.22",
	"Climate_Rel_humidity": "54.49",
	"Climate_Wind_speed": "2.519"
}