{
	"ID": "House4Space492015-01-02T23:00:00Z",
	"IDhash": "d16dda",
	"Household": "House4",
	"Space": "Space49",
	"Room_Type": "Kitchen",
	"timestamp": "2015-01-02T23:00:00Z",
	"Air_humidity": "48",
	"Nominal_temperature": "None",
	"Actual_temperature": "18.5",
	"Air_temperature": "20.579",
	"Rel_humidity": "43.78",
	"Intensity": "11.8",
	"Brightness": "None",
	"Climate_Air_temperature": "4.548",
	"Climate_Rel_humidity": "77.17",
	"Climate_Wind_speed": "1.308"
}