{
	"ID": "House13Space2092015-01-15T06:30:00Z",
	"IDhash": "9e8950",
	"Household": "House13",
	"Space": "Space209",
	"Room_Type": "Ensuite",
	"timestamp": "2015-01-15T06:30:00Z",
	"Air_humidity": "42",
	"Nominal_temperature": "None",
	"Actual_temperature": "25",
	"Air_temperature": "23.785",
	"Rel_humidity": "49.701",
	"Intensity": "3.9",
	"Brightness": "None",
	"Climate_Air_temperature": "6.627",
	"Climate_Rel_humidity": "79.27",
	"Climate_Wind_speed": "2.161"
}