{
	"ID": "House9Space1412014-12-19T08:00:00Z",
	"IDhash": "43128f",
	"Household": "House9",
	"Space": "Space141",
	"Room_Type": "Kitchen",
	"timestamp": "2014-12-19T08:00:00Z",
	"Air_humidity": "64",
	"Nominal_temperature": "None",
	"Actual_temperature": "None",
	"Air_temperature": "19.984",
	"Rel_humidity": "60.536",
	"Intensity": "11.8",
	"Brightness": "44",
	"Climate_Air_temperature": "6.967",
	"Climate_Rel_humidity": "75.36",
	"Climate_Wind_speed": "4.033"
}