{
	"ID": "House18Space2862015-02-02T14:00:00Z",
	"IDhash": "a56b71",
	"Household": "House18",
	"Space": "Space286",
	"Room_Type": "Kitchen",
	"timestamp": "2015-02-02T14:00:00Z",
	"Air_humidity": "33",
	"Nominal_temperature": "None",
	"Actual_temperature": "24.5",
	"Air_temperature": "19.175",
	"Rel_humidity": "42.623",
	"Intensity": "19.7",
	"Brightness": "None",
	"Climate_Air_temperature": "2.383",
	"Climate_Rel_humidity": "63.86",
	"Climate_Wind_speed": "2.392"
}