{
	"ID": "House13Space2092015-01-08T06:00:00Z",
	"IDhash": "884b08",
	"Household": "House13",
	"Space": "Space209",
	"Room_Type": "Ensuite",
	"timestamp": "2015-01-08T06:00:00Z",
	"Air_humidity": "52",
	"Nominal_temperature": "None",
	"Actual_temperature": "20.5",
	"Air_temperature": "20.055",
	"Rel_humidity": "51.344",
	"Intensity": "3.9",
	"Brightness": "None",
	"Climate_Air_temperature": "9.11",
	"Climate_Rel_humidity": "76.82",
	"Climate_Wind_speed": "1.355"
}