{
	"ID": "House16Space2602014-12-15T07:30:00Z",
	"IDhash": "cc1ef5",
	"Household": "House16",
	"Space": "Space260",
	"Room_Type": "Bedroom",
	"timestamp": "2014-12-15T07:30:00Z",
	"Air_humidity": "67",
	"Nominal_temperature": "None",
	"Actual_temperature": "18",
	"Air_temperature": "14.888",
	"Rel_humidity": "74.094",
	"Intensity": "3.9",
	"Brightness": "None",
	"Climate_Air_temperature": "5.05",
	"Climate_Rel_humidity": "86.9",
	"Climate_Wind_speed": "1.7"
}