{
	"ID": "House6Space962015-02-20T08:00:00Z",
	"IDhash": "7840e8",
	"Household": "House6",
	"Space": "Space96",
	"Room_Type": "Kitchen",
	"timestamp": "2015-02-20T08:00:00Z",
	"Air_humidity": "53",
	"Nominal_temperature": "None",
	"Actual_temperature": "14.5",
	"Air_temperature": "17.32",
	"Rel_humidity": "47.694",
	"Intensity": "11.8",
	"Brightness": "None",
	"Climate_Air_temperature": "2.798",
	"Climate_Rel_humidity": "91.6",
	"Climate_Wind_speed": "1.105"
}