{
	"ID": "House10Space1572015-03-02T22:00:00Z",
	"IDhash": "2be547",
	"Household": "House10",
	"Space": "Space157",
	"Room_Type": "Living room",
	"timestamp": "2015-03-02T22:00:00Z",
	"Air_humidity": "41",
	"Nominal_temperature": "15",
	"Actual_temperature": "None",
	"Air_temperature": "17.011",
	"Rel_humidity": "45.957",
	"Intensity": "11.8",
	"Brightness": "None",
	"Climate_Air_temperature": "3.616",
	"Climate_Rel_humidity": "71.61",
	"Climate_Wind_speed": "2.47"
}