{
	"ID": "House13Space2092015-02-13T16:30:00Z",
	"IDhash": "acfbd3",
	"Household": "House13",
	"Space": "Space209",
	"Room_Type": "Ensuite",
	"timestamp": "2015-02-13T16:30:00Z",
	"Air_humidity": "41",
	"Nominal_temperature": "None",
	"Actual_temperature": "22",
	"Air_temperature": "19.722",
	"Rel_humidity": "43.456",
	"Intensity": "3.9",
	"Brightness": "None",
	"Climate_Air_temperature": "6.924",
	"Climate_Rel_humidity": "90.2",
	"Climate_Wind_speed": "2.18"
}