{
	"ID": "House18Space2862015-04-17T07:00:00Z",
	"IDhash": "e28232",
	"Household": "House18",
	"Space": "Space286",
	"Room_Type": "Kitchen",
	"timestamp": "2015-04-17T07:00:00Z",
	"Air_humidity": "53",
	"Nominal_temperature": "None",
	"Actual_temperature": "18",
	"Air_temperature": "20.531",
	"Rel_humidity": "50.218",
	"Intensity": "43.4",
	"Brightness": "None",
	"Climate_Air_temperature": "7.707",
	"Climate_Rel_humidity": "71.12",
	"Climate_Wind_speed": "1.451"
}