{
	"ID": "House18Space2862014-12-30T17:30:00Z",
	"IDhash": "0bd6d2",
	"Household": "House18",
	"Space": "Space286",
	"Room_Type": "Kitchen",
	"timestamp": "2014-12-30T17:30:00Z",
	"Air_humidity": "46",
	"Nominal_temperature": "None",
	"Actual_temperature": "16",
	"Air_temperature": "16.558",
	"Rel_humidity": "50.65",
	"Intensity": "11.8",
	"Brightness": "2",
	"Climate_Air_temperature": "4.226",
	"Climate_Rel_humidity": "86",
	"Climate_Wind_speed": "1.107"
}