{
	"ID": "House14Space2232015-02-16T07:30:00Z",
	"IDhash": "0455f7",
	"Household": "House14",
	"Space": "Space223",
	"Room_Type": "Bedroom",
	"timestamp": "2015-02-16T07:30:00Z",
	"Air_humidity": "52",
	"Nominal_temperature": "None",
	"Actual_temperature": "16",
	"Air_temperature": "16.749",
	"Rel_humidity": "49.588",
	"Intensity": "11.8",
	"Brightness": "None",
	"Climate_Air_temperature": "5.353",
	"Climate_Rel_humidity": "90.2",
	"Climate_Wind_speed": "1.654"
}