{
	"ID": "House18Space2862014-11-10T07:00:00Z",
	"IDhash": "19b6e3",
	"Household": "House18",
	"Space": "Space286",
	"Room_Type": "Kitchen",
	"timestamp": "2014-11-10T07:00:00Z",
	"Air_humidity": "62",
	"Nominal_temperature": "None",
	"Actual_temperature": "20.5",
	"Air_temperature": "20.222",
	"Rel_humidity": "58.016",
	"Intensity": "19.7",
	"Brightness": "None",
	"Climate_Air_temperature": "7.061",
	"Climate_Rel_humidity": "94.3",
	"Climate_Wind_speed": "0.765"
}