{
	"ID": "House16Space2602014-12-31T16:00:00Z",
	"IDhash": "cc3af3",
	"Household": "House16",
	"Space": "Space260",
	"Room_Type": "Bedroom",
	"timestamp": "2014-12-31T16:00:00Z",
	"Air_humidity": "57",
	"Nominal_temperature": "None",
	"Actual_temperature": "18.5",
	"Air_temperature": "14.673",
	"Rel_humidity": "71.119",
	"Intensity": "3.9",
	"Brightness": "None",
	"Climate_Air_temperature": "5.93",
	"Climate_Rel_humidity": "89.8",
	"Climate_Wind_speed": "1.027"
}