{
	"ID": "House18Space2862015-02-26T18:30:00Z",
	"IDhash": "7e0539",
	"Household": "House18",
	"Space": "Space286",
	"Room_Type": "Kitchen",
	"timestamp": "2015-02-26T18:30:00Z",
	"Air_humidity": "37",
	"Nominal_temperature": "None",
	"Actual_temperature": "25",
	"Air_temperature": "21.199",
	"Rel_humidity": "44.174",
	"Intensity": "27.6",
	"Brightness": "None",
	"Climate_Air_temperature": "5.192",
	"Climate_Rel_humidity": "65.29",
	"Climate_Wind_speed": "2.614"
}