{
	"ID": "House16Space2602014-10-05T16:00:00Z",
	"IDhash": "c38a8b",
	"Household": "House16",
	"Space": "Space260",
	"Room_Type": "Bedroom",
	"timestamp": "2014-10-05T16:00:00Z",
	"Air_humidity": "None",
	"Nominal_temperature": "7.5",
	"Actual_temperature": "17.5",
	"Air_temperature": "17.891",
	"Rel_humidity": "59.083",
	"Intensity": "3.9",
	"Brightness": "None",
	"Climate_Air_temperature": "14.93",
	"Climate_Rel_humidity": "61.66",
	"Climate_Wind_speed": "0.797"
}