{
	"ID": "House7Space1212014-12-09T23:00:00Z",
	"IDhash": "cd3d47",
	"Household": "House7",
	"Space": "Space121",
	"Room_Type": "Bathroom",
	"timestamp": "2014-12-09T23:00:00Z",
	"Air_humidity": "60",
	"Nominal_temperature": "None",
	"Actual_temperature": "18",
	"Air_temperature": "16.058",
	"Rel_humidity": "82.101",
	"Intensity": "11.8",
	"Brightness": "None",
	"Climate_Air_temperature": "11.24",
	"Climate_Rel_humidity": "91.1",
	"Climate_Wind_speed": "2.754"
}