{
	"ID": "House6Space962014-11-05T07:00:00Z",
	"IDhash": "d8b503",
	"Household": "House6",
	"Space": "Space96",
	"Room_Type": "Kitchen",
	"timestamp": "2014-11-05T07:00:00Z",
	"Air_humidity": "59",
	"Nominal_temperature": "None",
	"Actual_temperature": "17",
	"Air_temperature": "17.558",
	"Rel_humidity": "56.785",
	"Intensity": "19.7",
	"Brightness": "None",
	"Climate_Air_temperature": "5.046",
	"Climate_Rel_humidity": "94.9",
	"Climate_Wind_speed": "0.783"
}