{
	"ID": "House18Space2862015-02-17T08:30:00Z",
	"IDhash": "24a2f3",
	"Household": "House18",
	"Space": "Space286",
	"Room_Type": "Kitchen",
	"timestamp": "2015-02-17T08:30:00Z",
	"Air_humidity": "42",
	"Nominal_temperature": "None",
	"Actual_temperature": "23.5",
	"Air_temperature": "18.319",
	"Rel_humidity": "49.422",
	"Intensity": "11.8",
	"Brightness": "56",
	"Climate_Air_temperature": "2.374",
	"Climate_Rel_humidity": "89.5",
	"Climate_Wind_speed": "1.938"
}