{
	"ID": "House15Space2312014-12-29T22:00:00Z",
	"IDhash": "de282f",
	"Household": "House15",
	"Space": "Space231",
	"Room_Type": "Kitchen",
	"timestamp": "2014-12-29T22:00:00Z",
	"Air_humidity": "54",
	"Nominal_temperature": "None",
	"Actual_temperature": "None",
	"Air_temperature": "23.689",
	"Rel_humidity": "40.538",
	"Intensity": "11.8",
	"Brightness": "21",
	"Climate_Air_temperature": "0.77",
	"Climate_Rel_humidity": "93.3",
	"Climate_Wind_speed": "0.445"
}