{
	"ID": "House9Space1412014-10-19T07:30:00Z",
	"IDhash": "7d7dab",
	"Household": "House9",
	"Space": "Space141",
	"Room_Type": "Kitchen",
	"timestamp": "2014-10-19T07:30:00Z",
	"Air_humidity": "73",
	"Nominal_temperature": "None",
	"Actual_temperature": "None",
	"Air_temperature": "19.746",
	"Rel_humidity": "68.173",
	"Intensity": "19.7",
	"Brightness": "57",
	"Climate_Air_temperature": "14.67",
	"Climate_Rel_humidity": "87.6",
	"Climate_Wind_speed": "1.312"
}