{
	"ID": "House19Space3072014-12-30T08:30:00Z",
	"IDhash": "592a5d",
	"Household": "House19",
	"Space": "Space307",
	"Room_Type": "Bathroom",
	"timestamp": "2014-12-30T08:30:00Z",
	"Air_humidity": "56",
	"Nominal_temperature": "None",
	"Actual_temperature": "23",
	"Air_temperature": "23.208",
	"Rel_humidity": "51.617",
	"Intensity": "27.6",
	"Brightness": "None",
	"Climate_Air_temperature": "-2.64",
	"Climate_Rel_humidity": "95.4",
	"Climate_Wind_speed": "0.576"
}