{
	"ID": "House18Space2862015-01-13T12:00:00Z",
	"IDhash": "0941be",
	"Household": "House18",
	"Space": "Space286",
	"Room_Type": "Kitchen",
	"timestamp": "2015-01-13T12:00:00Z",
	"Air_humidity": "50",
	"Nominal_temperature": "None",
	"Actual_temperature": "22",
	"Air_temperature": "19.603",
	"Rel_humidity": "51.033",
	"Intensity": "19.7",
	"Brightness": "None",
	"Climate_Air_temperature": "6.258",
	"Climate_Rel_humidity": "76.2",
	"Climate_Wind_speed": "1.232"
}