{
	"ID": "House19Space3072015-04-11T12:00:00Z",
	"IDhash": "b6d00f",
	"Household": "House19",
	"Space": "Space307",
	"Room_Type": "Bathroom",
	"timestamp": "2015-04-11T12:00:00Z",
	"Air_humidity": "49",
	"Nominal_temperature": "None",
	"Actual_temperature": "19.5",
	"Air_temperature": "21.318",
	"Rel_humidity": "45.341",
	"Intensity": "319.3",
	"Brightness": "None",
	"Climate_Air_temperature": "10.16",
	"Climate_Rel_humidity": "47.5",
	"Climate_Wind_speed": "3.852"
}