{
	"ID": "House15Space2292015-03-15T20:00:00Z",
	"IDhash": "bca6ca",
	"Household": "House15",
	"Space": "Space229",
	"Room_Type": "Living room",
	"timestamp": "2015-03-15T20:00:00Z",
	"Air_humidity": "55",
	"Nominal_temperature": "None",
	"Actual_temperature": "17.5",
	"Air_temperature": "20.627",
	"Rel_humidity": "48.371",
	"Intensity": "11.8",
	"Brightness": "None",
	"Climate_Air_temperature": "5.049",
	"Climate_Rel_humidity": "88",
	"Climate_Wind_speed": "1.61"
}