{
	"ID": "House18Space2862014-10-19T06:30:00Z",
	"IDhash": "74a4d7",
	"Household": "House18",
	"Space": "Space286",
	"Room_Type": "Kitchen",
	"timestamp": "2014-10-19T06:30:00Z",
	"Air_humidity": "69",
	"Nominal_temperature": "None",
	"Actual_temperature": "22",
	"Air_temperature": "22.944",
	"Rel_humidity": "63.625",
	"Intensity": "11.8",
	"Brightness": "None",
	"Climate_Air_temperature": "14.85",
	"Climate_Rel_humidity": "86.7",
	"Climate_Wind_speed": "0.887"
}