{
	"ID": "House4Space492014-12-23T17:00:00Z",
	"IDhash": "ee333f",
	"Household": "House4",
	"Space": "Space49",
	"Room_Type": "Kitchen",
	"timestamp": "2014-12-23T17:00:00Z",
	"Air_humidity": "57",
	"Nominal_temperature": "None",
	"Actual_temperature": "21",
	"Air_temperature": "22.369",
	"Rel_humidity": "63.287",
	"Intensity": "98.5",
	"Brightness": "None",
	"Climate_Air_temperature": "11.06",
	"Climate_Rel_humidity": "88.2",
	"Climate_Wind_speed": "2.34"
}