{
	"ID": "House12Space1842014-11-02T19:30:00Z",
	"IDhash": "7157d8",
	"Household": "House12",
	"Space": "Space184",
	"Room_Type": "Kitchen",
	"timestamp": "2014-11-02T19:30:00Z",
	"Air_humidity": "64",
	"Nominal_temperature": "None",
	"Actual_temperature": "None",
	"Air_temperature": "17.225",
	"Rel_humidity": "59.822",
	"Intensity": "11.8",
	"Brightness": "45",
	"Climate_Air_temperature": "9.98",
	"Climate_Rel_humidity": "91.4",
	"Climate_Wind_speed": "0.906"
}