{
	"ID": "House3Space342015-04-19T07:30:00Z",
	"IDhash": "a6a783",
	"Household": "House3",
	"Space": "Space34",
	"Room_Type": "Living room",
	"timestamp": "2015-04-19T07:30:00Z",
	"Air_humidity": "49",
	"Nominal_temperature": "None",
	"Actual_temperature": "18",
	"Air_temperature": "20.317",
	"Rel_humidity": "43.782",
	"Intensity": "None",
	"Brightness": "57",
	"Climate_Air_temperature": "6.887",
	"Climate_Rel_humidity": "73.81",
	"Climate_Wind_speed": "1.135"
}