{
	"ID": "House15Space2292014-09-15T18:00:00Z",
	"IDhash": "6c8e5b",
	"Household": "House15",
	"Space": "Space229",
	"Room_Type": "Living room",
	"timestamp": "2014-09-15T18:00:00Z",
	"Air_humidity": "71",
	"Nominal_temperature": "None",
	"Actual_temperature": "None",
	"Air_temperature": "22.369",
	"Rel_humidity": "73.325",
	"Intensity": "3.9",
	"Brightness": "45",
	"Climate_Air_temperature": "18.05",
	"Climate_Rel_humidity": "80.5",
	"Climate_Wind_speed": "0.704"
}