{
	"ID": "House6Space932015-04-02T19:30:00Z",
	"IDhash": "75e451",
	"Household": "House6",
	"Space": "Space93",
	"Room_Type": "Living room",
	"timestamp": "2015-04-02T19:30:00Z",
	"Air_humidity": "None",
	"Nominal_temperature": "20.5",
	"Actual_temperature": "None",
	"Air_temperature": "21.7",
	"Rel_humidity": "46.474",
	"Intensity": "11.8",
	"Brightness": "41",
	"Climate_Air_temperature": "8.52",
	"Climate_Rel_humidity": "63.51",
	"Climate_Wind_speed": "0.446"
}