{
	"ID": "House19Space3072014-10-04T06:30:00Z",
	"IDhash": "93f74d",
	"Household": "House19",
	"Space": "Space307",
	"Room_Type": "Bathroom",
	"timestamp": "2014-10-04T06:30:00Z",
	"Air_humidity": "67",
	"Nominal_temperature": "None",
	"Actual_temperature": "23.5",
	"Air_temperature": "22.944",
	"Rel_humidity": "68.753",
	"Intensity": "11.8",
	"Brightness": "None",
	"Climate_Air_temperature": "15.82",
	"Climate_Rel_humidity": "87.1",
	"Climate_Wind_speed": "1.087"
}