{
	"ID": "House18Space2862015-03-02T13:00:00Z",
	"IDhash": "aaefaf",
	"Household": "House18",
	"Space": "Space286",
	"Room_Type": "Kitchen",
	"timestamp": "2015-03-02T13:00:00Z",
	"Air_humidity": "35",
	"Nominal_temperature": "None",
	"Actual_temperature": "24.5",
	"Air_temperature": "20.341",
	"Rel_humidity": "41.63",
	"Intensity": "19.7",
	"Brightness": "None",
	"Climate_Air_temperature": "5.701",
	"Climate_Rel_humidity": "71.75",
	"Climate_Wind_speed": "5.516"
}