{
	"ID": "House17Space2732015-03-13T08:00:00Z",
	"IDhash": "445208",
	"Household": "House17",
	"Space": "Space273",
	"Room_Type": "Kitchen",
	"timestamp": "2015-03-13T08:00:00Z",
	"Air_humidity": "None",
	"Nominal_temperature": "None",
	"Actual_temperature": "44",
	"Air_temperature": "20.627",
	"Rel_humidity": "38.581",
	"Intensity": "11.8",
	"Brightness": "55",
	"Climate_Air_temperature": "5.775",
	"Climate_Rel_humidity": "94.1",
	"Climate_Wind_speed": "0.854"
}