{
	"ID": "House13Space2002014-09-26T22:00:00Z",
	"IDhash": "0a7788",
	"Household": "House13",
	"Space": "Space200",
	"Room_Type": "Kitchen",
	"timestamp": "2014-09-26T22:00:00Z",
	"Air_humidity": "65",
	"Nominal_temperature": "6",
	"Actual_temperature": "20.5",
	"Air_temperature": "22.561",
	"Rel_humidity": "59.88",
	"Intensity": "11.8",
	"Brightness": "None",
	"Climate_Air_temperature": "11.78",
	"Climate_Rel_humidity": "80.3",
	"Climate_Wind_speed": "0.376"
}