{
	"ID": "House13Space1982015-03-16T07:00:00Z",
	"IDhash": "18cc8a",
	"Household": "House13",
	"Space": "Space198",
	"Room_Type": "Living room",
	"timestamp": "2015-03-16T07:00:00Z",
	"Air_humidity": "45",
	"Nominal_temperature": "6",
	"Actual_temperature": "None",
	"Air_temperature": "20.007",
	"Rel_humidity": "40.236",
	"Intensity": "19.7",
	"Brightness": "None",
	"Climate_Air_temperature": "4.874",
	"Climate_Rel_humidity": "92.9",
	"Climate_Wind_speed": "1.573"
}