{
	"ID": "House9Space1412015-03-29T12:00:00Z",
	"IDhash": "cc4c16",
	"Household": "House9",
	"Space": "Space141",
	"Room_Type": "Kitchen",
	"timestamp": "2015-03-29T12:00:00Z",
	"Air_humidity": "None",
	"Nominal_temperature": "None",
	"Actual_temperature": "17",
	"Air_temperature": "20.46",
	"Rel_humidity": "55.564",
	"Intensity": "19.7",
	"Brightness": "60",
	"Climate_Air_temperature": "13.21",
	"Climate_Rel_humidity": "79.62",
	"Climate_Wind_speed": "4.876"
}