{
	"ID": "House12Space1842014-12-08T09:30:00Z",
	"IDhash": "fdcf55",
	"Household": "House12",
	"Space": "Space184",
	"Room_Type": "Kitchen",
	"timestamp": "2014-12-08T09:30:00Z",
	"Air_humidity": "None",
	"Nominal_temperature": "6",
	"Actual_temperature": "14.5",
	"Air_temperature": "18.2",
	"Rel_humidity": "50",
	"Intensity": "11.8",
	"Brightness": "None",
	"Climate_Air_temperature": "2.648",
	"Climate_Rel_humidity": "90.9",
	"Climate_Wind_speed": "2.161"
}