{
	"ID": "House19Space3072014-10-30T06:30:00Z",
	"IDhash": "6378ad",
	"Household": "House19",
	"Space": "Space307",
	"Room_Type": "Bathroom",
	"timestamp": "2014-10-30T06:30:00Z",
	"Air_humidity": "68",
	"Nominal_temperature": "None",
	"Actual_temperature": "21.5",
	"Air_temperature": "22.537",
	"Rel_humidity": "80.721",
	"Intensity": "122.2",
	"Brightness": "None",
	"Climate_Air_temperature": "13.41",
	"Climate_Rel_humidity": "96.8",
	"Climate_Wind_speed": "0.892"
}