{
	"ID": "House9Space1412014-11-21T18:30:00Z",
	"IDhash": "00ec06",
	"Household": "House9",
	"Space": "Space141",
	"Room_Type": "Kitchen",
	"timestamp": "2014-11-21T18:30:00Z",
	"Air_humidity": "None",
	"Nominal_temperature": "None",
	"Actual_temperature": "14.5",
	"Air_temperature": "16.534",
	"Rel_humidity": "65.069",
	"Intensity": "11.8",
	"Brightness": "51",
	"Climate_Air_temperature": "7.789",
	"Climate_Rel_humidity": "95.8",
	"Climate_Wind_speed": "1.112"
}