{
	"ID": "House6Space1082015-01-30T10:30:00Z",
	"IDhash": "22b650",
	"Household": "House6",
	"Space": "Space108",
	"Room_Type": "Bathroom",
	"timestamp": "2015-01-30T10:30:00Z",
	"Air_humidity": "76",
	"Nominal_temperature": "None",
	"Actual_temperature": "18.5",
	"Air_temperature": "20.126",
	"Rel_humidity": "77.031",
	"Intensity": "35.5",
	"Brightness": "None",
	"Climate_Air_temperature": "2.471",
	"Climate_Rel_humidity": "90",
	"Climate_Wind_speed": "2.887"
}