{
	"ID": "House4Space452014-12-06T20:30:00Z",
	"IDhash": "f4f4da",
	"Household": "House4",
	"Space": "Space45",
	"Room_Type": "Living room",
	"timestamp": "2014-12-06T20:30:00Z",
	"Air_humidity": "52",
	"Nominal_temperature": "None",
	"Actual_temperature": "21.5",
	"Air_temperature": "23.232",
	"Rel_humidity": "50.389",
	"Intensity": "11.8",
	"Brightness": "None",
	"Climate_Air_temperature": "6.322",
	"Climate_Rel_humidity": "85.5",
	"Climate_Wind_speed": "1.484"
}