{
	"ID": "House4Space452014-12-10T23:00:00Z",
	"IDhash": "43ff8c",
	"Household": "House4",
	"Space": "Space45",
	"Room_Type": "Living room",
	"timestamp": "2014-12-10T23:00:00Z",
	"Air_humidity": "53",
	"Nominal_temperature": "None",
	"Actual_temperature": "19.5",
	"Air_temperature": "22.561",
	"Rel_humidity": "48.938",
	"Intensity": "11.8",
	"Brightness": "None",
	"Climate_Air_temperature": "5.914",
	"Climate_Rel_humidity": "78.37",
	"Climate_Wind_speed": "2.123"
}