{
	"ID": "House6Space962015-03-30T08:30:00Z",
	"IDhash": "6e1b6f",
	"Household": "House6",
	"Space": "Space96",
	"Room_Type": "Kitchen",
	"timestamp": "2015-03-30T08:30:00Z",
	"Air_humidity": "48",
	"Nominal_temperature": "None",
	"Actual_temperature": "18.5",
	"Air_temperature": "18.033",
	"Rel_humidity": "46.778",
	"Intensity": "11.8",
	"Brightness": "None",
	"Climate_Air_temperature": "6.593",
	"Climate_Rel_humidity": "69.18",
	"Climate_Wind_speed": "3.794"
}