{
	"ID": "House13Space1982015-03-31T18:30:00Z",
	"IDhash": "12c366",
	"Household": "House13",
	"Space": "Space198",
	"Room_Type": "Living room",
	"timestamp": "2015-03-31T18:30:00Z",
	"Air_humidity": "None",
	"Nominal_temperature": "23",
	"Actual_temperature": "None",
	"Air_temperature": "20.031",
	"Rel_humidity": "41.918",
	"Intensity": "19.7",
	"Brightness": "49",
	"Climate_Air_temperature": "5.531",
	"Climate_Rel_humidity": "71.49",
	"Climate_Wind_speed": "4.658"
}