{
	"ID": "House6Space932014-12-28T17:00:00Z",
	"IDhash": "15e7bf",
	"Household": "House6",
	"Space": "Space93",
	"Room_Type": "Living room",
	"timestamp": "2014-12-28T17:00:00Z",
	"Air_humidity": "None",
	"Nominal_temperature": "17",
	"Actual_temperature": "20.5",
	"Air_temperature": "16.868",
	"Rel_humidity": "51.652",
	"Intensity": "11.8",
	"Brightness": "None",
	"Climate_Air_temperature": "1.089",
	"Climate_Rel_humidity": "86.9",
	"Climate_Wind_speed": "0.897"
}