{
	"ID": "House6Space1082014-12-09T08:30:00Z",
	"IDhash": "2923ca",
	"Household": "House6",
	"Space": "Space108",
	"Room_Type": "Bathroom",
	"timestamp": "2014-12-09T08:30:00Z",
	"Air_humidity": "60",
	"Nominal_temperature": "None",
	"Actual_temperature": "14",
	"Air_temperature": "15.605",
	"Rel_humidity": "58.933",
	"Intensity": "11.8",
	"Brightness": "None",
	"Climate_Air_temperature": "3.115",
	"Climate_Rel_humidity": "86.3",
	"Climate_Wind_speed": "1.265"
}