{
	"ID": "House12Space1842014-10-29T17:30:00Z",
	"IDhash": "687116",
	"Household": "House12",
	"Space": "Space184",
	"Room_Type": "Kitchen",
	"timestamp": "2014-10-29T17:30:00Z",
	"Air_humidity": "69",
	"Nominal_temperature": "None",
	"Actual_temperature": "None",
	"Air_temperature": "21.413",
	"Rel_humidity": "54.774",
	"Intensity": "11.8",
	"Brightness": "29",
	"Climate_Air_temperature": "10.07",
	"Climate_Rel_humidity": "92.6",
	"Climate_Wind_speed": "1.312"
}