{
	"ID": "House6Space1082014-12-01T08:30:00Z",
	"IDhash": "686860",
	"Household": "House6",
	"Space": "Space108",
	"Room_Type": "Bathroom",
	"timestamp": "2014-12-01T08:30:00Z",
	"Air_humidity": "67",
	"Nominal_temperature": "None",
	"Actual_temperature": "16",
	"Air_temperature": "16.987",
	"Rel_humidity": "65.796",
	"Intensity": "11.8",
	"Brightness": "None",
	"Climate_Air_temperature": "7.429",
	"Climate_Rel_humidity": "88.6",
	"Climate_Wind_speed": "1.715"
}