{
	"ID": "House18Space2862014-11-26T20:00:00Z",
	"IDhash": "a4dbbe",
	"Household": "House18",
	"Space": "Space286",
	"Room_Type": "Kitchen",
	"timestamp": "2014-11-26T20:00:00Z",
	"Air_humidity": "53",
	"Nominal_temperature": "17",
	"Actual_temperature": "None",
	"Air_temperature": "20.198",
	"Rel_humidity": "57.063",
	"Intensity": "35.5",
	"Brightness": "None",
	"Climate_Air_temperature": "7.474",
	"Climate_Rel_humidity": "97.6",
	"Climate_Wind_speed": "0.566"
}