{
	"ID": "House19Space3072015-04-07T08:00:00Z",
	"IDhash": "f124a5",
	"Household": "House19",
	"Space": "Space307",
	"Room_Type": "Bathroom",
	"timestamp": "2015-04-07T08:00:00Z",
	"Air_humidity": "56",
	"Nominal_temperature": "None",
	"Actual_temperature": "22.5",
	"Air_temperature": "22.968",
	"Rel_humidity": "47.749",
	"Intensity": "82.8",
	"Brightness": "None",
	"Climate_Air_temperature": "5.908",
	"Climate_Rel_humidity": "96.2",
	"Climate_Wind_speed": "0.771"
}