{
	"ID": "House9Space1452014-10-21T09:30:00Z",
	"IDhash": "a2e6df",
	"Household": "House9",
	"Space": "Space145",
	"Room_Type": "Living room",
	"timestamp": "2014-10-21T09:30:00Z",
	"Air_humidity": "69",
	"Nominal_temperature": "None",
	"Actual_temperature": "19.5",
	"Air_temperature": "20.674",
	"Rel_humidity": "69.52",
	"Intensity": "19.7",
	"Brightness": "63",
	"Climate_Air_temperature": "11.24",
	"Climate_Rel_humidity": "68.02",
	"Climate_Wind_speed": "4.933"
}