{
	"ID": "House15Space2312015-03-17T06:30:00Z",
	"IDhash": "c8dcd7",
	"Household": "House15",
	"Space": "Space231",
	"Room_Type": "Kitchen",
	"timestamp": "2015-03-17T06:30:00Z",
	"Air_humidity": "51",
	"Nominal_temperature": "None",
	"Actual_temperature": "None",
	"Air_temperature": "20.984",
	"Rel_humidity": "43.828",
	"Intensity": "19.7",
	"Brightness": "29",
	"Climate_Air_temperature": "3.327",
	"Climate_Rel_humidity": "93.3",
	"Climate_Wind_speed": "0.52"
}