{
	"ID": "House4Space452014-12-04T17:30:00Z",
	"IDhash": "f8b31e",
	"Household": "House4",
	"Space": "Space45",
	"Room_Type": "Living room",
	"timestamp": "2014-12-04T17:30:00Z",
	"Air_humidity": "59",
	"Nominal_temperature": "None",
	"Actual_temperature": "22.5",
	"Air_temperature": "21.963",
	"Rel_humidity": "52.952",
	"Intensity": "11.8",
	"Brightness": "None",
	"Climate_Air_temperature": "3.887",
	"Climate_Rel_humidity": "90.2",
	"Climate_Wind_speed": "0.29"
}