{
	"ID": "House6Space932015-03-08T01:45:00Z",
	"IDhash": "d6e9d1",
	"Household": "House6",
	"Space": "Space93",
	"Room_Type": "Living room",
	"timestamp": "2015-03-08T01:45:00Z",
	"Air_humidity": "48",
	"Nominal_temperature": "None",
	"Actual_temperature": "19",
	"Air_temperature": "19.912",
	"Rel_humidity": "47.109",
	"Intensity": "11.8",
	"Brightness": "None",
	"Climate_Air_temperature": "7.355",
	"Climate_Rel_humidity": "87.8",
	"Climate_Wind_speed": "1.323"
}