{
	"ID": "House10Space1572014-09-12T01:30:00Z",
	"IDhash": "dfdebb",
	"Household": "House10",
	"Space": "Space157",
	"Room_Type": "Living room",
	"timestamp": "2014-09-12T01:30:00Z",
	"Air_humidity": "56",
	"Nominal_temperature": "None",
	"Actual_temperature": "19.5",
	"Air_temperature": "19.841",
	"Rel_humidity": "54.299",
	"Intensity": "11.8",
	"Brightness": "None",
	"Climate_Air_temperature": "10.09",
	"Climate_Rel_humidity": "93",
	"Climate_Wind_speed": "0.314"
}