{
	"ID": "House18Space2842014-12-14T08:30:00Z",
	"IDhash": "277c26",
	"Household": "House18",
	"Space": "Space284",
	"Room_Type": "Living room",
	"timestamp": "2014-12-14T08:30:00Z",
	"Air_humidity": "None",
	"Nominal_temperature": "15",
	"Actual_temperature": "18",
	"Air_temperature": "18.176",
	"Rel_humidity": "45.817",
	"Intensity": "11.8",
	"Brightness": "None",
	"Climate_Air_temperature": "4.468",
	"Climate_Rel_humidity": "87.3",
	"Climate_Wind_speed": "2.28"
}