{
	"ID": "House19Space3042015-04-15T22:00:00Z",
	"IDhash": "a02092",
	"Household": "House19",
	"Space": "Space304",
	"Room_Type": "Living room",
	"timestamp": "2015-04-15T22:00:00Z",
	"Air_humidity": "58",
	"Nominal_temperature": "None",
	"Actual_temperature": "21",
	"Air_temperature": "21.056",
	"Rel_humidity": "51.669",
	"Intensity": "19.7",
	"Brightness": "None",
	"Climate_Air_temperature": "10.95",
	"Climate_Rel_humidity": "78.42",
	"Climate_Wind_speed": "1.124"
}