{
	"ID": "House6Space962015-02-28T11:00:00Z",
	"IDhash": "cb0e81",
	"Household": "House6",
	"Space": "Space96",
	"Room_Type": "Kitchen",
	"timestamp": "2015-02-28T11:00:00Z",
	"Air_humidity": "None",
	"Nominal_temperature": "13.5",
	"Actual_temperature": "17.5",
	"Air_temperature": "18.913",
	"Rel_humidity": "49.877",
	"Intensity": "19.7",
	"Brightness": "None",
	"Climate_Air_temperature": "8.74",
	"Climate_Rel_humidity": "91.2",
	"Climate_Wind_speed": "1.258"
}