{
	"ID": "House13Space2122014-10-27T23:30:00Z",
	"IDhash": "cdbd25",
	"Household": "House13",
	"Space": "Space212",
	"Room_Type": "Bathroom",
	"timestamp": "2014-10-27T23:30:00Z",
	"Air_humidity": "61",
	"Nominal_temperature": "None",
	"Actual_temperature": "21.5",
	"Air_temperature": "22.25",
	"Rel_humidity": "62.662",
	"Intensity": "11.8",
	"Brightness": "None",
	"Climate_Air_temperature": "14.35",
	"Climate_Rel_humidity": "89.6",
	"Climate_Wind_speed": "0.811"
}