{
	"ID": "House4Space492015-02-11T09:00:00Z",
	"IDhash": "480496",
	"Household": "House4",
	"Space": "Space49",
	"Room_Type": "Kitchen",
	"timestamp": "2015-02-11T09:00:00Z",
	"Air_humidity": "None",
	"Nominal_temperature": "None",
	"Actual_temperature": "20.5",
	"Air_temperature": "20.531",
	"Rel_humidity": "37.494",
	"Intensity": "19.7",
	"Brightness": "49",
	"Climate_Air_temperature": "3.705",
	"Climate_Rel_humidity": "83.6",
	"Climate_Wind_speed": "0.323"
}