{
	"ID": "House16Space2532015-02-15T21:30:00Z",
	"IDhash": "01beb3",
	"Household": "House16",
	"Space": "Space253",
	"Room_Type": "Living room",
	"timestamp": "2015-02-15T21:30:00Z",
	"Air_humidity": "None",
	"Nominal_temperature": "None",
	"Actual_temperature": "20.5",
	"Air_temperature": "20.674",
	"Rel_humidity": "51.898",
	"Intensity": "11.8",
	"Brightness": "46",
	"Climate_Air_temperature": "6.373",
	"Climate_Rel_humidity": "81.5",
	"Climate_Wind_speed": "1.12"
}