{
	"ID": "House15Space2312015-04-05T17:30:00Z",
	"IDhash": "40c0ea",
	"Household": "House15",
	"Space": "Space231",
	"Room_Type": "Kitchen",
	"timestamp": "2015-04-05T17:30:00Z",
	"Air_humidity": "56",
	"Nominal_temperature": "None",
	"Actual_temperature": "18",
	"Air_temperature": "19.318",
	"Rel_humidity": "48.297",
	"Intensity": "35.5",
	"Brightness": "None",
	"Climate_Air_temperature": "12.89",
	"Climate_Rel_humidity": "69.1",
	"Climate_Wind_speed": "1.003"
}