{
	"ID": "House9Space1452015-02-05T04:00:00Z",
	"IDhash": "0fa459",
	"Household": "House9",
	"Space": "Space145",
	"Room_Type": "Living room",
	"timestamp": "2015-02-05T04:00:00Z",
	"Air_humidity": "50",
	"Nominal_temperature": "None",
	"Actual_temperature": "17.5",
	"Air_temperature": "17.486",
	"Rel_humidity": "46.584",
	"Intensity": "11.8",
	"Brightness": "None",
	"Climate_Air_temperature": "1.711",
	"Climate_Rel_humidity": "79.34",
	"Climate_Wind_speed": "1.953"
}