{
	"ID": "House13Space2092015-01-08T08:00:00Z",
	"IDhash": "7ad0b2",
	"Household": "House13",
	"Space": "Space209",
	"Room_Type": "Ensuite",
	"timestamp": "2015-01-08T08:00:00Z",
	"Air_humidity": "None",
	"Nominal_temperature": "6",
	"Actual_temperature": "24.5",
	"Air_temperature": "22.537",
	"Rel_humidity": "50.296",
	"Intensity": "3.9",
	"Brightness": "None",
	"Climate_Air_temperature": "8.95",
	"Climate_Rel_humidity": "77.79",
	"Climate_Wind_speed": "2.064"
}