{
	"ID": "House6Space962014-12-27T17:30:00Z",
	"IDhash": "3c65c8",
	"Household": "House6",
	"Space": "Space96",
	"Room_Type": "Kitchen",
	"timestamp": "2014-12-27T17:30:00Z",
	"Air_humidity": "45",
	"Nominal_temperature": "16.5",
	"Actual_temperature": "None",
	"Air_temperature": "16.773",
	"Rel_humidity": "46.274",
	"Intensity": "11.8",
	"Brightness": "None",
	"Climate_Air_temperature": "0.412",
	"Climate_Rel_humidity": "94.9",
	"Climate_Wind_speed": "1.398"
}