{
	"ID": "House18Space2862015-03-27T22:30:00Z",
	"IDhash": "e241b6",
	"Household": "House18",
	"Space": "Space286",
	"Room_Type": "Kitchen",
	"timestamp": "2015-03-27T22:30:00Z",
	"Air_humidity": "39",
	"Nominal_temperature": "None",
	"Actual_temperature": "23",
	"Air_temperature": "22.058",
	"Rel_humidity": "44.757",
	"Intensity": "43.4",
	"Brightness": "None",
	"Climate_Air_temperature": "6.585",
	"Climate_Rel_humidity": "72.3",
	"Climate_Wind_speed": "0.876"
}