{
	"ID": "House10Space1612015-01-16T06:30:00Z",
	"IDhash": "749164",
	"Household": "House10",
	"Space": "Space161",
	"Room_Type": "Bathroom",
	"timestamp": "2015-01-16T06:30:00Z",
	"Air_humidity": "None",
	"Nominal_temperature": "20",
	"Actual_temperature": "16",
	"Air_temperature": "18.889",
	"Rel_humidity": "38.367",
	"Intensity": "19.7",
	"Brightness": "None",
	"Climate_Air_temperature": "4.569",
	"Climate_Rel_humidity": "83.5",
	"Climate_Wind_speed": "3.185"
}