{
	"ID": "House13Space2092014-12-30T06:00:00Z",
	"IDhash": "da3906",
	"Household": "House13",
	"Space": "Space209",
	"Room_Type": "Ensuite",
	"timestamp": "2014-12-30T06:00:00Z",
	"Air_humidity": "46",
	"Nominal_temperature": "None",
	"Actual_temperature": "20",
	"Air_temperature": "20.531",
	"Rel_humidity": "46.743",
	"Intensity": "3.9",
	"Brightness": "None",
	"Climate_Air_temperature": "-2.817",
	"Climate_Rel_humidity": "95.3",
	"Climate_Wind_speed": "0.332"
}