{
	"ID": "House12Space1842015-02-25T19:00:00Z",
	"IDhash": "2f29dd",
	"Household": "House12",
	"Space": "Space184",
	"Room_Type": "Kitchen",
	"timestamp": "2015-02-25T19:00:00Z",
	"Air_humidity": "54",
	"Nominal_temperature": "None",
	"Actual_temperature": "17",
	"Air_temperature": "21.151",
	"Rel_humidity": "40.263",
	"Intensity": "11.8",
	"Brightness": "None",
	"Climate_Air_temperature": "9.48",
	"Climate_Rel_humidity": "81.8",
	"Climate_Wind_speed": "0.777"
}