{
	"ID": "House4Space452014-10-12T19:00:00Z",
	"IDhash": "d9bc9c",
	"Household": "House4",
	"Space": "Space45",
	"Room_Type": "Living room",
	"timestamp": "2014-10-12T19:00:00Z",
	"Air_humidity": "68",
	"Nominal_temperature": "None",
	"Actual_temperature": "20",
	"Air_temperature": "20.603",
	"Rel_humidity": "65.211",
	"Intensity": "11.8",
	"Brightness": "None",
	"Climate_Air_temperature": "11.05",
	"Climate_Rel_humidity": "90.9",
	"Climate_Wind_speed": "1.636"
}