{
	"ID": "House16Space2532015-02-12T19:30:00Z",
	"IDhash": "be23ff",
	"Household": "House16",
	"Space": "Space253",
	"Room_Type": "Living room",
	"timestamp": "2015-02-12T19:30:00Z",
	"Air_humidity": "44",
	"Nominal_temperature": "None",
	"Actual_temperature": "18.5",
	"Air_temperature": "18.295",
	"Rel_humidity": "41.69",
	"Intensity": "11.8",
	"Brightness": "None",
	"Climate_Air_temperature": "3.398",
	"Climate_Rel_humidity": "78.3",
	"Climate_Wind_speed": "0.976"
}