{
	"ID": "House13Space2092015-03-11T08:00:00Z",
	"IDhash": "643fac",
	"Household": "House13",
	"Space": "Space209",
	"Room_Type": "Ensuite",
	"timestamp": "2015-03-11T08:00:00Z",
	"Air_humidity": "42",
	"Nominal_temperature": "6",
	"Actual_temperature": "None",
	"Air_temperature": "21.628",
	"Rel_humidity": "47.198",
	"Intensity": "3.9",
	"Brightness": "None",
	"Climate_Air_temperature": "3.148",
	"Climate_Rel_humidity": "87.2",
	"Climate_Wind_speed": "1.495"
}