{
	"ID": "House18Space2862015-02-28T16:00:00Z",
	"IDhash": "6d140c",
	"Household": "House18",
	"Space": "Space286",
	"Room_Type": "Kitchen",
	"timestamp": "2015-02-28T16:00:00Z",
	"Air_humidity": "37",
	"Nominal_temperature": "None",
	"Actual_temperature": "25.5",
	"Air_temperature": "22.202",
	"Rel_humidity": "45.288",
	"Intensity": "35.5",
	"Brightness": "None",
	"Climate_Air_temperature": "10.08",
	"Climate_Rel_humidity": "75.19",
	"Climate_Wind_speed": "1.895"
}