{
	"ID": "House6Space1082014-12-24T08:30:00Z",
	"IDhash": "ccd74f",
	"Household": "House6",
	"Space": "Space108",
	"Room_Type": "Bathroom",
	"timestamp": "2014-12-24T08:30:00Z",
	"Air_humidity": "66",
	"Nominal_temperature": "None",
	"Actual_temperature": "20.5",
	"Air_temperature": "18.961",
	"Rel_humidity": "65.403",
	"Intensity": "11.8",
	"Brightness": "None",
	"Climate_Air_temperature": "6.157",
	"Climate_Rel_humidity": "79.59",
	"Climate_Wind_speed": "2.431"
}