{
	"ID": "House14Space2232014-11-24T22:00:00Z",
	"IDhash": "a49af7",
	"Household": "House14",
	"Space": "Space223",
	"Room_Type": "Bedroom",
	"timestamp": "2014-11-24T22:00:00Z",
	"Air_humidity": "None",
	"Nominal_temperature": "16",
	"Actual_temperature": "15.5",
	"Air_temperature": "17.796",
	"Rel_humidity": "50.476",
	"Intensity": "11.8",
	"Brightness": "None",
	"Climate_Air_temperature": "0.708",
	"Climate_Rel_humidity": "96.7",
	"Climate_Wind_speed": "0.231"
}