{
	"ID": "House18Space2842015-02-27T18:00:00Z",
	"IDhash": "2628f8",
	"Household": "House18",
	"Space": "Space284",
	"Room_Type": "Living room",
	"timestamp": "2015-02-27T18:00:00Z",
	"Air_humidity": "None",
	"Nominal_temperature": "21",
	"Actual_temperature": "None",
	"Air_temperature": "19.413",
	"Rel_humidity": "45.015",
	"Intensity": "11.8",
	"Brightness": "9",
	"Climate_Air_temperature": "7.019",
	"Climate_Rel_humidity": "66.48",
	"Climate_Wind_speed": "0.714"
}