{
	"ID": "House13Space2122014-12-31T16:30:00Z",
	"IDhash": "f8422b",
	"Household": "House13",
	"Space": "Space212",
	"Room_Type": "Bathroom",
	"timestamp": "2014-12-31T16:30:00Z",
	"Air_humidity": "37",
	"Nominal_temperature": "None",
	"Actual_temperature": "16",
	"Air_temperature": "17.415",
	"Rel_humidity": "37.922",
	"Intensity": "11.8",
	"Brightness": "None",
	"Climate_Air_temperature": "5.995",
	"Climate_Rel_humidity": "90.5",
	"Climate_Wind_speed": "0.963"
}