{
	"ID": "House4Space492015-04-18T11:30:00Z",
	"IDhash": "360ccf",
	"Household": "House4",
	"Space": "Space49",
	"Room_Type": "Kitchen",
	"timestamp": "2015-04-18T11:30:00Z",
	"Air_humidity": "48",
	"Nominal_temperature": "None",
	"Actual_temperature": "18",
	"Air_temperature": "20.341",
	"Rel_humidity": "40.305",
	"Intensity": "461.2",
	"Brightness": "None",
	"Climate_Air_temperature": "12.65",
	"Climate_Rel_humidity": "52.63",
	"Climate_Wind_speed": "3.441"
}