{
	"ID": "House13Space2122015-04-20T19:30:00Z",
	"IDhash": "01f43e",
	"Household": "House13",
	"Space": "Space212",
	"Room_Type": "Bathroom",
	"timestamp": "2015-04-20T19:30:00Z",
	"Air_humidity": "41",
	"Nominal_temperature": "6",
	"Actual_temperature": "None",
	"Air_temperature": "25.647",
	"Rel_humidity": "39.633",
	"Intensity": "19.7",
	"Brightness": "None",
	"Climate_Air_temperature": "12.87",
	"Climate_Rel_humidity": "67.74",
	"Climate_Wind_speed": "1.217"
}