{
	"ID": "House6Space962015-04-20T09:15:00Z",
	"IDhash": "c1c2de",
	"Household": "House6",
	"Space": "Space96",
	"Room_Type": "Kitchen",
	"timestamp": "2015-04-20T09:15:00Z",
	"Air_humidity": "43",
	"Nominal_temperature": "None",
	"Actual_temperature": "18.5",
	"Air_temperature": "18.224",
	"Rel_humidity": "47.967",
	"Intensity": "43.4",
	"Brightness": "None",
	"Climate_Air_temperature": "5.804",
	"Climate_Rel_humidity": "93.3",
	"Climate_Wind_speed": "0.92"
}