{
	"ID": "House6Space962015-03-12T08:30:00Z",
	"IDhash": "43692f",
	"Household": "House6",
	"Space": "Space96",
	"Room_Type": "Kitchen",
	"timestamp": "2015-03-12T08:30:00Z",
	"Air_humidity": "49",
	"Nominal_temperature": "None",
	"Actual_temperature": "19.5",
	"Air_temperature": "18.485",
	"Rel_humidity": "47.56",
	"Intensity": "11.8",
	"Brightness": "None",
	"Climate_Air_temperature": "9.45",
	"Climate_Rel_humidity": "80.9",
	"Climate_Wind_speed": "1.559"
}