{
	"ID": "House19Space3072015-02-03T06:30:00Z",
	"IDhash": "82d54c",
	"Household": "House19",
	"Space": "Space307",
	"Room_Type": "Bathroom",
	"timestamp": "2015-02-03T06:30:00Z",
	"Air_humidity": "58",
	"Nominal_temperature": "None",
	"Actual_temperature": "18",
	"Air_temperature": "19.865",
	"Rel_humidity": "77.489",
	"Intensity": "122.2",
	"Brightness": "None",
	"Climate_Air_temperature": "-0.262",
	"Climate_Rel_humidity": "85.6",
	"Climate_Wind_speed": "0.606"
}