{
	"ID": "House16Space2532014-11-27T08:00:00Z",
	"IDhash": "501059",
	"Household": "House16",
	"Space": "Space253",
	"Room_Type": "Living room",
	"timestamp": "2014-11-27T08:00:00Z",
	"Air_humidity": "57",
	"Nominal_temperature": "None",
	"Actual_temperature": "20",
	"Air_temperature": "19.532",
	"Rel_humidity": "55.519",
	"Intensity": "11.8",
	"Brightness": "None",
	"Climate_Air_temperature": "7.45",
	"Climate_Rel_humidity": "97.8",
	"Climate_Wind_speed": "0.355"
}