aniso8601==9.0.1
appdirs==1.4.4
certifi==2020.12.5
click==8.0.0
distlib==0.3.1
filelock==3.0.12
Flask==1.1.2
Flask-RESTful==0.3.8
Flask-Script==2.0.6
greenlet==1.1.0
itsdangerous==2.0.0
Jinja2==3.0.0
MarkupSafe==2.0.0
pytz==2021.1
six==1.16.0
SQLAlchemy==1.4.15
virtualenv==20.4.6
Werkzeug==2.0.0
