"comment"                                 , "name"             ,"json", "value"
"Blue base (seconds)"                     , "base_blue"        ,"0"   , "10"
"Blue offset (f/stops)"                   , "offset_blue"      ,"1"   , "[0]"
"Blue disable yes(1), no(0)"              , "disable_blue"     ,"1"   , "[0]"
"Green base (seconds)"                    , "base_green"       ,"0"   , "10"
"Green offset (f/stops)"                  , "offset_green"     ,"1"   , "[0]"
"Green disable yes(1),no(0)"              , "disable_green"    ,"1"   , "[0]"
"Postflash (seconds)"                     , "postflash"        ,"0"   , "0"
"Preflash (seconds)"                      , "preflash"         ,"0"   , "0"
"Height (cms)"                            , "height"           ,"0"   , "32"
"Test progressive(1)/independant(0)"      , "test_flag"        ,"0"   , "0"
"Current program step"                    , "prog_step"        ,"0"   , "1"
"Program delay (seconds, -1: manual)"     , "prog_delay"       ,"0"   , "5"
"Exposure simultaneous(1), consecutive(0)", "exp_flag"         ,"0"   , "0"
"Lens"                                    , "lens_id"          ,"0"   , "1"
"Aperture"                                , "aperture"         ,"0"   , "4"
"Film"                                    , "film_id"          ,"0"   , "1"
"EI"                                      , "ei"               ,"0"   , "400"
"Roll"                                    , "roll_id"          ,"0"   , "1"
"Frame"                                   , "frame_id"         ,"0"   , "1"
"Number of past exposures to save"        , "number_to_save"   ,"0"   , "15"
"Test base blue start offset"             , "test_blue_end"    ,"0"   , "0"
"Test base blue end offset"               , "test_blue_start"  ,"0"   , "0"
"Test base green start offset"            , "test_green_end"   ,"0"   , "0"
"Test base green end offset"              , "test_green_start" ,"0"   , "0"
"Test green mode"                         , "test_green_mode"  ,"0"   , "0"
"Test green mode"                         , "test_blue_mode"   ,"0"   , "0"
"Test steps"                              , "test_steps"       ,"0"   , "5"