0.0182
0.020764
0.058506
0.019147
0.0182
0.021719
0.08102
0.022023
0.0054348
0.0032367
0.0047583
0.0051904
0.0051266
0.005563
0.01399
0.0057143
0.010647
0.0051771
0.0056654
0.0079215
0.0087941
0.0081944
0.0064436
0.0099585
0.00055332
0.0047815
0.019519
0.0022359
0.00025325
0.00031051
0.022942
0.00014281
0.0013795
0.0072547
0.027136
0.003612
0.0038936
0.0074097
0.036513
0.0056926
0.0021884
0.0010431
0.0011449
0.0023328
0.001652
0.0012666
0.001144
0.0023902
0.0011797
0.00096057
0.00066063
0.0010639
0.002425
0.0039049
0.0009095
0.0016154
0.0028291
0.00077612
0.00067097
0.0014001
0.0029515
0.0035467
0.00017438
0.0018746
0.0017179
0.0014366
0.00078745
0.0021561
0.0030643
0.0035849
0.00071761
0.0016978
0.0012936
0.00027005
0.0013111
0.00052282
5.4195e-05
0.00028566
0.0050848
0.0010122
0.00077314
0.00090788
0.0013625
0.0012708
0.00099544
0.00010585
0.0064496
0.00064392
0.0026548
0.0023226
0.0033222
0.0034106
0.0021258
0.00044042
0.0029776
0.0027715
0.0034454
0.00042961
0.00062124
0.00058436
0.00054881
0.00062242
0.0022289
0.0036145
0.00024415
0.0017752
0.0050952
0.00096809
0.00013757
0.00031051
0.0024795
0
0
0.0013936
0.0025726
0.00013459
0
0
0.013287
5.2607e-05
0.00093345
0.0033132
0.0087535
0.0022482
0
0.0014702
0.0050816
0.0012216
0
0.00084445
0.0037102
0.00062844
0.0025967
0.0029854
0.008316
0.00054492
0.00030917
0.0013599
0.0087741
0.00111
0.00011569
0
0
0.00014281
0
0
0.002779
2.3216e-05
0
0
0.0070029
0
7.0468e-05
0.0020012
0.0047593
0.00090103
0.00047066
0.0018521
0.011605
0.0019364
0.00037558
0.0012948
0.0092772
0.00020453
0.00093
0.001102
0.010704
0.0017024
0.00085045
0
4.9217e-06
0.00017514
0.00064792
0.00015824
5.6119e-05
0.00018795
0.00032719
9.3026e-05
0.00023581
0.00063093
0.00024599
0
0.00010121
0.00040003
0.0002486
0.00018955
0
0.00046708
0.00048781
0
2.5336e-05
0.00050518
0.00015638
0
2.7892e-05
0.00045854
0.00046435
0.00046634
0.00013122
0.00026882
0.0006635
0
0
0.00066176
0.00021176
3.844e-05
0
0.00053877
0.00035615
0.00016526
0
0
0.00070547
0
2.9633e-05
0.00036323
0.00046553
6.3507e-05
0
0.00019433
0.00082757
0
0
0.00031088
0.00049254
6.9298e-05
0.00014992
0.00083809
0.00041322
5.66e-05
0.00026868
0.00057783
0.00025358
0
0.000228
0.0013988
0
0.00050114
0.00060335
0.0012399
0.00030854
0.00052373
0.00061961
0.00012794
0.00067672
0.0006072
7.5809e-05
0.00049626
0.00063884
0.00028844
0.00013672
5.4139e-05
0.00076939
0.0013502
0.00012247
0.00018104
0.00038112
0.00011794
0.00025984
0
0.00078479
0.0018299
0.00021785
0.0004574
0.00023956
0.00037025
0.0003531
8.4174e-05
0.00077475
0.00084237
0
0.00064682
0.00087445
0.00029705
0.00034168
0.00057567
0.00094696
0.0015426
0
0.00038143
0.00048375
0.00034795
0.00038638
0.00060971
0.00073849
0.001174
0
0.00028845
9.8595e-05
0.00058728
0.00014507
0.00047493
0.00095388
0.0019564
0.00023825
0
0.0010122
0.00013783
0
0
0
0
0.00051692
0.00068878
0.00023059
0.00029481
0
0
5.4195e-05
0.00013291
0.0022345
0.00032337
0.00042007
0.00035676
0.00037812
5.617e-05
0
0.00036433
0.00017333
0.00031298
0.00028399
0.00027454
0
0.00056356
0.00081502
0
0.0016466
0.00023662
0.00064126
8.254e-05
0.00026591
0.00043129
0.00062171
0.00025379
0
0.00048686
0.00032682
9.8987e-05
0
0.00024888
0.0001936
0
0.00026308
0
0.00043604
4.9463e-05
0
0.00027773
0.00020479
0.00022872
0
0.00015377
0.00051598
0.00027707
0.0001636
6.4595e-05
0.0002197
0.00026049
0.0001112
0.00060349
0.00014334
0.00016244
0.0011002
0.00052282
0
0
0
0
0
0
0
0
0
0.00015275
0.002189
0
0
0.00050461
0.00076739
0.00012719
0
0
0
0
4.4021e-05
0
0.0001095
0.00032792
0
0
0.0043883
0
0.00013992
0.0013341
0.00081745
0.0015216
0.00036286
8.1208e-05
0.0019574
0.00013126
0.0012732
0.00070281
0.00092372
0.0006136
0.00073648
0.00035921
0.00082592
0.0014693
0.0023665
2.9633e-05
0.0011916
0.00036481
0
0.00030925
0.00074699
0.0024185
0.00058754
0
0.00012599
0
0
0.00015082
0.0007931
0.00085277
0.00013298
0.00082422
0.0025649
0.00026932
0
0
0
0
0
0
0
0
0
0.00031051
0.0021935
0
0
0.00066028
0.00061239
0
0
0
0
0
0
3.4975e-05
0.00021699
0
0
0
0.0053262
0
0.0003989
0.000614
0.0021166
0.0011891
0.00026528
0
0.00051831
0.00019969
0.0003336
0.0013315
0.0022484
0.001212
0.0001727
0.00031965
0.0015595
0.00054716
0
0
0.0019104
2.4609e-06
0
0.00014636
0.00089342
0
0
0.00065817
0.00064804
0
0
0.00034038
0.0029562
0
0
0.00067914
0.002579
0.00069877
0.00013757
0
0
0
0
0
0
0
0
0
0
0
0
0.0003684
0.00043839
0
0
0
0.0027836
0
0
0
0.0012973
0
0
0
0.0045525
0
0
0
9.8412e-05
0.00014938
0
6.1718e-05
0.00058506
0.00014402
0.00029626
0.001326
0.0035566
0.00024553
0
0.0010101
0.0016222
0.00038331
7.6973e-05
0.00032054
0.0012693
0.00011539
0
0.0004406
0.001744
0
0
0
0
0.0003106
0.001663
0.001496
0.0018944
0.00019416
0.00011118
0.00040957
0.0023475
0.00049762
0
0
0
0
0.00015148
0.00016578
0.00066515
0
0
0
0
0
0
5.3746e-05
2.8804e-05
0.00011306
0
0
0.0025683
0
0
0.0001379
0.0011535
0
0
0
0
0
0
0
0
0
0
0
0.004919
0
0
0.00058385
0.0026468
0
0.00036047
0.00038751
0.0018394
0.0011681
0
0.00018287
0.0028236
0.00076915
0
0
0.0021387
0.00019725
0
0.00015311
0.00025418
0
0
0
0.0038815
0
0
0.00022491
0.0024971
0
0
0
0
0
0.00015769
0.00083151
0.0022649
0.00038154
0.00011569
0
0
0.00014281
0
0
0
0
0
0
0.0028821
0
0
0
0.0014033
0
0
0
0
0
0
0
0
0
0
0
0.0051792
0
0
0.00079148
0.0014684
0.0001511
0
0.00057677
0.00063117
0
7.0468e-05
0.0015011
0.004082
4.6431e-05
0.00060324
0.000946
0.0019156
0.00057111
0
0
0.0014475
0.00013888
0.00032676
0.00047747
0.0024264
0.00092069
