{
	"account_policies": {
		"set_remembered_passwd_hist": {
			"fix_description": "Set remembered password history",
			"env_vars": {
				"setting_should_not_be_present_initially": true,
				"correct_value_min": 10,
				"correct_value_max": null
			},
			"setup_cmd": "setup/set_remembered_passwd_hist.sh",
			"fix_cmd": null,
			"check_cmd": "num_remember=$(grep -vE '^\\s*#' /etc/pam.d/common-password | grep 'pam_unix\\.so' | grep -Po 'remember=\\d+' | grep -Po '\\d+') && bash_utils/is_value_in_range.sh $num_remember",
			"check_cmd_exit_code": 0
		},

		"set_min_passwd_length": {
			"fix_description": "Set minimum password length",
			"env_vars": {
				"setting_should_not_be_present_initially": true,
				"correct_value_min": 10,
				"correct_value_max": null
			},
			"setup_cmd": "setup/set_min_passwd_len.sh",
			"fix_cmd": null,
			"check_cmd": "minlen=$(grep -vE '^\\s*#' /etc/pam.d/common-password | grep 'pam_unix\\.so' | grep -Po 'minlen=\\d+' | grep -Po '\\d+') && bash_utils/is_value_in_range.sh $minlen",
			"check_cmd_exit_code": 0
		}, 

		"install_auditd" : {
			"fix_description": "Installed auditd",
			"env_vars": {
				"setting_should_not_be_present_initially": true,
				"correct_value_min": 10,
				"correct_value_max": null
			},
			"setup_cmd": "setup/install_auditd.sh",
			"fix_cmd": null,
			"check_cmd": "[[ -e /etc/audit/auditd.conf ]]",
			"check_cmd_exit_code": 0
		},

		"set_passwd_mgr" : {
			"fix_description": "Set key for 'password_manager'",
			"env_vars": {
				"setting_should_not_be_present_initially": false,
				"correct_value_min": 10,
				"correct_value_max": null
			},
			"setup_cmd": "echo -e 'key=KEY\nsecret=SECRET' > ~/.bitbucket",
			"fix_cmd": null,
			"check_cmd": "[[ -e ~/.bitbucket ]]",
			"check_cmd_exit_code": 0
		},

		"set_install_updates_from_xenial_updates" : {
			"fix_description": "Ubuntu installs updates from the main update repository",
			"env_vars": {
				"setting_should_not_be_present_initially": false,
				"correct_value_min": 10,
				"correct_value_max": null
			},
			"setup_cmd": "/bin/false",
			"fix_cmd": null,
			"check_cmd": "grep -q 'deb http\\://us\\.archive\\.ubuntu\\.com/ubuntu/ xenial-updates main universe multiverse restricted' /etc/apt/sources.list",
			"check_cmd_exit_code": 0
		},

		"set_passwd_complexity_reqs" : {
			"fix_description": "Set password complexity requirements",
			"env_vars": {
				"setting_should_not_be_present_initially": true
			},
			"setup_cmd": "setup/set_passwd_complexity_reqs.sh",
			"fix_cmd": null,
			"check_cmd": "grep -vE '^\\s*#' /etc/pam.d/common-password | grep 'pam_cracklib\\.so' | grep 'ucredit=-1' | grep 'lcredit=-1' | grep 'dcredit=-1' | grep -q 'ocredit=-1' # THIS COMMAND IS NOT PERFECT AND SHOULD BE MADE BULLETPROOF AT SOME POINT",
			"check_cmd_exit_code": 0
		}
	},

	"auditing": [

	]
}