Division,WeightClassKg,Place,Name,Team,BodyweightKg,Best3SquatKg,Best3BenchKg,Best3DeadliftKg,TotalKg,Equipment,Event,Sex
Girls,47.85,1,Jasmine Bruner,Fort Worth Western Hills,45.18,65.77,29.48,72.57,167.83,Single-ply,SBD,F
Girls,47.85,2,Andrea Olivera,Fort Worth Paschal,47.63,47.63,24.95,56.7,129.27,Single-ply,SBD,F
Girls,51.94,1,Karla Garcia,Fort Worth Paschal,51.71,43.09,29.48,52.16,124.74,Single-ply,SBD,F
Girls,51.94,DQ,Denise Ramirez,Fort Worth Paschal,50.35,43.09,,52.16,,Single-ply,SBD,F
Girls,56.02,1,Kristen Lummus,Fort Worth Western Hills,54.88,70.31,29.48,79.38,179.17,Single-ply,SBD,F
Girls,56.02,2,Vickie Basaldo,Fort Worth Paschal,54.88,52.16,24.95,52.16,129.27,Single-ply,SBD,F
Girls,60.1,1,Karla Orta,Fort Worth Paschal,59.87,83.91,38.56,74.84,197.31,Single-ply,SBD,F
Girls,67.36,1,Jocelyn Gaucin,Saginaw,65.54,83.91,45.36,97.52,226.8,Single-ply,SBD,F
Girls,67.36,2,Pam Nkusi,Saginaw,67.13,56.7,38.56,86.18,181.44,Single-ply,SBD,F
Girls,67.36,3,Evelyn Estrada,Fort Worth Western Hills,61.23,47.63,29.48,83.91,161.03,Single-ply,SBD,F
Girls,67.36,4,Katie Stewart,Fort Worth Western Hills,62.14,56.7,29.48,52.16,138.35,Single-ply,SBD,F
Girls,67.36,5,Tiara Jones,Saginaw,63.5,43.09,24.95,61.23,129.27,Single-ply,SBD,F
Girls,75.07,1,Regina Elizando,Fort Worth Western Hills,73.94,65.77,29.48,88.45,183.7,Single-ply,SBD,F
Girls,75.07,2,Angelica Ibarra,Saginaw,73.94,74.84,29.48,74.84,179.17,Single-ply,SBD,F
Girls,75.07,3,Laura Garcia #6,Saginaw,73.48,56.7,20.41,61.23,138.35,Single-ply,SBD,F
Girls,82.33,1,Kaysha Velezquez,Saginaw,78.93,102.06,45.36,113.4,260.82,Single-ply,SBD,F
Girls,82.33,2,Erica Johnson,Fort Worth Western Hills,75.3,74.84,38.56,111.13,224.53,Single-ply,SBD,F
Girls,82.33,3,Nia Wilson,Saginaw,78.93,77.11,43.09,102.06,222.26,Single-ply,SBD,F
Girls,100.02,1,Catherine Lopsez,Fort Worth Western Hills,99.34,56.7,36.29,102.06,195.04,Single-ply,SBD,F
Girls,100.02,DQ,Perla Guitierrez,Fort Worth Western Hills,96.62,,,,,Single-ply,SBD,F
Girls,100.02+,1,Lizbeth Hernandez,White Settlement Brewer,102.51,147.42,56.7,124.74,328.85,Single-ply,SBD,F
Girls,100.02+,2,Dorothy Rodriguez,Saginaw,107.5,63.5,49.9,104.33,217.72,Single-ply,SBD,F
