Division,WeightClassKg,Place,Name,Team,BodyweightKg,Best3SquatKg,Best3BenchKg,Best3DeadliftKg,TotalKg,Equipment,Event,Sex
Boys,51.71,1,Michael Ramsey,Memphis,50.98,149.69,74.84,174.63,399.16,Single-ply,SBD,M
Boys,51.71,2,Jonathan Luna,Tulia,51.71,142.88,90.72,163.29,396.89,Single-ply,SBD,M
Boys,51.71,3,Jordan Ruiz,Seagraves,51.26,151.95,86.18,156.49,394.63,Single-ply,SBD,M
Boys,51.71,4,Edward Hernandez,Eldorado,49.99,161.03,79.38,149.69,390.09,Single-ply,SBD,M
Boys,55.79,5,Carlos Bravo,Olton,51.94,138.35,88.45,145.15,371.95,Single-ply,SBD,M
Boys,51.71,6,Van Phan,Alpine,51.71,138.35,70.31,136.08,344.73,Single-ply,SBD,M
Boys,51.71,7,Zack Sherrod,Anton,50.62,120.2,81.65,136.08,337.93,Single-ply,SBD,M
Boys,51.71,8,Gavon Gardner,Meadow,51.07,127.01,54.43,131.54,312.98,Single-ply,SBD,M
Boys,51.71,9,Erli Rueda,Bovina,51.35,108.86,56.7,136.08,301.64,Single-ply,SBD,M
Boys,55.79,DQ,Matthiew Cordova,Amarillo Highland Park,51.8,120.2,,,,Single-ply,SBD,M
Boys,59.87,1,Tomas Vega,Alpine,56.02,158.76,86.18,172.37,417.3,Single-ply,SBD,M
Boys,55.79,2,Kisan Valenzuela,Kermit,55.34,140.61,90.72,145.15,376.48,Single-ply,SBD,M
Boys,55.79,3,Jaxon Sullivan,Clyde,54.34,145.15,79.38,149.69,374.21,Single-ply,SBD,M
Boys,55.79,4,Gunnar McNeill,San Angelo Grape Creek,54.7,163.29,61.23,142.88,367.41,Single-ply,SBD,M
Boys,55.79,5,Adam Martin,Sudan,55.07,140.61,79.38,147.42,367.41,Single-ply,SBD,M
Boys,55.79,6,Julian Gaspar,Sunray,55.43,147.42,70.31,149.69,367.41,Single-ply,SBD,M
Boys,55.79,7,Gabriel Hancock,Bovina,53.61,140.61,72.57,140.61,353.8,Single-ply,SBD,M
Boys,55.79,8,Christian Perez,Post,53.61,147.42,65.77,133.81,347,Single-ply,SBD,M
Boys,59.87,9,Angel Samarron,Lazbuddie,56.02,145.15,68.04,131.54,344.73,Single-ply,SBD,M
Boys,55.79,10,Nate Martinez #1,Loraine,55.07,124.74,70.31,145.15,340.19,Single-ply,SBD,M
Boys,59.87,1,Edward Garza,Sonora,59.78,224.53,122.47,190.51,537.51,Single-ply,SBD,M
Boys,59.87,2,Ryan Hurst,San Angelo Grape Creek,59.42,199.58,88.45,204.12,492.15,Single-ply,SBD,M
Boys,59.87,3,Austin Martinez,Mertzon Irion County,59.15,195.04,117.93,174.63,487.61,Single-ply,SBD,M
Boys,59.87,4,Michael Vargas #1,Ozona,59.33,165.56,88.45,167.83,421.84,Single-ply,SBD,M
Boys,59.87,5,Gabe Zamora,Sudan,58.79,158.76,88.45,170.1,417.3,Single-ply,SBD,M
Boys,59.87,6,Corey Barker,Clarendon,59.51,158.76,97.52,149.69,405.97,Single-ply,SBD,M
Boys,59.87,7,Carlos Sosa,Muleshoe,59.51,158.76,77.11,163.29,399.16,Single-ply,SBD,M
Boys,67.13,8,Landon Morgan,Sundown,60.06,127.01,83.91,167.83,378.75,Single-ply,SBD,M
Boys,59.87,DQ,David Valdez,Eden,56.7,142.88,,,,Single-ply,SBD,M
Boys,67.13,DQ,Taylor Baum,Coleman,59.96,149.69,95.25,,,Single-ply,SBD,M
Boys,67.13,DQ,Tristin Cauthen,Clyde,60.1,,,,,Single-ply,SBD,M
Boys,67.13,1,Bryce DeVore,Hawley,65.41,208.65,102.06,204.12,514.83,Single-ply,SBD,M
Boys,67.13,2,Luis Rangel,Ballinger,66.86,190.51,124.74,195.04,510.29,Single-ply,SBD,M
Boys,67.13,3,Dakota Brewster,Clyde,66.13,188.24,113.4,181.44,483.08,Single-ply,SBD,M
Boys,67.13,4,Karlonte Jackson,Anton,66.59,195.04,83.91,190.51,469.47,Single-ply,SBD,M
Boys,67.13,5,Chance Cook,Tahoka,66.5,174.63,102.06,183.7,460.4,Single-ply,SBD,M
Boys,67.13,6,Broc Harris,Tulia,66.41,167.83,83.91,204.12,455.86,Single-ply,SBD,M
Boys,67.13,7,Jon Seabourn,Clyde,62.14,170.1,108.86,147.42,426.38,Single-ply,SBD,M
Boys,67.13,DQ,Michael Pardo,Hale Center,66.59,195.04,,,,Single-ply,SBD,M
Boys,67.13,DQ,Julian Paiz,Sundown,64.14,172.37,,,,Single-ply,SBD,M
Boys,67.13,DQ,DJ Brown,Post,62.87,174.63,111.13,,,Single-ply,SBD,M
Boys,74.84,1,Clancy Manuel,Hawley,73.48,244.94,122.47,219.99,587.4,Single-ply,SBD,M
Boys,74.84,2,Kneeland Donnelly,Hawley,70.13,222.26,136.08,204.12,562.45,Single-ply,SBD,M
Boys,74.84,3,Devon Hoelscher,Ballinger,73.75,188.24,127.01,183.7,498.95,Single-ply,SBD,M
Boys,74.84,4,Andrew Flores,Meadow,72.21,174.63,124.74,197.31,496.68,Single-ply,SBD,M
Boys,74.84,5,David Pineda,McCamey,73.39,197.31,122.47,174.63,494.42,Single-ply,SBD,M
Boys,74.84,6,Brandon Guerrero,Childress,71.4,181.44,99.79,204.12,485.34,Single-ply,SBD,M
Boys,74.84,7,Fernando Saucedo,Big Lake Reagan County,73.21,181.44,97.52,199.58,478.54,Single-ply,SBD,M
Boys,74.84,DQ,Justin Coker,Coahoma,72.39,215.46,,,,Single-ply,SBD,M
Boys,74.84,DQ,Jaime Ortiz #1,Crane,72.3,,,,,Single-ply,SBD,M
Boys,74.84,DQ,Jose Rangel,Roscoe,71.4,208.65,,,,Single-ply,SBD,M
Boys,82.1,1,Jesse Daniels,Ballinger,80.92,219.99,138.35,226.8,585.13,Single-ply,SBD,M
Boys,82.1,2,Peyton Rodriguez #1,Coahoma,81.01,217.72,131.54,222.26,571.53,Single-ply,SBD,M
Boys,82.1,3,Randy Zamora,Meadow,75.57,206.38,138.35,224.53,569.26,Single-ply,SBD,M
Boys,82.1,4,Roland Zamora,Meadow,79.47,215.46,122.47,222.26,560.19,Single-ply,SBD,M
Boys,82.1,5,Damon Gonzales,Dimmitt,81.92,215.46,127.01,206.38,548.85,Single-ply,SBD,M
Boys,82.1,6,Devin Martinez,Clyde,78.65,206.38,113.4,210.92,530.7,Single-ply,SBD,M
Boys,82.1,7,Landon Jones,Roscoe,79.65,199.58,108.86,199.58,508.02,Single-ply,SBD,M
Boys,82.1,DQ,Jeremy Mize,Sundown,77.84,195.04,,,,Single-ply,SBD,M
Boys,82.1,DQ,Aric Ramzanalli,Hawley,82.01,195.04,,,,Single-ply,SBD,M
Boys,82.1,DQ,Levi Irby,Hawley,81.47,226.8,,,,Single-ply,SBD,M
Boys,89.81,1,Austin Sellers,Hawley,88.09,238.14,183.7,263.08,684.92,Single-ply,SBD,M
Boys,89.81,2,Sheldon Libey,Cross Plains,89.18,233.6,136.08,219.99,589.67,Single-ply,SBD,M
Boys,89.81,3,Joseph Chavez,Lockney,89.36,226.8,142.88,201.85,571.53,Single-ply,SBD,M
Boys,89.81,4,Spencer Chance,Sundown,89.72,217.72,127.01,219.99,564.72,Single-ply,SBD,M
Boys,99.79,5,Auggie Woodruff,Ballinger,89.9,226.8,136.08,188.24,551.11,Single-ply,SBD,M
Boys,89.81,6,Josh Klingel,Hawley,87.72,226.8,124.74,190.51,542.04,Single-ply,SBD,M
Boys,89.81,DQ,Jacob Lopez,Clyde,88.54,215.46,,,,Single-ply,SBD,M
Boys,89.81,DQ,Marcos Rodarte,San Angelo Grape Creek,88.09,222.26,,,,Single-ply,SBD,M
Boys,89.81,DQ,Ryan Thomas,Rankin,88.18,204.12,,,,Single-ply,SBD,M
Boys,89.81,DQ,Nathaniel Gill,Post,85.18,219.99,120.2,,,Single-ply,SBD,M
Boys,99.79,1,Ramiro Reyes,Colorado City Colorado,97.61,278.96,197.31,263.08,739.36,Single-ply,SBD,M
Boys,99.79,2,Justin Goble,Clyde,93.44,238.14,142.88,238.14,619.15,Single-ply,SBD,M
Boys,99.79,3,Corey Hatcher,Roscoe,99.25,249.48,136.08,233.6,619.15,Single-ply,SBD,M
Boys,99.79,4,Shelton Zarate,Coleman,97.43,242.67,142.88,197.31,582.87,Single-ply,SBD,M
Boys,99.79,5,Charlie Thomas #3,Coleman,96.8,204.12,138.35,233.6,576.06,Single-ply,SBD,M
Boys,99.79,6,Tanner Fannin,Clyde,97.52,219.99,106.59,219.99,546.58,Single-ply,SBD,M
Boys,99.79,7,Kyle Patlan,Sonora,97.98,204.12,138.35,199.58,542.04,Single-ply,SBD,M
Boys,99.79,8,Jeremiah DeLeon,Tahoka,98.52,217.72,124.74,188.24,530.7,Single-ply,SBD,M
Boys,99.79,9,Octavious Ledbetter,Memphis,97.79,226.8,113.4,185.97,526.17,Single-ply,SBD,M
Boys,99.79,10,Oscar Valdez,Clyde,99.16,215.46,111.13,188.24,514.83,Single-ply,SBD,M
Boys,109.77,1,Daniel Montez,Roby,109.41,265.35,183.7,226.8,675.85,Single-ply,SBD,M
Boys,109.77,2,Jordan Stokes,Coahoma,100.33,249.48,129.27,226.8,605.55,Single-ply,SBD,M
Boys,109.77,3,Joseph DeOchoa,Floydada,100.7,219.99,138.35,229.06,587.4,Single-ply,SBD,M
Boys,109.77,4,Caelan Decker,Tahoka,107.41,215.46,149.69,199.58,564.72,Single-ply,SBD,M
Boys,109.77,5,Angel Aguilera,Big Lake Reagan County,106.78,235.87,108.86,217.72,562.45,Single-ply,SBD,M
Boys,109.77,6,Jose Gallegos,Ballinger,103.42,206.38,131.54,215.46,553.38,Single-ply,SBD,M
Boys,109.77,7,Dale Diaz,Post,104.96,238.14,129.27,165.56,532.97,Single-ply,SBD,M
Boys,109.77,DQ,Chris Thomas #5,Slaton,105.23,215.46,,,,Single-ply,SBD,M
Boys,109.77,DQ,Roy Alaniz,Stamford,104.78,208.65,120.2,,,Single-ply,SBD,M
Boys,109.77,DQ,Cole Campbell,Bushland,106.87,176.9,,,,Single-ply,SBD,M
Boys,124.74,1,Ricky Ciuba,Mertzon Irion County,119.93,274.42,170.1,258.55,703.07,Single-ply,SBD,M
Boys,124.74,2,Homero Ramirez,Floydada,117.03,235.87,161.03,242.67,639.57,Single-ply,SBD,M
Boys,124.74,3,Ceasar Rosalez,Seagraves,111.67,260.82,167.83,208.65,637.3,Single-ply,SBD,M
Boys,124.74,4,Riley Woodruff,Ballinger,113.22,260.82,122.47,244.94,628.23,Single-ply,SBD,M
Boys,124.74,5,Riley Braunech,Roby,113.94,249.48,136.08,195.04,580.6,Single-ply,SBD,M
Boys,124.74,6,Tyler Wise,Panhandle,122.2,238.14,127.01,215.46,580.6,Single-ply,SBD,M
Boys,124.74,7,Dustin Fontana,Coahoma,112.76,226.8,136.08,210.92,573.79,Single-ply,SBD,M
Boys,124.74,8,Librado Chavarria,Floydada,114.67,242.67,131.54,190.51,564.72,Single-ply,SBD,M
Boys,124.74,9,Celso Guerrero,Childress,122.2,215.46,138.35,195.04,548.85,Single-ply,SBD,M
Boys,124.74,10,Jimbo Bentley,Childress,116.12,210.92,140.61,190.51,542.04,Single-ply,SBD,M
Boys,124.74+,1,Edgar Guerrero,Friona,128.09,254.01,149.69,251.74,655.44,Single-ply,SBD,M
Boys,124.74+,2,Steven Manahan,McCamey,129.18,249.48,158.76,226.8,635.03,Single-ply,SBD,M
Boys,124.74+,3,Daniel Meza,Friona,166.11,256.28,136.08,204.12,596.47,Single-ply,SBD,M
Boys,124.74+,4,Jansen Fox,Rising Star,132.63,240.4,147.42,197.31,585.13,Single-ply,SBD,M
Boys,124.74+,5,Caleb Wrinkle,Rankin,131.09,217.72,127.01,231.33,576.06,Single-ply,SBD,M
Boys,124.74+,6,Eric Garcia,Lubbock Roosevelt,128.46,222.26,147.42,190.51,560.19,Single-ply,SBD,M
Boys,124.74+,7,Riley Thompson,Sundown,126.64,204.12,131.54,208.65,544.31,Single-ply,SBD,M
Boys,124.74+,8,Conner Willis,Tuscola Jim Ned,127.19,204.12,120.2,219.99,544.31,Single-ply,SBD,M
Boys,124.74+,9,Carlos García,Sunray,125.92,199.58,131.54,185.97,517.1,Single-ply,SBD,M
Boys,124.74+,10,Damien Venegas,McCamey,139.25,183.7,127.01,183.7,494.42,Single-ply,SBD,M
