Name,BodyweightKg,WeightClassKg,BirthYear,Division,Squat1Kg,Squat2Kg,Squat3Kg,Best3SquatKg,Bench1Kg,Bench2Kg,Bench3Kg,Best3BenchKg,Deadlift1Kg,Deadlift2Kg,Deadlift3Kg,Best3DeadliftKg,TotalKg,Place,Event,Equipment,Sex,BirthDate
Demitria Ikonomopoulos,78.9,84,1994,Open,110,117.5,125,125,60,65,-70,65,110,122.5,135,135,325,1,SBD,Raw,F,
Tyler Edmondson,72.1,74,1998,Juniors,187.5,200,-205,200,100,107.5,110,110,-220,220,232.5,232.5,542.5,1,SBD,Raw,M,
Zoraze Khurram,81.9,83,1999,Juniors,160,-175,175,175,95,102.5,-110,102.5,200,220,-227.5,220,497.5,1,SBD,Raw,M,
William Turner #4,127.54,120+,1999,Juniors,125,137.5,155,155,85,95,100,100,125,140,150,150,405,1,SBD,Raw,M,
Kavwa Sichone,73.06,74,1989,Open,240,-250,-250,240,155,167.5,-175,167.5,265,280,-292.5,280,687.5,1,SBD,Raw,M,
Dylan Trueman,72.24,74,1994,Open,150,160,162.5,162.5,110,117.5,-122.5,117.5,200,210,-212.5,210,490,2,SBD,Raw,M,
Amechai Bawden,82.76,83,1996,Open,110,-115,-125,110,72.5,85,-92.5,85,120,135,170,170,365,1,SBD,Raw,M,
Elar Kraav,117.8,120,1987,Open,265,277.5,285,285,160,167.5,172.5,172.5,250,272.5,287.5,287.5,745,1,SBD,Raw,M,
