Division,WeightClassKg,Place,Name,Team,BodyweightKg,Best3SquatKg,Best3BenchKg,Best3DeadliftKg,TotalKg,Equipment,Event,Sex
Boys,51.71,1,Jose Lopez,Kaufman,45.99,120.2,61.23,117.93,299.37,Single-ply,SBD,M
Boys,51.71,2,Christian Cabra,Bishop Lynch,50.62,117.93,61.23,115.67,294.84,Single-ply,SBD,M
Boys,51.71,3,Makai Reyes,Mabank,51.26,92.99,61.23,83.91,238.14,Single-ply,SBD,M
Boys,51.71,4,Jacob Donaldson,North Forney,49.08,86.18,49.9,83.91,219.99,Single-ply,SBD,M
Boys,51.71,5,Johnathan Taylor,Quinlan Ford,45.63,83.91,36.29,95.25,215.46,Single-ply,SBD,M
Boys,51.71,6,Zach Sipes,North Forney,51.17,81.65,47.63,81.65,210.92,Single-ply,SBD,M
Boys,51.71,7,Raleigh Calvert,Sunnyvale,46.72,74.84,29.48,83.91,188.24,Single-ply,SBD,M
Boys,51.71,DQ,Roman Colsten,Commerce,35.92,,,,,Single-ply,SBD,M
Boys,55.79,1,Kevin Cottrell,South Garland,55.79,138.35,74.84,158.76,371.95,Single-ply,SBD,M
Boys,55.79,2,Carl Shehane,Quinlan Ford,55.25,142.88,77.11,122.47,342.46,Single-ply,SBD,M
Boys,55.79,3,Holden Bailey,North Forney,54.7,122.47,65.77,129.27,317.51,Single-ply,SBD,M
Boys,55.79,4,Matthew Hagood,Mabank,52.62,129.27,65.77,113.4,308.44,Single-ply,SBD,M
Boys,55.79,5,Austen Siscoe,Commerce,55.79,106.59,65.77,136.08,308.44,Single-ply,SBD,M
Boys,55.79,6,Will Hooten,Waxahachie Life,55.34,113.4,63.5,108.86,285.76,Single-ply,SBD,M
Boys,55.79,7,Aaron Mixell,Mesquite Poteet,55.34,106.59,56.7,115.67,278.96,Single-ply,SBD,M
Boys,55.79,8,Diego Ultera,Quinlan Ford,55.25,102.06,58.97,104.33,265.35,Single-ply,SBD,M
Boys,59.87,1,Isaiah Payne,Crandall,59.42,199.58,99.79,215.46,514.83,Single-ply,SBD,M
Boys,59.87,2,Nolan Danzinger,North Forney,59.78,181.44,83.91,161.03,426.38,Single-ply,SBD,M
Boys,59.87,3,Garrett Davis,Quinlan Ford,59.87,167.83,86.18,165.56,419.57,Single-ply,SBD,M
Boys,59.87,4,Zaahid Abdullah,Waxahachie Life,59.24,151.95,90.72,165.56,408.23,Single-ply,SBD,M
Boys,59.87,5,Gavin Starks,Mabank,58.42,174.63,83.91,145.15,403.7,Single-ply,SBD,M
Boys,59.87,6,Josh Gorospe,Sunnyvale,58.51,142.88,72.57,165.56,381.02,Single-ply,SBD,M
Boys,59.87,7,Austin Hunt,Royse City,59.87,136.08,77.11,145.15,358.34,Single-ply,SBD,M
Boys,59.87,8,Wanya Robinson,Commerce,59.42,142.88,56.7,147.42,347,Single-ply,SBD,M
Boys,59.87,9,Ethan Lee #1,Sunnyvale,59.42,129.27,72.57,136.08,337.93,Single-ply,SBD,M
Boys,59.87,10,Dakota McGowan,North Forney,57.33,127.01,68.04,129.27,324.32,Single-ply,SBD,M
Boys,59.87,11,Jerod Davis,Mesquite Poteet,56.25,111.13,81.65,122.47,315.25,Single-ply,SBD,M
Boys,59.87,12,Korrighan Smith,Commerce,58.79,124.74,61.23,108.86,294.84,Single-ply,SBD,M
Boys,59.87,13,Chris Calloway,Waxahachie Life,56.61,108.86,72.57,111.13,292.57,Single-ply,SBD,M
Boys,59.87,14,Jonathan Martin,Kaufman,59.78,120.2,56.7,104.33,281.23,Single-ply,SBD,M
Boys,59.87,15,Jesse Ortiz,Quinlan Ford,56.25,86.18,45.36,97.52,229.06,Single-ply,SBD,M
Boys,67.13,1,Brayden Lopez,Commerce,66.22,204.12,124.74,172.37,501.22,Single-ply,SBD,M
Boys,67.13,2,Brock Martin,Argyle,65.77,183.7,88.45,201.85,474,Single-ply,SBD,M
Boys,67.13,3,Clay Conway,Mabank,65.77,188.24,97.52,167.83,453.59,Single-ply,SBD,M
Boys,67.13,4,Darius Jones #1,Dallas Life Oak Cliff,62.69,158.76,83.91,181.44,424.11,Single-ply,SBD,M
Boys,67.13,5,Chance Galbreath,North Mesquite,64.14,129.27,81.65,181.44,392.36,Single-ply,SBD,M
Boys,67.13,6,Evan Wells,Crandall,63.87,147.42,90.72,147.42,385.55,Single-ply,SBD,M
Boys,67.13,7,Ronny Claiborne,Dallas Life Oak Cliff,64.23,136.08,74.84,158.76,369.68,Single-ply,SBD,M
Boys,67.13,8,Lucas Zepeda,Waxahachie Life,66.5,138.35,72.57,149.69,360.61,Single-ply,SBD,M
Boys,67.13,9,Marciano Gonzales,Ferris,64.14,136.08,65.77,136.08,337.93,Single-ply,SBD,M
Boys,67.13,10,Donnie Schultz,Mesquite Poteet,60.51,127.01,86.18,117.93,331.12,Single-ply,SBD,M
Boys,67.13,11,Giovanni Landavardo,Quinlan Ford,61.78,113.4,68.04,136.08,317.51,Single-ply,SBD,M
Boys,67.13,12,Xavier Alverez,Mesquite Horn,66.59,102.06,72.57,124.74,299.37,Single-ply,SBD,M
Boys,67.13,13,Bryant Westmoreland,Mesquite Horn,64.41,99.79,81.65,104.33,285.76,Single-ply,SBD,M
Boys,67.13,14,Marcel Ballard,Mesquite Horn,65.05,106.59,65.77,108.86,281.23,Single-ply,SBD,M
Boys,67.13,DQ,Luke Mock,Bishop Lynch,64.32,83.91,,,,Single-ply,SBD,M
Boys,67.13,DQ,Austin Adams,Forney,60.69,,,,,Single-ply,SBD,M
Boys,74.84,1,Cody Coldwell,Sunnyvale,72.57,226.8,124.74,181.44,532.97,Single-ply,SBD,M
Boys,74.84,2,Isaiah Nies,Ferris,73.39,192.78,102.06,195.04,489.88,Single-ply,SBD,M
Boys,74.84,3,Blake Dalton,Forney,74.12,172.37,106.59,192.78,471.74,Single-ply,SBD,M
Boys,74.84,4,Brayson Yates,Sunnyvale,72.57,172.37,102.06,183.7,458.13,Single-ply,SBD,M
Boys,74.84,5,Jagger Johnson,Forney,73.48,154.22,111.13,181.44,446.79,Single-ply,SBD,M
Boys,74.84,6,Chris Robertson,North Mesquite,69.58,147.42,83.91,210.92,442.25,Single-ply,SBD,M
Boys,74.84,7,Tedarious Herford,Garland Lakeview Cent,69.4,156.49,92.99,183.7,433.18,Single-ply,SBD,M
Boys,74.84,8,Daniel Dunn,North Mesquite,69.4,142.88,92.99,195.04,430.91,Single-ply,SBD,M
Boys,74.84,9,Parker Taylor,Argyle,68.13,165.56,88.45,174.63,428.64,Single-ply,SBD,M
Boys,74.84,10,Kevin Johnson #6,North Mesquite,70.58,136.08,86.18,195.04,417.3,Single-ply,SBD,M
Boys,74.84,11,Mason Ramon,Waxahachie Life,69.31,154.22,74.84,172.37,401.43,Single-ply,SBD,M
Boys,74.84,12,Jack Taylor #3,Bishop Lynch,72.21,154.22,79.38,142.88,376.48,Single-ply,SBD,M
Boys,74.84,13,Daniel Delgado,South Garland,70.67,136.08,90.72,142.88,369.68,Single-ply,SBD,M
Boys,74.84,14,Gabriel Dexter,Forney,69.76,136.08,97.52,129.27,362.87,Single-ply,SBD,M
Boys,74.84,15,Connor Straughn,Commerce,72.03,142.88,74.84,136.08,353.8,Single-ply,SBD,M
Boys,74.84,16,Logan Moffitt,Crandall,68.76,129.27,79.38,140.61,349.27,Single-ply,SBD,M
Boys,74.84,17,Alex Kahn,North Forney,69.58,115.67,74.84,142.88,333.39,Single-ply,SBD,M
Boys,74.84,18,Heath Waffer,Mesquite Horn,73.57,111.13,68.04,136.08,315.25,Single-ply,SBD,M
Boys,74.84,19,Brighton Boles,Bishop Lynch,71.21,104.33,72.57,136.08,312.98,Single-ply,SBD,M
Boys,74.84,20,Christopher Acevedo,Dallas Life Oak Cliff,73.39,104.33,86.18,113.4,303.91,Single-ply,SBD,M
Boys,74.84,21,Kaemen Skinner,Mesquite Horn,68.67,108.86,72.57,117.93,299.37,Single-ply,SBD,M
Boys,74.84,22,Marcus Terry,Dallas Life Oak Cliff,72.12,102.06,74.84,122.47,299.37,Single-ply,SBD,M
Boys,74.84,23,Jisaiah Joseph,Dallas Life Oak Cliff,74.12,92.99,74.84,129.27,297.1,Single-ply,SBD,M
Boys,74.84,24,Stefan Gradinaru,Quinlan Ford,70.67,92.99,68.04,131.54,292.57,Single-ply,SBD,M
Boys,74.84,25,Zacherey Stewart,Forney,73.03,99.79,65.77,113.4,278.96,Single-ply,SBD,M
Boys,74.84,DQ,Chaseon Parks,Mabank,70.4,,,,,Single-ply,SBD,M
Boys,74.84,DQ,Ramone Lee,Dallas Life Oak Cliff,71.94,,,,,Single-ply,SBD,M
Boys,74.84,DQ,James Johnson #11,Duncanville,73.84,,,,,Single-ply,SBD,M
Boys,82.1,1,Calvin Ribera,North Forney,81.28,208.65,102.06,229.06,539.77,Single-ply,SBD,M
Boys,82.1,2,Nick Golden,Argyle,80.2,195.04,92.99,238.14,526.17,Single-ply,SBD,M
Boys,82.1,3,Presley Luce,Bishop Lynch,79.83,179.17,122.47,217.72,519.36,Single-ply,SBD,M
Boys,82.1,4,Cj Presley,Mesquite Poteet,81.92,176.9,99.79,181.44,458.13,Single-ply,SBD,M
Boys,82.1,5,Jacob Profit,Mabank,80.65,174.63,90.72,181.44,446.79,Single-ply,SBD,M
Boys,82.1,6,Shane Carroll,Waxahachie Life,81.65,158.76,104.33,172.37,435.45,Single-ply,SBD,M
Boys,82.1,7,Daylon Hugger,North Mesquite,80.56,142.88,86.18,195.04,424.11,Single-ply,SBD,M
Boys,82.1,8,Adam Kirk,Crandall,78.2,163.29,95.25,163.29,421.84,Single-ply,SBD,M
Boys,82.1,9,Ramiro Mirairio,Mesquite Horn,80.47,158.76,92.99,165.56,417.3,Single-ply,SBD,M
Boys,82.1,10,Jimmy Nguyen,Bishop Lynch,82.1,147.42,72.57,158.76,378.75,Single-ply,SBD,M
Boys,82.1,11,Khanh Tran,Bishop Lynch,81.47,147.42,86.18,142.88,376.48,Single-ply,SBD,M
Boys,82.1,12,Jyvae Hall,South Garland,76.02,124.74,97.52,147.42,369.68,Single-ply,SBD,M
Boys,82.1,13,Thomas Barrington,Crandall,78.38,127.01,74.84,140.61,342.46,Single-ply,SBD,M
Boys,82.1,14,Cody Lyles,Mesquite Horn,80.1,124.74,70.31,147.42,342.46,Single-ply,SBD,M
Boys,82.1,DQ,Jacob Collingsworth,Mabank,80.01,,,,,Single-ply,SBD,M
Boys,89.81,1,Xavier Hughey,Crandall,87.63,222.26,124.74,206.38,553.38,Single-ply,SBD,M
Boys,89.81,2,David Ramirez,Waxahachie Life,87.54,183.7,127.01,195.04,505.76,Single-ply,SBD,M
Boys,89.81,3,Jason Gonzelez,Ferris,88.81,149.69,97.52,176.9,424.11,Single-ply,SBD,M
Boys,89.81,4,Zamarie Mack,Garland Lakeview Cent,89.81,154.22,83.91,185.97,424.11,Single-ply,SBD,M
Boys,89.81,5,Hunter Shaw,Forney,82.74,147.42,86.18,149.69,383.29,Single-ply,SBD,M
Boys,89.81,6,Tim Vickery,Royse City,88.9,136.08,90.72,136.08,362.87,Single-ply,SBD,M
Boys,89.81,DQ,Zayveyon Poole,Duncanville,88.99,183.7,,,,Single-ply,SBD,M
Boys,89.81,DQ,Alex Salinas,Ferris,88.63,,,,,Single-ply,SBD,M
Boys,89.81,DQ,Allen Flores,Dallas Life Oak Cliff,87,,,,,Single-ply,SBD,M
Boys,89.81,DQ,Kegan Richardson,Mabank,87.36,,,,,Single-ply,SBD,M
Boys,89.81,DQ,Matt Castle,Argyle,84.37,,,,,Single-ply,SBD,M
Boys,99.79,1,Quentin Bowes,Commerce,97.98,226.8,140.61,226.8,594.21,Single-ply,SBD,M
Boys,99.79,2,TJ Williams #1,South Garland,99.79,204.12,138.35,226.8,569.26,Single-ply,SBD,M
Boys,99.79,3,Bryan Bunger,Sunnyvale,91.17,206.38,124.74,195.04,526.17,Single-ply,SBD,M
Boys,99.79,4,Jason Molina,Sunnyvale,96.16,195.04,127.01,199.58,521.63,Single-ply,SBD,M
Boys,99.79,5,Keyshon Johnson,Duncanville,96.34,197.31,122.47,192.78,512.56,Single-ply,SBD,M
Boys,99.79,6,Le'Gene Brooks,North Mesquite,92.99,204.12,99.79,192.78,496.68,Single-ply,SBD,M
Boys,99.79,7,Noel Rojo,Mabank,97.43,188.24,113.4,185.97,487.61,Single-ply,SBD,M
Boys,99.79,8,D'Andre Warren,Mesquite Horn,99.43,181.44,102.06,195.04,478.54,Single-ply,SBD,M
Boys,99.79,9,Jordan Patterson #1,North Mesquite,93.44,183.7,108.86,183.7,476.27,Single-ply,SBD,M
Boys,99.79,10,Christian Hoover,Forney,92.17,190.51,120.2,163.29,474,Single-ply,SBD,M
Boys,99.79,11,Wes Wade,Mesquite Poteet,97.7,174.63,92.99,197.31,464.93,Single-ply,SBD,M
Boys,99.79,12,Alex Spera,Sunnyvale,95.25,179.17,102.06,176.9,458.13,Single-ply,SBD,M
Boys,99.79,13,Jaron Gary,Mesquite Poteet,97.52,170.1,106.59,181.44,458.13,Single-ply,SBD,M
Boys,99.79,14,Jp Lopez,Mesquite Poteet,96.16,170.1,104.33,181.44,455.86,Single-ply,SBD,M
Boys,99.79,15,Blake Thomas,Duncanville,93.35,165.56,102.06,183.7,451.32,Single-ply,SBD,M
Boys,99.79,16,Jaylen Smith,Dallas Life Oak Cliff,90.72,149.69,108.86,181.44,439.98,Single-ply,SBD,M
Boys,99.79,17,Quentel Ward,Garland Lakeview Cent,99.25,181.44,92.99,161.03,435.45,Single-ply,SBD,M
Boys,99.79,18,Anthony Bolton,North Mesquite,93.98,147.42,95.25,183.7,426.38,Single-ply,SBD,M
Boys,99.79,19,Pedro Tobar,South Garland,95.89,151.95,99.79,170.1,421.84,Single-ply,SBD,M
Boys,99.79,20,Jd Bunch,Quinlan Ford,90.08,161.03,99.79,158.76,419.57,Single-ply,SBD,M
Boys,99.79,21,Duman Lozano,South Garland,98.88,142.88,99.79,170.1,412.77,Single-ply,SBD,M
Boys,99.79,22,Tyler Hudson,North Forney,96.89,154.22,88.45,149.69,392.36,Single-ply,SBD,M
Boys,99.79,23,Kenneth Randall,Kaufman,92.71,183.7,97.52,99.79,381.02,Single-ply,SBD,M
Boys,99.79,24,Calob Davis,Crandall,96.62,138.35,77.11,122.47,337.93,Single-ply,SBD,M
Boys,99.79,DQ,Matt Pulgarin,Mesquite Horn,93.98,,,,,Single-ply,SBD,M
Boys,99.79,DQ,Jose Diaz #7,Ferris,95.25,138.35,72.57,,,Single-ply,SBD,M
Boys,99.79,DQ,Brendyn Hodges,Duncanville,95.44,204.12,,,,Single-ply,SBD,M
Boys,109.77,1,Jaime Cortez,Royse City,108.41,240.4,122.47,195.04,557.92,Single-ply,SBD,M
Boys,109.77,2,Kenneth Whitfield,North Mesquite,104.05,185.97,108.86,235.87,530.7,Single-ply,SBD,M
Boys,109.77,3,Kolton Stephens,Mabank,108.23,217.72,111.13,192.78,521.63,Single-ply,SBD,M
Boys,109.77,4,Andy Mera,Waxahachie Life,104.6,183.7,140.61,185.97,510.29,Single-ply,SBD,M
Boys,109.77,5,Anthony Frazier,Duncanville,101.51,197.31,113.4,192.78,503.49,Single-ply,SBD,M
Boys,109.77,6,Reuel Barrett,Waxahachie Life,109.59,197.31,108.86,188.24,494.42,Single-ply,SBD,M
Boys,109.77,7,Zach McDaniel,Mesquite Poteet,100.15,176.9,129.27,183.7,489.88,Single-ply,SBD,M
Boys,109.77,8,Rodrick Armstrong,Garland Lakeview Cent,106.87,190.51,102.06,183.7,476.27,Single-ply,SBD,M
Boys,109.77,9,Roy Callender,Ferris,100.15,158.76,108.86,174.63,442.25,Single-ply,SBD,M
Boys,109.77,10,Gage Dillon,Crandall,101.15,181.44,88.45,167.83,437.72,Single-ply,SBD,M
Boys,109.77,11,Moses Guavara,Mesquite Horn,109.41,158.76,97.52,181.44,437.72,Single-ply,SBD,M
Boys,109.77,12,Anthony Cork,Commerce,103.33,142.88,79.38,183.7,405.97,Single-ply,SBD,M
Boys,109.77,13,Justin Hicks,Kaufman,105.51,156.49,81.65,165.56,403.7,Single-ply,SBD,M
Boys,109.77,14,Anthony Peak,Commerce,107.5,142.88,86.18,127.01,356.07,Single-ply,SBD,M
Boys,109.77,15,Jerry Cartmill,Royse City,103.69,124.74,81.65,136.08,342.46,Single-ply,SBD,M
Boys,109.77,DQ,Josh Howell,Ferris,103.6,127.01,88.45,,,Single-ply,SBD,M
Boys,124.74,1,Lazaro Garcia,South Garland,118.84,260.82,149.69,272.16,682.66,Single-ply,SBD,M
Boys,124.74,2,Jp Salas,Sunnyvale,113.4,240.4,113.4,215.46,569.26,Single-ply,SBD,M
Boys,124.74,3,Damijion Jackson,Duncanville,119.93,231.33,131.54,204.12,566.99,Single-ply,SBD,M
Boys,124.74,4,Shelby Wilder,Waxahachie Life,113.58,226.8,117.93,215.46,560.19,Single-ply,SBD,M
Boys,124.74,5,Jaden Webb,Royse City,115.3,213.19,129.27,204.12,546.58,Single-ply,SBD,M
Boys,124.74,6,Grant Fisher,North Forney,110.86,176.9,131.54,199.58,508.02,Single-ply,SBD,M
Boys,124.74,7,Leo Figueroa,Ferris,115.21,217.72,111.13,161.03,489.88,Single-ply,SBD,M
Boys,124.74,8,Justin Lewis,Quinlan Ford,117.12,195.04,113.4,181.44,489.88,Single-ply,SBD,M
Boys,124.74,9,Gage Graham,Mabank,115.21,185.97,136.08,165.56,487.61,Single-ply,SBD,M
Boys,124.74,10,Daltin Long,Mabank,121.02,199.58,124.74,154.22,478.54,Single-ply,SBD,M
Boys,124.74,11,Elian Perea,Kaufman,122.11,174.63,113.4,190.51,478.54,Single-ply,SBD,M
Boys,124.74,12,Morgan Wallace,Forney,124.01,199.58,79.38,188.24,467.2,Single-ply,SBD,M
Boys,124.74,13,Dondre Walker,North Mesquite,115.39,204.12,102.06,158.76,464.93,Single-ply,SBD,M
Boys,124.74,14,Coty Neugin,Crandall,114.85,188.24,102.06,172.37,462.66,Single-ply,SBD,M
Boys,124.74,15,Josh Hernandez,Mesquite Poteet,113.58,174.63,102.06,181.44,458.13,Single-ply,SBD,M
Boys,124.74,16,Hyson Perez,Garland Lakeview Cent,120.38,156.49,115.67,185.97,458.13,Single-ply,SBD,M
Boys,124.74,17,Mark Sanchez,North Mesquite,118.21,170.1,95.25,183.7,449.06,Single-ply,SBD,M
Boys,124.74,18,Aidan Salzman,Bishop Lynch,112.49,170.1,102.06,149.69,421.84,Single-ply,SBD,M
Boys,124.74,19,Nathan Guzman,Ferris,117.48,156.49,88.45,158.76,403.7,Single-ply,SBD,M
Boys,124.74,20,David Rodriguez,Mesquite Poteet,115.94,174.63,90.72,136.08,401.43,Single-ply,SBD,M
Boys,124.74+,1,Terrance Newman,Duncanville,131.72,258.55,142.88,244.94,646.37,Single-ply,SBD,M
Boys,124.74+,2,Kevin Turner #2,Mabank,149.78,238.14,140.61,206.38,585.13,Single-ply,SBD,M
Boys,124.74+,3,Juan Gomez,Ferris,145.42,263.08,99.79,188.24,551.11,Single-ply,SBD,M
Boys,124.74+,4,Jobin Chirayil,Sunnyvale,127.01,190.51,145.15,181.44,517.1,Single-ply,SBD,M
Boys,124.74+,5,Marcus Alexander,Sunnyvale,127.01,183.7,113.4,217.72,514.83,Single-ply,SBD,M
Boys,124.74+,6,Colton Deal,Waxahachie Life,146.15,195.04,106.59,210.92,512.56,Single-ply,SBD,M
Boys,124.74+,7,Dallas Um-Ezoeke,Garland Lakeview Cent,136.53,179.17,102.06,204.12,485.34,Single-ply,SBD,M
Boys,124.74+,8,James Alverez,Mesquite Horn,127.55,181.44,113.4,183.7,478.54,Single-ply,SBD,M
Boys,124.74+,9,Hiram Lawrence,Dallas Life Oak Cliff,141.07,142.88,106.59,226.8,476.27,Single-ply,SBD,M
Boys,124.74+,10,Jacinto Mateo,Quinlan Ford,160.39,181.44,90.72,158.76,430.91,Single-ply,SBD,M
Boys,124.74+,11,Demaree Gay,Crandall,139.07,154.22,81.65,149.69,385.55,Single-ply,SBD,M
Boys,124.74+,12,LaMonte Hawley,Dallas Life Oak Cliff,127.37,133.81,81.65,149.69,365.14,Single-ply,SBD,M
Boys,124.74+,DQ,Jordan Oliver,Duncanville,125.65,170.1,,,,Single-ply,SBD,M
