{
	"schemaVersion": "4",
	"info": {
		"name": "updateBook"
	},
	"parameter": {
		"properties": {
			"params": {
				"type": "object",
				"description": "The parameters from the endpoint."
			},
			"request": {
				"type": "object",
				"description": "The HTTP request."
			},
			"config": {
				"type": "object",
				"description": "The service's configuration"
			},
			"env": {
				"type": "object",
				"description": "The host OS environment"
			}
		},
		"additionalProperties": false,
		"required": [
			"params",
			"request",
			"config",
			"env"
		]
	},
	"start": "http.setresponse.1",
	"nodes": {
		"http.setresponse.1": {
			"type": "nodehandler://axway-flow/http",
			"method": "setresponse",
			"name": "Set HTTP Response",
			"parameters": [
				{
					"name": "status",
					"value": "200",
					"type": "number",
					"metaName": "Status",
					"metaDescription": "The HTTP status code"
				}
			],
			"outputs": {
				"next": {
					"context": "$.response",
					"metaName": "Next"
				}
			},
			"metaMethod": "Set HTTP Response"
		}
	}
}