[
    { "text": "Living Room", "value": "living_room" },
    { "text": "Kitchen", "value": "kitchen" },
    { "text": "Bedroom", "value": "bedroom" },
    { "text": "Bathroom", "value": "bathroom" },
    { "text": "Dining Room", "value": "dining_room" },
    { "text": "Home Office", "value": "home_office" },
    { "text": "Laundry Room", "value": "laundry_room" },
    { "text": "Garage", "value": "garage" },
    { "text": "Attic", "value": "attic" },
    { "text": "Basement", "value": "basement" },
    { "text": "Patio", "value": "patio" },
    { "text": "Garden", "value": "garden" },
    { "text": "Playroom", "value": "playroom" },
    { "text": "Library", "value": "library" },
    { "text": "Gym", "value": "gym" },
    { "text": "Guest Room", "value": "guest_room" },
    { "text": "Study", "value": "study" },
    { "text": "Nursery", "value": "nursery" },
    { "text": "Home Theater", "value": "home_theater" }
]
