[
    {
        "group": "Sensors",
        "items": [
            { 
                "text" : "Humidity",
                "value" : "humidity",
                "unityOfMeasure" : "%"
            },
            {
                "text" : "Temperature",
                "value" : "temperature",
                "unityOfMeasure" : "°C"
            },
            {
                "text": "P2.5",
                "value": "P2",
                "unityOfMeasure": "μg/m³"
            },
            {
                "text": "PM10",
                "value": "P1",
                "unityOfMeasure": "μg/m³"
            }
        ]
    },
    {
        "group": "House Appliances",
        "items":[
            {
                "text": "Smart Plug Devices",
                "value": "smart_plug",
                "consumption": {
                    "min": 5,
                    "max": 5,
                    "unit": "Wh (standby)"
                }
            },
            {
                "text": "3D Printer",
                "value": "3d_printer",
                "consumption": {
                    "min": 300,
                    "max": 500,
                    "unit": "Wh/h (printing)"
                }
            },
            {
                "text": "Air Conditioner",
                "value": "air_conditioner",
                "consumption": {
                    "min": 1000,
                    "max": 5000,
                    "unit": "Wh/h (cooling)"
                }
            },
            {
                "text": "Air Purifier",
                "value": "air_purifier",
                "consumption": {
                    "min": 30,
                    "max": 200,
                    "unit": "Wh/h (operation)"
                }
            },
            {
                "text": "Boiler",
                "value": "boiler",
                "consumption": {
                    "min": 2000,
                    "max": 4000,
                    "unit": "Wh (daily)"
                }
            },
            {
                "text": "Coffee",
                "value": "coffee",
                "consumption": {
                    "min": 500,
                    "max": 1000,
                    "unit": "Wh/h (operation)"
                }
            },
            {
                "text": "Computer",
                "value": "computer",
                "consumption": {
                    "min": 60,
                    "max": 300,
                    "unit": "Wh/h (usage)"
                }
            },
            {
                "text": "Dehumidifier",
                "value": "dehumidifier",
                "consumption": {
                    "min": 300,
                    "max": 700,
                    "unit": "Wh/h (operation)"
                }
            },
            {
                "text": "Dryer",
                "value": "dryer",
                "consumption": {
                    "min": 2000,
                    "max": 5000,
                    "unit": "Wh/load"
                }
            },
            {
                "text": "Fan",
                "value": "fan",
                "consumption": {
                    "min": 30,
                    "max": 75,
                    "unit": "Wh/h (operation)"
                }
            },
            {
                "text": "Freezer",
                "value": "freezer",
                "consumption": {
                    "min": 150,
                    "max": 400,
                    "unit": "Wh/day"
                }
            },
            {
                "text": "Fridge",
                "value": "fridge",
                "consumption": {
                    "min": 100,
                    "max": 800,
                    "unit": "Wh/day"
                }
            },
            {
                "text": "Internet Router",
                "value": "router",
                "consumption": {
                    "min": 5,
                    "max": 15,
                    "unit": "Wh"
                }
            },
            {
                "text": "Laptop",
                "value": "laptop",
                "consumption": {
                    "min": 20,
                    "max": 60,
                    "unit": "Wh/h (usage)"
                }
            },
            {
                "text": "Light",
                "value": "light",
                "consumption": {
                    "min": 20,
                    "max": 60,
                    "unit": "Wh/h (usage)"
                }
            },
            {
                "text": "Microwave",
                "value": "microwave",
                "consumption": {
                    "min": 1000,
                    "max": 2000,
                    "unit": "Wh/h (usage)"
                }
            },
            {
                "text": "Phone Charger",
                "value": "phone_charger",
                "consumption": {
                    "min": 5,
                    "max": 10,
                    "unit": "Wh"
                }
            },
            {
                "text": "Printer",
                "value": "printer",
                "consumption": {
                    "min": 30,
                    "max": 60,
                    "unit": "Wh/h (printing)"
                }
            },
            {
                "text": "Radiator",
                "value": "radiator",
                "consumption": {
                    "min": 500,
                    "max": 2000,
                    "unit": "Wh/h (operation)"
                }
            },
            {
                "text": "Screen",
                "value": "screen",
                "consumption": {
                    "min": 30,
                    "max": 200,
                    "unit": "Wh/h (usage)"
                }
            },
            {
                "text": "Sound System",
                "value": "sound_system",
                "consumption": {
                    "min": 50,
                    "max": 500,
                    "unit": "Wh/h (usage)"
                }
            },
            {
                "text": "TV",
                "value": "tv",
                "consumption": {
                    "min": 30,
                    "max": 250,
                    "unit": "Wh/h (usage)"
                }
            },
            {
                "text": "Vacuum",
                "value": "vacuum",
                "consumption": {
                    "min": 300,
                    "max": 1500,
                    "unit": "Wh/h (operation)"
                }
            },
            {
                "text": "Washing Machine",
                "value": "washing_machine",
                "consumption": {
                    "min": 500,
                    "max": 2000,
                    "unit": "Wh/load"
                }
            }
        ]
    }
]