<svg xmlns="http://www.w3.org/2000/svg" width="155" height="141" viewBox="0 0 155 141">
    <g fill="none" fill-rule="evenodd">
        <g>
            <path stroke="#BFCAD5" stroke-width="6.4" d="M15.98 73.705c0 34.511 27.9 62.488 62.319 62.488"/>
            <path fill="#B2BAC8" fill-rule="nonzero" d="M127.024 90.143l9.6.158V52.416c0-27.179-27.319-49.211-59.124-49.211-31.805 0-59.124 22.032-59.124 49.21v35.93h9.6v-35.93c0-21.18 22.362-39.61 49.524-39.61 27.162 0 49.524 18.43 49.524 39.61v37.728z"/>
            <path fill="#4A5261" fill-rule="nonzero" d="M108.701 27.137c-8.317-5.399-19.133-8.748-31.201-8.748-11.127 0-22.8 3.925-29.767 8.748-13.356 9.244-26.999-3.593-12.799-13.501C46.407 5.63 61.267.8 77.5.8c15.161 0 29.124 4.213 40.249 11.29 15.53 9.881 1.467 21.872-9.048 15.046z"/>
            <g transform="translate(0 56.08)">
                <rect width="22.371" height="36.852" y="9.614" fill="#5A8F23" rx="6.4"/>
                <rect width="20.773" height="54.477" x="7.99" fill="#6FAC2F" rx="6.4"/>
            </g>
            <g transform="matrix(-1 0 0 1 155 56.08)">
                <rect width="22.371" height="36.852" y="9.614" fill="#5A8F23" rx="6.4"/>
                <rect width="20.773" height="54.477" x="7.99" fill="#6FAC2F" rx="6.4"/>
            </g>
            <rect width="35.155" height="12.818" x="60.722" y="128.182" fill="#6FAC2F" rx="6.409"/>
        </g>
        <path fill="#4A5261" d="M42.219 70.186c.024-1.678.146-3.208.365-4.59.219-1.383.632-2.564 1.24-3.543.608-.979 1.46-1.732 2.554-2.26 1.094-.529 2.529-.793 4.304-.793 1.703 0 3.09.233 4.16.7 1.07.465 1.914 1.11 2.535 1.933.62.824 1.045 1.78 1.276 2.867.231 1.088.347 2.253.347 3.496 0 2.237-.292 4.117-.876 5.64a15.947 15.947 0 0 1-2.334 4.148l-4.013 4.987c-.292.373-.614.793-.967 1.259-.353.466-.59.947-.711 1.445H59V92H42c0-2.33.274-4.529.82-6.595.548-2.067 1.563-4.079 3.047-6.036l4.524-5.873c.656-.84 1.124-1.64 1.404-2.4.28-.762.42-1.764.42-3.007 0-1.398-.158-2.362-.475-2.89-.316-.528-.741-.792-1.276-.792-.244 0-.475.054-.694.163-.218.109-.42.318-.602.63-.182.31-.328.753-.437 1.328-.11.574-.164 1.328-.164 2.26v1.398h-6.348zM62 79.458L70.262 60h7.451v19.735H80v6.179h-2.287V92h-6.418v-6.086H62v-6.456zM71 79V68h-.068L67 79h4zm17.99-21H93l-6.07 34H83l5.99-34zM96 60h17v6.41a53.434 53.434 0 0 0-2.52 5.832 76.005 76.005 0 0 0-2.061 6.525 72.793 72.793 0 0 0-1.472 6.755 60.926 60.926 0 0 0-.754 6.478h-7.065a67.39 67.39 0 0 1 .846-6.41 69.02 69.02 0 0 1 1.49-6.478 58.572 58.572 0 0 1 2.153-6.27 45.742 45.742 0 0 1 2.87-5.833H96V60z"/>
    </g>
</svg>
